{
    "name": "igbvc devcontainer kubernetes",
    "id": "kubernetes",
    "version": "0.1.0",
    "description": "A feature to install a slim development kubernetes",
    "dependsOn": {
        "ghcr.io/devcontainers/features/docker-in-docker:2":{},
        "ghcr.io/rio/features/k3d:1":{}
    },
    "options": {
    },
    "installsAfter": [
        "ghcr.io/devcontainers/features/docker-in-docker",
        "ghcr.io/rio/features/k3d"
    ]
}
