<?xml version="1.0" encoding="utf-8"?>
<!-- Generator: Adobe Illustrator 26.0.1, SVG Export Plug-In . SVG Version: 6.00 Build 0)  -->
<svg version="1.1" id="Capa_1" xmlns="http://www.w3.org/2000/svg" xmlns:xlink="http://www.w3.org/1999/xlink" x="0px" y="0px"
	 width="512px" height="512px" viewBox="0 0 512 512" style="enable-background:new 0 0 512 512;" xml:space="preserve">
<style type="text/css">
	.st0{fill:#1E81A2;}
</style>
<g>
	<path class="st0" d="M256,0C167.6,0,96,71.6,96,160c0,24.8,5.6,48.2,15.7,69.1c40.1,84.7,21.8,42.8,144.3,282.9l142.6-279.4
		c11.1-21.8,17.4-46.5,17.4-72.6C416,71.6,344.4,0,256,0z M256,256c-53,0-96-43-96-96s43-96,96-96c53,0,96,43,96,96S309,256,256,256
		z"/>
</g>
<path d="M248.9,124.6h14.2v14.2h-14.2V124.6z M248.9,152.9h14.2v42.5h-14.2V152.9z M256,89.2c-39.1,0-70.8,31.7-70.8,70.8
	s31.7,70.8,70.8,70.8s70.8-31.7,70.8-70.8S295.1,89.2,256,89.2z M256,216.6c-31.2,0-56.6-25.4-56.6-56.6s25.4-56.6,56.6-56.6
	s56.6,25.4,56.6,56.6S287.2,216.6,256,216.6z"/>
</svg>
