{
  "dc": {
    "id": "dc",
    "label": "dc",
    "default": true,
    "spaces": {
      "dc-release": {
        "label": "dc-release",
        "hasRangeHeader": true,
        "supportsReferencePartial": true,
        "supportsPostLongRequests": true,
        "hasLastNObservations": false,
        "url": "https://daten.uba.de/release/rest",
        "urlv3": "https://daten.uba.de/release/rest/v2",
        "headers": {
          "data": {
            "json": "application/vnd.sdmx.data+json;version=2.0"
          }
        }
      },
      "dc-design": {
        "label": "dc-design",
        "hasRangeHeader": true,
        "supportsReferencePartial": true,
        "supportsPostLongRequests": true,
        "hasLastNObservations": true,
        "url": "https://daten.uba.de/design/rest",
        "urlv3": "https://daten.uba.de/design/rest/v2",
        "headers": {
          "data": {
            "json": "application/vnd.sdmx.data+json;version=2.0"
          }
        }
      }
    },
    "datasources": {
      "ds-dc-release": {
        "dataSpaceId": "dc-release",
        "indexed": true,
        "dataqueries": [
          {
            "version": "1.0",
            "categorySchemeId": "UBA_Categories",
            "agencyId": "UBA"
          }
        ]
      },
      "ds-dc-design": {
        "dataSpaceId": "dc-design",
        "indexed": true,
        "dataqueries": [
        ]
      }
    },
    "scopes": {
      "dlm": {
        "type": "dlm",
        "label": "dlm",
        "oidc": {
          "authority": "https://kc.daten.uba.de/realms/dctest",
          "client_id": "stat-suite"
        },
        "spaces": [
          {
            "id": "dc-release",
            "color": "white",
            "backgroundColor": "#606A80",
            "label": "dc-release",
            "transferUrl": "https://daten.uba.de/transfer/2",
            "dataExplorerUrl": "https://datacube.uba.de"
          },
          {
            "id": "dc-design",
            "color": "white",
            "backgroundColor": "#735667",
            "label": "dc-design",
            "transferUrl": "https://daten.uba.de/transfer/2",
            "dataExplorerUrl": "https://datacube.uba.de"
          }
        ]
      },
      "de": {
        "type": "de",
        "label": "de",
        "oidc": {
          "authority": "https://kc.daten.uba.de/realms/dctest",
          "authority_aliases": [],
          "client_id": "stat-suite",
          "required": false
        },
        "spaces": [
          "dc-release",
          "dc-design"
        ],
        "datasources": [
          "ds-dc-release",
          "ds-dc-design"
        ]
      }
    }
  }
}
