{
    "openapi": "3.0.1",
    "info": {
      "title": "Transfer service",
      "description": "The .Stat Suite Core Transfer service provides a .Stat Core data storage API for: \n                    <ul>\n                        <li>Upload of SDMX data and/or referential metadata files (csv, xml) into a .Stat Core data storage.</li>\n                        <li>Upload of Excel data and/or referential metadata files (using a specific data mapping definition) into a .Stat Core data storage.</li>\n                        <li>Transfer of data and/or referential metadata between two .Stat Core data storages.</li>\n                    </ul>\n                    <br>See the <a href='https://gitlab.com/sis-cc/.stat-suite/dotstatsuite-core-transfer/-/tree/master'>full API documentation</a> and the <a href='https://sis-cc.gitlab.io/dotstatsuite-documentation/using-api/'>functional specifications of the .Stat Suite APIs</a>.",
      "license": {
        "name": "MIT License",
        "url": "https://gitlab.com/sis-cc/.stat-suite/dotstatsuite-core-transfer/-/blob/master/LICENSE"
      },
      "version": "3"
    },
    "servers": [
        {
            "description": "UBA Data Cube ",
            "url": "https://daten.uba.de/transfer"
        }
    ],
    "paths": {
      "/3/cleanup/orphans": {
        "delete": {
          "tags": [
            "CleanUp"
          ],
          "summary": "Delete all Data DB entries of orphan DSDs and its linked MSDs in the data database for a given dataspace",
          "description": "Example: Delete all orphan DSDs and its linked MSDs in the dataspace 'design'\r\n\r\n    DELETE /cleanup/orphans\r\n    {\r\n       \"dataspace\": \"design\"\r\n    }",
          "requestBody": {
            "content": {
              "multipart/form-data": {
                "schema": {
                  "required": [
                    "dataspace"
                  ],
                  "type": "object",
                  "properties": {
                    "dataspace": {
                      "type": "string",
                      "description": "The ID of the dataspace where the orphan DSDs should be removed. <br></br> Example: <code>design</code>"
                    },
                    "sendEmail": {
                      "enum": [
                        0,
                        1,
                        2
                      ],
                      "type": "integer",
                      "description": "Send email options:  Always (0), Never (1), IfError (2), default (Always)",
                      "format": "int32",
                      "default": 0
                    }
                  }
                },
                "encoding": {
                  "dataspace": {
                    "style": "form"
                  },
                  "sendEmail": {
                    "style": "form"
                  }
                }
              }
            }
          },
          "responses": {
            "200": {
              "description": "Cleanup succeeded",
              "content": {
                "application/json": {
                  "schema": {
                    "$ref": "#/components/schemas/OperationResult"
                  }
                }
              }
            },
            "400": {
              "description": "Data database version is incompatible, Validation or Internal error",
              "content": {
                "application/json": {
                  "schema": {
                    "$ref": "#/components/schemas/OperationResult"
                  }
                }
              }
            },
            "401": {
              "description": "Unauthorized",
              "content": {
                "application/json": {
                  "schema": {
                    "$ref": "#/components/schemas/ProblemDetails"
                  }
                }
              }
            },
            "403": {
              "description": "Forbidden",
              "content": {
                "application/json": {
                  "schema": {
                    "$ref": "#/components/schemas/ProblemDetails"
                  }
                }
              }
            },
            "409": {
              "description": "Conflict. There is an ongoing transaction for a DSD"
            },
            "207": {
              "description": "Multi-Status, containing http status codes 200 and 409"
            }
          }
        }
      },
      "/3/cleanup/dsd": {
        "delete": {
          "tags": [
            "CleanUp"
          ],
          "summary": "Delete a given DSD and all its child artefacts or only its linked MSD, from the data database, and for a given dataspace",
          "description": "Example: Delete the DSD 'OECD:MEI(1.0)' and all its child artefacts from the 'design' dataspace\r\n\r\n    DELETE /cleanup/dsd\r\n    {\r\n       \"dataspace\": \"design\",\r\n       \"dsd\": \"OECD:MEI(1.0)\"\r\n    }",
          "requestBody": {
            "content": {
              "multipart/form-data": {
                "schema": {
                  "required": [
                    "dataspace",
                    "dsd"
                  ],
                  "type": "object",
                  "properties": {
                    "dataspace": {
                      "type": "string",
                      "description": "The ID of the dataspace where the DSD should be cleaned. <br></br> Example: <code>design</code>"
                    },
                    "dsd": {
                      "type": "string",
                      "description": "The SDMX ID of the DSD to be deleted <br></br> Format: 'AGENCYID:DSD ID(VERSION)' <br></br> Example: <code>OECD:MEI(1.0)</code>"
                    },
                    "cleanupMsdOnly": {
                      "type": "boolean",
                      "description": "Optional - Indicate if <b>only</b> the linked MSD should be cleaned. By default, it is set to false.",
                      "default": false,
                      "nullable": true
                    }
                  }
                },
                "encoding": {
                  "dataspace": {
                    "style": "form"
                  },
                  "dsd": {
                    "style": "form"
                  },
                  "cleanupMsdOnly": {
                    "style": "form"
                  }
                }
              }
            }
          },
          "responses": {
            "200": {
              "description": "Cleanup succeeded",
              "content": {
                "application/json": {
                  "schema": {
                    "$ref": "#/components/schemas/OperationResult"
                  }
                }
              }
            },
            "400": {
              "description": "Data database version is incompatible, Validation or Internal error",
              "content": {
                "application/json": {
                  "schema": {
                    "$ref": "#/components/schemas/OperationResult"
                  }
                }
              }
            },
            "401": {
              "description": "Unauthorized",
              "content": {
                "application/json": {
                  "schema": {
                    "$ref": "#/components/schemas/ProblemDetails"
                  }
                }
              }
            },
            "403": {
              "description": "Forbidden",
              "content": {
                "application/json": {
                  "schema": {
                    "$ref": "#/components/schemas/ProblemDetails"
                  }
                }
              }
            },
            "409": {
              "description": "Conflict. There is an ongoing transaction targeting the DSD"
            }
          }
        }
      },
      "/3/cleanup/mappingsets": {
        "delete": {
          "tags": [
            "CleanUp"
          ],
          "summary": "Delete all mappingsets and datasets stored in the Mapping Store DB for a given dataflow and a given dataspace",
          "description": "Example: Delete the mappingsets of the dataflow 'OECD:DF_MEI(1.0)' in the 'design' dataspace\r\n\r\n    DELETE /cleanup/mappingsets\r\n    {\r\n       \"dataspace\": \"design\",\r\n       \"dataflow\": \"OECD:DF_MEI(1.0)\"\r\n    }",
          "requestBody": {
            "content": {
              "multipart/form-data": {
                "schema": {
                  "required": [
                    "dataflow",
                    "dataspace"
                  ],
                  "type": "object",
                  "properties": {
                    "dataspace": {
                      "type": "string",
                      "description": "The ID of the dataspace where the mappingsets should be cleaned. <br></br> Example: <code>design</code>"
                    },
                    "dataflow": {
                      "type": "string",
                      "description": "The SDMX ID of the dataflow for which the mappingsets should be deleted <br></br> Format: 'AGENCYID:DATAFLOWID(VERSION)' <br></br> Example: <code>OECD:DF_MEI(1.0)</code>"
                    }
                  }
                },
                "encoding": {
                  "dataspace": {
                    "style": "form"
                  },
                  "dataflow": {
                    "style": "form"
                  }
                }
              }
            }
          },
          "responses": {
            "200": {
              "description": "Cleanup succeeded",
              "content": {
                "application/json": {
                  "schema": {
                    "$ref": "#/components/schemas/OperationResult"
                  }
                }
              }
            },
            "400": {
              "description": "Data database version is incompatible, Validation or Internal error",
              "content": {
                "application/json": {
                  "schema": {
                    "$ref": "#/components/schemas/OperationResult"
                  }
                }
              }
            },
            "401": {
              "description": "Unauthorized",
              "content": {
                "application/json": {
                  "schema": {
                    "$ref": "#/components/schemas/ProblemDetails"
                  }
                }
              }
            },
            "403": {
              "description": "Forbidden",
              "content": {
                "application/json": {
                  "schema": {
                    "$ref": "#/components/schemas/ProblemDetails"
                  }
                }
              }
            },
            "409": {
              "description": "Conflict. There is an ongoing transaction targeting the DSD"
            }
          }
        }
      },
      "/3/init/dataflow": {
        "post": {
          "tags": [
            "DataManagement"
          ],
          "summary": "Initialise or repair DB objects of a dataflow in a given datastore DB (creates all Data DB objects - or repair missing/broken structures - required for the dataflow usage for extractions, and generates an empty actual content constraint for the dataflow)",
          "description": "Example: Initialise the database objects of the dataflow 'OECD:MEI(1.0)' in the 'design' dataspace\r\n\r\n    POST /init/dataflow\r\n    {\r\n       \"dataspace\": \"design\",\r\n       \"dataflow\": \"OECD:DF_MEI(1.0)\"\r\n    }",
          "requestBody": {
            "content": {
              "multipart/form-data": {
                "schema": {
                  "required": [
                    "dataflow",
                    "dataspace"
                  ],
                  "type": "object",
                  "properties": {
                    "dataspace": {
                      "type": "string",
                      "description": "The ID of the dataspace where to initialize the db objects. <br></br> Example: <code>design</code>"
                    },
                    "dataflow": {
                      "type": "string",
                      "description": "The SDMX ID of the dataflow.<br></br> Format: 'AGENCYID:DATAFLOWID(VERSION)'. <br></br> Example: <code>OECD:DF_MEI(1.0)</code>"
                    }
                  }
                },
                "encoding": {
                  "dataspace": {
                    "style": "form"
                  },
                  "dataflow": {
                    "style": "form"
                  }
                }
              }
            }
          },
          "responses": {
            "200": {
              "description": "Success",
              "content": {
                "application/json": {
                  "schema": {
                    "$ref": "#/components/schemas/OperationResult"
                  }
                }
              }
            },
            "400": {
              "description": "Data database version is incompatible, Validation or Internal error",
              "content": {
                "application/json": {
                  "schema": {
                    "$ref": "#/components/schemas/OperationResult"
                  }
                }
              }
            },
            "401": {
              "description": "Not authorized.",
              "content": {
                "application/json": {
                  "schema": {
                    "$ref": "#/components/schemas/ProblemDetails"
                  }
                }
              }
            },
            "403": {
              "description": "Forbidden",
              "content": {
                "application/json": {
                  "schema": {
                    "$ref": "#/components/schemas/ProblemDetails"
                  }
                }
              }
            },
            "201": {
              "description": "Initialisation or repair successfully completed"
            },
            "409": {
              "description": "Conflict. There is an ongoing transaction targeting the DSD of the dataflow"
            }
          }
        }
      },
      "/3/init/allMappingsets": {
        "post": {
          "tags": [
            "DataManagement"
          ],
          "summary": "Create Mappingsets of all dataflows in the mappingstore database for a given dataspace",
          "description": "Example: Create mappingsets for all dataflows found in the 'design' dataspace\r\n\r\n    POST /init/allMappingsets\r\n    {\r\n       \"dataspace\": \"design\"\r\n    }",
          "requestBody": {
            "content": {
              "multipart/form-data": {
                "schema": {
                  "required": [
                    "dataspace"
                  ],
                  "type": "object",
                  "properties": {
                    "dataspace": {
                      "type": "string",
                      "description": "The ID of the dataspace where to initialise the mappingsets. <br></br> Example: <code>design</code>"
                    },
                    "sendEmail": {
                      "enum": [
                        0,
                        1,
                        2
                      ],
                      "type": "integer",
                      "description": "Send email options:  Always (0), Never (1), IfError (2), default (Always)",
                      "format": "int32",
                      "default": 0
                    }
                  }
                },
                "encoding": {
                  "dataspace": {
                    "style": "form"
                  },
                  "sendEmail": {
                    "style": "form"
                  }
                }
              }
            }
          },
          "responses": {
            "200": {
              "description": "Successfully completed",
              "content": {
                "application/json": {
                  "schema": {
                    "$ref": "#/components/schemas/OperationResult"
                  }
                }
              }
            },
            "400": {
              "description": "Data database version is incompatible, Validation or Internal error",
              "content": {
                "application/json": {
                  "schema": {
                    "$ref": "#/components/schemas/OperationResult"
                  }
                }
              }
            },
            "401": {
              "description": "Not authorized.",
              "content": {
                "application/json": {
                  "schema": {
                    "$ref": "#/components/schemas/ProblemDetails"
                  }
                }
              }
            },
            "403": {
              "description": "Forbidden",
              "content": {
                "application/json": {
                  "schema": {
                    "$ref": "#/components/schemas/ProblemDetails"
                  }
                }
              }
            }
          }
        }
      },
      "/3/tune/dsd": {
        "post": {
          "tags": [
            "DataManagement"
          ],
          "summary": "Apply a specific type of index to tune the performance of the DSD tables storing the data and referential metadata for a given dataspace",
          "description": "Example: Tune the DSD 'OECD:MEI(1.0)' with index type 'CLUSTERED_COLUMNSTORE' in the 'design' dataspace\r\n\r\n    POST /tune/dsd\r\n    {\r\n       \"dataspace\": \"design\",\r\n       \"dsd\": \"OECD:MEI(1.0)\",\r\n       \"indexType\": 2\r\n    }",
          "requestBody": {
            "content": {
              "multipart/form-data": {
                "schema": {
                  "required": [
                    "dataspace",
                    "dsd",
                    "indexType"
                  ],
                  "type": "object",
                  "properties": {
                    "dataspace": {
                      "type": "string",
                      "description": "The ID of the dataspace where to tune the DSD. <br></br> Example: <code>design</code>"
                    },
                    "dsd": {
                      "type": "string",
                      "description": "The SDMX ID of the DSD to be tuned <br></br> Format: 'AGENCYID:DSD ID(VERSION)' <br></br> Example: <code>OECD:MEI(1.0)</code>"
                    },
                    "indexType": {
                      "enum": [
                        2,
                        3
                      ],
                      "type": "integer",
                      "description": "The type of index to be applied to the DSD:  <br></br> indexType Options <br></br><b> - CLUSTERED_COLUMNSTORE (2)</b> - Improves performance for data extractions for DSDs with millions of observations.<br></br><b>- CLUSTERED_COLUMNSTORE_ARCHIVE (3)</b> - High compression of data to save disk space; Makes data imports and exports slower.",
                      "format": "int32"
                    }
                  }
                },
                "encoding": {
                  "dataspace": {
                    "style": "form"
                  },
                  "dsd": {
                    "style": "form"
                  },
                  "indexType": {
                    "style": "form"
                  }
                }
              }
            }
          },
          "responses": {
            "200": {
              "description": "Successfully completed",
              "content": {
                "application/json": {
                  "schema": {
                    "$ref": "#/components/schemas/OperationResult"
                  }
                }
              }
            },
            "400": {
              "description": "Data database version is incompatible, Validation or Internal error",
              "content": {
                "application/json": {
                  "schema": {
                    "$ref": "#/components/schemas/OperationResult"
                  }
                }
              }
            },
            "401": {
              "description": "Unauthorized",
              "content": {
                "application/json": {
                  "schema": {
                    "$ref": "#/components/schemas/ProblemDetails"
                  }
                }
              }
            },
            "403": {
              "description": "Not authorized.",
              "content": {
                "application/json": {
                  "schema": {
                    "$ref": "#/components/schemas/ProblemDetails"
                  }
                }
              }
            },
            "404": {
              "description": "Not found."
            }
          }
        }
      },
      "/3/tune/info": {
        "post": {
          "tags": [
            "DataManagement"
          ],
          "summary": "Get the indexType information currently applied for the DSD tables storing the data and referential metadata for a given dataspace",
          "description": "Example: Get the index type information for the DSD 'OECD:MEI(1.0)', found in the 'design' dataspace\r\n\r\n    POST /tune/info\r\n    {\r\n       \"dataspace\": \"design\",\r\n       \"dsd\": \"OECD:MEI(1.0)\"\r\n    }",
          "requestBody": {
            "content": {
              "multipart/form-data": {
                "schema": {
                  "required": [
                    "dataspace",
                    "dsd"
                  ],
                  "type": "object",
                  "properties": {
                    "dataspace": {
                      "type": "string",
                      "description": "The ID of the dataspace where to tune the DSD. <br></br> Example: <code>design</code>"
                    },
                    "dsd": {
                      "type": "string",
                      "description": "The SDMX ID of the DSD to be tuned <br></br> Format: 'AGENCYID:DSD ID(VERSION)' <br></br> Example: <code>OECD:MEI(1.0)</code>"
                    }
                  }
                },
                "encoding": {
                  "dataspace": {
                    "style": "form"
                  },
                  "dsd": {
                    "style": "form"
                  }
                }
              }
            }
          },
          "responses": {
            "200": {
              "description": "Successfully completed",
              "content": {
                "application/json": {
                  "schema": {
                    "$ref": "#/components/schemas/OperationResult"
                  }
                }
              }
            },
            "400": {
              "description": "Data database version is incompatible, Validation or Internal error",
              "content": {
                "application/json": {
                  "schema": {
                    "$ref": "#/components/schemas/OperationResult"
                  }
                }
              }
            },
            "401": {
              "description": "Unauthorized",
              "content": {
                "application/json": {
                  "schema": {
                    "$ref": "#/components/schemas/ProblemDetails"
                  }
                }
              }
            },
            "403": {
              "description": "Not authorized.",
              "content": {
                "application/json": {
                  "schema": {
                    "$ref": "#/components/schemas/ProblemDetails"
                  }
                }
              }
            },
            "404": {
              "description": "Not found."
            }
          }
        }
      },
      "/3/import/excel": {
        "post": {
          "tags": [
            "Import"
          ],
          "summary": "Submit an import request of data or referential metadata from EDD + Excel files into provided dataspace",
          "description": "Example: Advance validation import to the 'design' dataspace, using the eddFile 'importexample_EDD.xml' and the Excel file 'dataexample.xlsx'\r\n\r\n    POST /import/excel\r\n    {\r\n       \"dataspace\": \"design\",\r\n       \"eddFile\": \"importexample_EDD.xml\", \r\n       \"excelFile\": \"dataexample.xlsx\",\r\n       \"validationType\": 1\r\n    }",
          "requestBody": {
            "content": {
              "multipart/form-data": {
                "schema": {
                  "required": [
                    "dataspace",
                    "eddFile",
                    "excelFile"
                  ],
                  "type": "object",
                  "properties": {
                    "dataspace": {
                      "type": "string",
                      "description": "The ID of the dataspace to where the values will be stored/validated. <br></br> Example: <code>design</code>"
                    },
                    "lang": {
                      "type": "string",
                      "description": "Optional - Two letter (ISO Alpha-2) language code to produce the response message/email<br></br>Example: <code>en</code>",
                      "nullable": true
                    },
                    "eddFile": {
                      "type": "string",
                      "description": "A XML edd file containing the description of the Excel file to be imported. <br></br>A maximum size file limit might apply",
                      "format": "binary"
                    },
                    "excelFile": {
                      "type": "string",
                      "description": "An Excel file containing the data/referential metadata values to be imported. <br></br>A maximum size file limit might apply",
                      "format": "binary"
                    },
                    "targetVersion": {
                      "enum": [
                        0,
                        1
                      ],
                      "type": "integer",
                      "description": "Optional - The target version of the data and referential metadata to be used during the import/validation. <br></br>Possible values: Live (0), Point in Time PIT (1), Default (Live)",
                      "format": "int32",
                      "nullable": true
                    },
                    "sendEmail": {
                      "enum": [
                        0,
                        1,
                        2
                      ],
                      "type": "integer",
                      "description": "Optional - Indicate when the service should send email. <br></br>Possible values: Always (0), Never (1), IfError (2), default (Always)",
                      "format": "int32",
                      "nullable": true
                    },
                    "PITReleaseDate": {
                      "type": "string",
                      "description": "Optional - Point in time release date <br></br> Format (YYYY-MM-DDThh:mm:ss.sTZD) <br></br>Example: <code>2022-06-04T10:16:01</code>, <code>2022-06-04T08:16:01Z</code>, <code>2022-06-04T10:16:01+02:00</code>, <code>2022-06-04T10:16:01.021+02:00</code>",
                      "nullable": true
                    },
                    "restorationOptionRequired": {
                      "type": "boolean",
                      "description": "Optional - Indicate if the current LIVE version should be kept for restoration purposes when PIT release becomes active",
                      "nullable": true
                    },
                    "validationType": {
                      "enum": [
                        0,
                        1
                      ],
                      "type": "integer",
                      "description": "Optional - The type of validation to use during import:  <br></br>Possible values: Import With <b>Basic Validation (0)</b>, Import With <b>Advanced Validation (1)</b>, Default (Import With Basic Validation)",
                      "format": "int32",
                      "nullable": true
                    }
                  }
                },
                "encoding": {
                  "dataspace": {
                    "style": "form"
                  },
                  "lang": {
                    "style": "form"
                  },
                  "eddFile": {
                    "style": "form"
                  },
                  "excelFile": {
                    "style": "form"
                  },
                  "targetVersion": {
                    "style": "form"
                  },
                  "sendEmail": {
                    "style": "form"
                  },
                  "PITReleaseDate": {
                    "style": "form"
                  },
                  "restorationOptionRequired": {
                    "style": "form"
                  },
                  "validationType": {
                    "style": "form"
                  }
                }
              }
            }
          },
          "responses": {
            "200": {
              "description": "Import task successfully submitted",
              "content": {
                "application/json": {
                  "schema": {
                    "$ref": "#/components/schemas/OperationResult"
                  }
                }
              }
            },
            "400": {
              "description": "Data database version is incompatible, Validation or Internal error",
              "content": {
                "application/json": {
                  "schema": {
                    "$ref": "#/components/schemas/OperationResult"
                  }
                }
              }
            },
            "401": {
              "description": "Unauthorized",
              "content": {
                "application/json": {
                  "schema": {
                    "$ref": "#/components/schemas/ProblemDetails"
                  }
                }
              }
            },
            "403": {
              "description": "Forbidden",
              "content": {
                "application/json": {
                  "schema": {
                    "$ref": "#/components/schemas/ProblemDetails"
                  }
                }
              }
            }
          }
        }
      },
      "/3/validate/excel": {
        "post": {
          "tags": [
            "Import"
          ],
          "summary": "Submit a validation of an import request of data or referential metadata from EDD + Excel files into provided dataspace",
          "description": "Example: Validation of an import to the 'design' dataspace, using the eddFile 'importexample_EDD.xml' and the Excel file 'dataexample.xlsx'\r\n\r\n    POST /validate/excel\r\n    {\r\n       \"dataspace\": \"design\",\r\n       \"eddFile\": \"importexample_EDD.xml\", \r\n       \"excelFile\": \"dataexample.xlsx\"\r\n    }",
          "requestBody": {
            "content": {
              "multipart/form-data": {
                "schema": {
                  "required": [
                    "dataspace",
                    "eddFile",
                    "excelFile"
                  ],
                  "type": "object",
                  "properties": {
                    "dataspace": {
                      "type": "string",
                      "description": "The ID of the dataspace to where the values will be stored/validated. <br></br> Example: <code>design</code>"
                    },
                    "lang": {
                      "type": "string",
                      "description": "Optional - Two letter (ISO Alpha-2) language code to produce the response message/email<br></br>Example: <code>en</code>",
                      "nullable": true
                    },
                    "eddFile": {
                      "type": "string",
                      "description": "A XML edd file containing the description of the Excel file to be imported. <br></br>A maximum size file limit might apply",
                      "format": "binary"
                    },
                    "excelFile": {
                      "type": "string",
                      "description": "An Excel file containing the data/referential metadata values to be imported. <br></br>A maximum size file limit might apply",
                      "format": "binary"
                    },
                    "targetVersion": {
                      "enum": [
                        0,
                        1
                      ],
                      "type": "integer",
                      "description": "Optional - The target version of the data and referential metadata to be used during the import/validation. <br></br>Possible values: Live (0), Point in Time PIT (1), Default (Live)",
                      "format": "int32",
                      "nullable": true
                    },
                    "sendEmail": {
                      "enum": [
                        0,
                        1,
                        2
                      ],
                      "type": "integer",
                      "description": "Optional - Indicate when the service should send email. <br></br>Possible values: Always (0), Never (1), IfError (2), default (Always)",
                      "format": "int32",
                      "nullable": true
                    }
                  }
                },
                "encoding": {
                  "dataspace": {
                    "style": "form"
                  },
                  "lang": {
                    "style": "form"
                  },
                  "eddFile": {
                    "style": "form"
                  },
                  "excelFile": {
                    "style": "form"
                  },
                  "targetVersion": {
                    "style": "form"
                  },
                  "sendEmail": {
                    "style": "form"
                  }
                }
              }
            }
          },
          "responses": {
            "200": {
              "description": "Validation task successfully submitted",
              "content": {
                "application/json": {
                  "schema": {
                    "$ref": "#/components/schemas/OperationResult"
                  }
                }
              }
            },
            "400": {
              "description": "Data database version is incompatible, Validation or Internal error",
              "content": {
                "application/json": {
                  "schema": {
                    "$ref": "#/components/schemas/OperationResult"
                  }
                }
              }
            },
            "401": {
              "description": "Unauthorized",
              "content": {
                "application/json": {
                  "schema": {
                    "$ref": "#/components/schemas/ProblemDetails"
                  }
                }
              }
            },
            "403": {
              "description": "Forbidden",
              "content": {
                "application/json": {
                  "schema": {
                    "$ref": "#/components/schemas/ProblemDetails"
                  }
                }
              }
            }
          }
        }
      },
      "/3/import/sdmxFile": {
        "post": {
          "tags": [
            "Import"
          ],
          "summary": "Submit an import request of data or referential metadata from SDMX file (xml|csv) into provided dataspace",
          "description": "Example: Advanced validation import to the 'design' dataspace, using the CSV file 'dataexample.csv'\r\n\r\n    POST /import/sdmxFile\r\n    {\r\n       \"dataspace\": \"design\",\r\n       \"file\": \"dataexample.csv\",\r\n       \"validationType\": 1\r\n    }",
          "requestBody": {
            "content": {
              "multipart/form-data": {
                "schema": {
                  "required": [
                    "dataspace"
                  ],
                  "type": "object",
                  "properties": {
                    "dataspace": {
                      "type": "string",
                      "description": "The ID of the dataspace to where the values will be stored/validated. <br></br> Example: <code>design</code>"
                    },
                    "dataflow": {
                      "type": "string",
                      "description": "Obsolete - The artefact value is now directly read from the input file",
                      "nullable": true
                    },
                    "lang": {
                      "type": "string",
                      "description": "Optional - Two letter (ISO Alpha-2) language code used for the response message/email and the decimal separators used in CSV file.<br></br>Example: <code>en</code>",
                      "nullable": true
                    },
                    "filepath": {
                      "type": "string",
                      "description": "Optional - The remote location (path/url) of the input file, containing the data or referential metadata to be imported. <br></br>Make sure that the remote file is accessible by the transfer-service",
                      "nullable": true
                    },
                    "file": {
                      "type": "string",
                      "description": "Optional - When no filepath is given, The input SDMX data/referential metadata file to be imported/validated. <br></br>A maximum size file limit might apply",
                      "format": "binary",
                      "nullable": true
                    },
                    "targetVersion": {
                      "enum": [
                        0,
                        1
                      ],
                      "type": "integer",
                      "description": "Optional - The target version of the data and referential metadata to be used during the import/validation. <br></br>Possible values: Live (0), Point in Time PIT (1), Default (Live)",
                      "format": "int32",
                      "nullable": true
                    },
                    "sendEmail": {
                      "enum": [
                        0,
                        1,
                        2
                      ],
                      "type": "integer",
                      "description": "Optional - Indicate when the service should send email. <br></br>Possible values: Always (0), Never (1), IfError (2), default (Always)",
                      "format": "int32",
                      "nullable": true
                    },
                    "PITReleaseDate": {
                      "type": "string",
                      "description": "Optional - Point in time release date <br></br> Format (YYYY-MM-DDThh:mm:ss.sTZD) <br></br>Example: <code>2022-06-04T10:16:01</code>, <code>2022-06-04T08:16:01Z</code>, <code>2022-06-04T10:16:01+02:00</code>, <code>2022-06-04T10:16:01.021+02:00</code>",
                      "nullable": true
                    },
                    "restorationOptionRequired": {
                      "type": "boolean",
                      "description": "Optional - Indicate if the current LIVE version should be kept for restoration purposes when PIT release becomes active",
                      "nullable": true
                    },
                    "validationType": {
                      "enum": [
                        0,
                        1
                      ],
                      "type": "integer",
                      "description": "Optional - The type of validation to use during import: <br></br> Possible values: Import With <b>Basic Validation (0)</b>, Import With <b>Advanced Validation (1)</b>, Default (Import With Basic Validation)",
                      "format": "int32",
                      "nullable": true
                    },
                    "authenticateToRemoteURL": {
                      "type": "boolean",
                      "description": "When using a remote URL that is a .Stat Suite data space using the same identity provider instance than this transfer service, set this parameter to true to authenticate you against that source data space.",
                      "nullable": true
                    }
                  }
                },
                "encoding": {
                  "dataspace": {
                    "style": "form"
                  },
                  "dataflow": {
                    "style": "form"
                  },
                  "lang": {
                    "style": "form"
                  },
                  "filepath": {
                    "style": "form"
                  },
                  "file": {
                    "style": "form"
                  },
                  "targetVersion": {
                    "style": "form"
                  },
                  "sendEmail": {
                    "style": "form"
                  },
                  "PITReleaseDate": {
                    "style": "form"
                  },
                  "restorationOptionRequired": {
                    "style": "form"
                  },
                  "validationType": {
                    "style": "form"
                  },
                  "authenticateToRemoteURL": {
                    "style": "form"
                  }
                }
              }
            }
          },
          "responses": {
            "200": {
              "description": "Import task successfully submitted",
              "content": {
                "application/json": {
                  "schema": {
                    "$ref": "#/components/schemas/OperationResult"
                  }
                }
              }
            },
            "400": {
              "description": "Data database version is incompatible, Validation or Internal error",
              "content": {
                "application/json": {
                  "schema": {
                    "$ref": "#/components/schemas/OperationResult"
                  }
                }
              }
            },
            "401": {
              "description": "Unauthorized",
              "content": {
                "application/json": {
                  "schema": {
                    "$ref": "#/components/schemas/ProblemDetails"
                  }
                }
              }
            },
            "403": {
              "description": "Forbidden",
              "content": {
                "application/json": {
                  "schema": {
                    "$ref": "#/components/schemas/ProblemDetails"
                  }
                }
              }
            }
          }
        }
      },
      "/3/validate/sdmxFile": {
        "post": {
          "tags": [
            "Import"
          ],
          "summary": "Submit a validation of an import request of data or referential metadata from SDMX file (xml|csv) to a given dataspace",
          "description": "Example: Make a validation request to the 'design' dataspace, using the CSV file 'dataexample.csv'\r\n\r\n    POST /validate/sdmxFile\r\n    {\r\n       \"dataspace\": \"design\",\r\n       \"file\": \"dataexample.csv\"\r\n    }",
          "requestBody": {
            "content": {
              "multipart/form-data": {
                "schema": {
                  "required": [
                    "dataspace"
                  ],
                  "type": "object",
                  "properties": {
                    "dataspace": {
                      "type": "string",
                      "description": "The ID of the dataspace to where the values will be stored/validated. <br></br> Example: <code>design</code>"
                    },
                    "dataflow": {
                      "type": "string",
                      "description": "Obsolete - The artefact value is now directly read from the input file",
                      "nullable": true
                    },
                    "lang": {
                      "type": "string",
                      "description": "Optional - Two letter (ISO Alpha-2) language code used for the response message/email and the decimal separators used in CSV file.<br></br>Example: <code>en</code>",
                      "nullable": true
                    },
                    "filepath": {
                      "type": "string",
                      "description": "Optional - The remote location (path/url) of the input file, containing the data or referential metadata to be imported. <br></br>Make sure that the remote file is accessible by the transfer-service",
                      "nullable": true
                    },
                    "file": {
                      "type": "string",
                      "description": "Optional - When no filepath is given, The input SDMX data/referential metadata file to be imported/validated. <br></br>A maximum size file limit might apply",
                      "format": "binary",
                      "nullable": true
                    },
                    "targetVersion": {
                      "enum": [
                        0,
                        1
                      ],
                      "type": "integer",
                      "description": "Optional - The target version of the data and referential metadata to be used during the import/validation. <br></br>Possible values: Live (0), Point in Time PIT (1), Default (Live)",
                      "format": "int32",
                      "nullable": true
                    },
                    "sendEmail": {
                      "enum": [
                        0,
                        1,
                        2
                      ],
                      "type": "integer",
                      "description": "Optional - Indicate when the service should send email. <br></br>Possible values: Always (0), Never (1), IfError (2), default (Always)",
                      "format": "int32",
                      "nullable": true
                    }
                  }
                },
                "encoding": {
                  "dataspace": {
                    "style": "form"
                  },
                  "dataflow": {
                    "style": "form"
                  },
                  "lang": {
                    "style": "form"
                  },
                  "filepath": {
                    "style": "form"
                  },
                  "file": {
                    "style": "form"
                  },
                  "targetVersion": {
                    "style": "form"
                  },
                  "sendEmail": {
                    "style": "form"
                  }
                }
              }
            }
          },
          "responses": {
            "200": {
              "description": "Import task successfully submitted",
              "content": {
                "application/json": {
                  "schema": {
                    "$ref": "#/components/schemas/OperationResult"
                  }
                }
              }
            },
            "400": {
              "description": "Data database version is incompatible, Validation or Internal error",
              "content": {
                "application/json": {
                  "schema": {
                    "$ref": "#/components/schemas/OperationResult"
                  }
                }
              }
            },
            "401": {
              "description": "Unauthorized",
              "content": {
                "application/json": {
                  "schema": {
                    "$ref": "#/components/schemas/ProblemDetails"
                  }
                }
              }
            },
            "403": {
              "description": "Forbidden",
              "content": {
                "application/json": {
                  "schema": {
                    "$ref": "#/components/schemas/ProblemDetails"
                  }
                }
              }
            }
          }
        }
      },
      "/3/pointintime/PITInfo": {
        "post": {
          "tags": [
            "PointInTime"
          ],
          "summary": "Get the Point-In-Time information of a dataflow for a given dataspace",
          "description": "Example: Get the PIT information of the dataflow 'OECD:MEI(1.0)' in the 'design' dataspace\r\n\r\n    POST /pointintime/PITInfo\r\n    {\r\n       \"dataspace\": \"design\",\r\n       \"dataflow\": \"OECD:DF_MEI(1.0)\"\r\n    }",
          "requestBody": {
            "content": {
              "multipart/form-data": {
                "schema": {
                  "required": [
                    "dataflow",
                    "dataspace"
                  ],
                  "type": "object",
                  "properties": {
                    "dataspace": {
                      "type": "string",
                      "description": "The ID of the dataspace where to consult the PIT information. <br></br> Example: <code>design</code>"
                    },
                    "dataflow": {
                      "type": "string",
                      "description": "The SDMX ID of the dataflow. <br></br> Format: 'AGENCYID:DATAFLOWID(VERSION)'. <br></br> Example: <code>OECD:DF_MEI(1.0)</code>"
                    }
                  }
                },
                "encoding": {
                  "dataspace": {
                    "style": "form"
                  },
                  "dataflow": {
                    "style": "form"
                  }
                }
              }
            }
          },
          "responses": {
            "200": {
              "description": "Information successfully retrieved",
              "content": {
                "application/json": {
                  "schema": {
                    "$ref": "#/components/schemas/OperationResult"
                  }
                }
              }
            },
            "400": {
              "description": "Data database version is incompatible, Validation or Internal error",
              "content": {
                "application/json": {
                  "schema": {
                    "$ref": "#/components/schemas/OperationResult"
                  }
                }
              }
            },
            "401": {
              "description": "Unauthorized",
              "content": {
                "application/json": {
                  "schema": {
                    "$ref": "#/components/schemas/ProblemDetails"
                  }
                }
              }
            },
            "403": {
              "description": "Forbidden",
              "content": {
                "application/json": {
                  "schema": {
                    "$ref": "#/components/schemas/ProblemDetails"
                  }
                }
              }
            }
          }
        }
      },
      "/3/pointintime/rollback": {
        "post": {
          "tags": [
            "PointInTime"
          ],
          "summary": "Perform a Rollback of the Point-In-Time of a dataflow for a given dataspace",
          "description": "Example: Perform a rollback of the PIT for the dataflow 'OECD:MEI(1.0)' in the 'design' dataspace\r\n\r\n    POST /pointintime/rollback\r\n    {\r\n       \"dataspace\": \"design\",\r\n       \"dataflow\": \"OECD:DF_MEI(1.0)\"\r\n    }",
          "requestBody": {
            "content": {
              "multipart/form-data": {
                "schema": {
                  "required": [
                    "dataflow",
                    "dataspace"
                  ],
                  "type": "object",
                  "properties": {
                    "dataspace": {
                      "type": "string",
                      "description": "The ID of the dataspace where to perform the rollback. <br></br> Example: <code>design</code>"
                    },
                    "dataflow": {
                      "type": "string",
                      "description": "The SDMX ID of the dataflow. <br></br> Format: 'AGENCYID:DATAFLOWID(VERSION)'. <br></br> Example: <code>OECD:DF_MEI(1.0)</code>"
                    },
                    "sendEmail": {
                      "enum": [
                        0,
                        1,
                        2
                      ],
                      "type": "integer",
                      "description": "Send email options:  Always (0), Never (1), IfError (2), default (Always)",
                      "format": "int32",
                      "default": 0
                    }
                  }
                },
                "encoding": {
                  "dataspace": {
                    "style": "form"
                  },
                  "dataflow": {
                    "style": "form"
                  },
                  "sendEmail": {
                    "style": "form"
                  }
                }
              }
            }
          },
          "responses": {
            "200": {
              "description": "Rollback successfully submitted",
              "content": {
                "application/json": {
                  "schema": {
                    "$ref": "#/components/schemas/OperationResult"
                  }
                }
              }
            },
            "400": {
              "description": "Data database version is incompatible, Validation or Internal error",
              "content": {
                "application/json": {
                  "schema": {
                    "$ref": "#/components/schemas/OperationResult"
                  }
                }
              }
            },
            "401": {
              "description": "Unauthorized",
              "content": {
                "application/json": {
                  "schema": {
                    "$ref": "#/components/schemas/ProblemDetails"
                  }
                }
              }
            },
            "403": {
              "description": "Forbidden",
              "content": {
                "application/json": {
                  "schema": {
                    "$ref": "#/components/schemas/ProblemDetails"
                  }
                }
              }
            }
          }
        }
      },
      "/3/pointintime/restoration": {
        "post": {
          "tags": [
            "PointInTime"
          ],
          "summary": "Perform a Restoration of a released PIT version of a dataflow for a given dataspace",
          "description": "Example: Restore the previous version of the dataflow 'OECD:MEI(1.0)' in the 'design' dataspace\r\n\r\n    POST /pointintime/restoration\r\n    {\r\n       \"dataspace\": \"design\",\r\n       \"dataflow\": \"OECD:DF_MEI(1.0)\"\r\n    }",
          "requestBody": {
            "content": {
              "multipart/form-data": {
                "schema": {
                  "required": [
                    "dataflow",
                    "dataspace"
                  ],
                  "type": "object",
                  "properties": {
                    "dataspace": {
                      "type": "string",
                      "description": "The ID of the dataspace where to perform the restoration. <br></br> Example: <code>design</code>"
                    },
                    "dataflow": {
                      "type": "string",
                      "description": "The SDMX ID of the dataflow. <br></br> Format: 'AGENCYID:DATAFLOWID(VERSION)'. <br></br> Example: <code>OECD:DF_MEI(1.0)</code>"
                    },
                    "sendEmail": {
                      "enum": [
                        0,
                        1,
                        2
                      ],
                      "type": "integer",
                      "description": "Send email options:  Always (0), Never (1), IfError (2), default (Always)",
                      "format": "int32",
                      "default": 0
                    }
                  }
                },
                "encoding": {
                  "dataspace": {
                    "style": "form"
                  },
                  "dataflow": {
                    "style": "form"
                  },
                  "sendEmail": {
                    "style": "form"
                  }
                }
              }
            }
          },
          "responses": {
            "200": {
              "description": "Restoration successfully submitted",
              "content": {
                "application/json": {
                  "schema": {
                    "$ref": "#/components/schemas/OperationResult"
                  }
                }
              }
            },
            "400": {
              "description": "Data database version is incompatible, Validation or Internal error",
              "content": {
                "application/json": {
                  "schema": {
                    "$ref": "#/components/schemas/OperationResult"
                  }
                }
              }
            },
            "401": {
              "description": "Unauthorized",
              "content": {
                "application/json": {
                  "schema": {
                    "$ref": "#/components/schemas/ProblemDetails"
                  }
                }
              }
            },
            "403": {
              "description": "Forbidden",
              "content": {
                "application/json": {
                  "schema": {
                    "$ref": "#/components/schemas/ProblemDetails"
                  }
                }
              }
            }
          }
        }
      },
      "/3/status/request": {
        "post": {
          "tags": [
            "Status"
          ],
          "summary": "Get the transaction status information by transaction ID, for a given dataspace",
          "description": "Example: Get the status of the request ID #4 in the 'design' dataspace\r\n\r\n    POST /status/request\r\n    {\r\n       \"dataspace\": \"design\",\r\n       \"id\": 4\r\n    }",
          "requestBody": {
            "content": {
              "multipart/form-data": {
                "schema": {
                  "required": [
                    "dataspace",
                    "id"
                  ],
                  "type": "object",
                  "properties": {
                    "dataspace": {
                      "type": "string",
                      "description": "The ID of the dataspace to search for the request. <br></br> Example: <code>design</code>"
                    },
                    "id": {
                      "type": "integer",
                      "description": "The transaction ID, received during the submission of the request.<br></br> Example: <code>1</code>,<code>155</code>",
                      "format": "int32"
                    }
                  }
                },
                "encoding": {
                  "dataspace": {
                    "style": "form"
                  },
                  "id": {
                    "style": "form"
                  }
                }
              }
            }
          },
          "responses": {
            "200": {
              "description": "Information successfully retrieved",
              "content": {
                "application/json": {
                  "schema": {
                    "$ref": "#/components/schemas/OperationResult"
                  }
                }
              }
            },
            "400": {
              "description": "Data database version is incompatible, Validation or Internal error",
              "content": {
                "application/json": {
                  "schema": {
                    "$ref": "#/components/schemas/OperationResult"
                  }
                }
              }
            },
            "401": {
              "description": "Unauthorized",
              "content": {
                "application/json": {
                  "schema": {
                    "$ref": "#/components/schemas/ProblemDetails"
                  }
                }
              }
            },
            "403": {
              "description": "Forbidden",
              "content": {
                "application/json": {
                  "schema": {
                    "$ref": "#/components/schemas/ProblemDetails"
                  }
                }
              }
            },
            "404": {
              "description": "Not found"
            }
          }
        }
      },
      "/3/status/requests": {
        "post": {
          "tags": [
            "Status"
          ],
          "summary": "Search for transactions and their logs in a given dataspace",
          "description": "Example: Get the status of the requests in the 'design' dataspace, for the user email 'email@domain.com' and completed with errors \r\n\r\n    POST /status/requests\r\n    {\r\n       \"dataspace\": \"design\",\r\n       \"userEmail\": \"email@domain.com\",\r\n       \"executionOutcome\": 2\r\n    }",
          "requestBody": {
            "content": {
              "multipart/form-data": {
                "schema": {
                  "required": [
                    "dataspace"
                  ],
                  "type": "object",
                  "properties": {
                    "dataspace": {
                      "type": "string",
                      "description": "The ID of the dataspace to search for the requests. <br></br> Example: <code>design</code>"
                    },
                    "userEmail": {
                      "type": "string",
                      "description": "Optional - Filter requests by user email, default (any). <br></br> Example: <code>email@domain.com</code>",
                      "nullable": true
                    },
                    "artefact": {
                      "type": "string",
                      "description": "Optional - Filter requests by SDMX ID artefact, default (any). <br></br>Format: AGENCYID:ARTEFACTID(VERSION)<br></br> Example: <code>OECD:MEI(1.0)</code>, <code>OECD:DF_MEI(1.0)</code>",
                      "nullable": true
                    },
                    "submissionStart": {
                      "type": "string",
                      "description": "Optional - Filter requests by the start Datetime when the import/transfer was requested<br></br> default (24Hrs before now) <br></br> Format: (dd-MM-yyyy HH:mm:ss or YYYY-MM-DDThh:mm:ssTZD)<br></br> Example: <code>04-06-2022 10:16:01</code>, <code>2022-06-04T10:16:01</code>, <code>2022-06-04T08:16:01Z</code>, <code>2022-06-04T10:16:01+02:00</code>, <code>2022-06-04T10:16:01.021+02:00</code>",
                      "nullable": true
                    },
                    "submissionEnd": {
                      "type": "string",
                      "description": "Optional - Filter requests by the end Datetime when the import/transfer finished processing<br></br> default (now)<br></br> Format: (dd-MM-yyyy HH:mm:ss or YYYY-MM-DDThh:mm:ssTZD)<br></br> Example: <code>04-06-2022 10:16:01</code>, <code>2022-06-04T10:16:01</code>, <code>2022-06-04T08:16:01Z</code>, <code>2022-06-04T10:16:01+02:00</code>, <code>2022-06-04T10:16:01.021+02:00</code>",
                      "nullable": true
                    },
                    "executionStatus": {
                      "enum": [
                        0,
                        1,
                        2,
                        3,
                        4
                      ],
                      "type": "integer",
                      "description": "Optional - Filter requests by its current Status <br></br>Possible values:  Queued (0), InProgress (1), Completed (2), TimedOut (3), Canceled (4), default (any)",
                      "format": "int32",
                      "nullable": true
                    },
                    "executionOutcome": {
                      "enum": [
                        0,
                        1,
                        2,
                        3
                      ],
                      "type": "integer",
                      "description": "Optional - Filter requests by its final outcome <br></br>Possible values: Success (0), Warning (1), Error (2), None (3), default (any)",
                      "format": "int32",
                      "nullable": true
                    }
                  }
                },
                "encoding": {
                  "dataspace": {
                    "style": "form"
                  },
                  "userEmail": {
                    "style": "form"
                  },
                  "artefact": {
                    "style": "form"
                  },
                  "submissionStart": {
                    "style": "form"
                  },
                  "submissionEnd": {
                    "style": "form"
                  },
                  "executionStatus": {
                    "style": "form"
                  },
                  "executionOutcome": {
                    "style": "form"
                  }
                }
              }
            }
          },
          "responses": {
            "200": {
              "description": "Information successfully retrieved",
              "content": {
                "application/json": {
                  "schema": {
                    "$ref": "#/components/schemas/OperationResult"
                  }
                }
              }
            },
            "400": {
              "description": "Data database version is incompatible, Validation or Internal error",
              "content": {
                "application/json": {
                  "schema": {
                    "$ref": "#/components/schemas/OperationResult"
                  }
                }
              }
            },
            "401": {
              "description": "Unauthorized",
              "content": {
                "application/json": {
                  "schema": {
                    "$ref": "#/components/schemas/ProblemDetails"
                  }
                }
              }
            },
            "403": {
              "description": "Forbidden",
              "content": {
                "application/json": {
                  "schema": {
                    "$ref": "#/components/schemas/ProblemDetails"
                  }
                }
              }
            },
            "404": {
              "description": "Not found"
            }
          }
        }
      },
      "/3/transfer/dataflow": {
        "post": {
          "tags": [
            "Transfer"
          ],
          "summary": "Transfer data and/or referential metadata from one source dataspace to a destination dataspace.",
          "description": "Example: transfer request\r\n\r\n    POST /transfer/dataflow\r\n    {\r\n       \"sourceDataspace\": \"design\",\r\n       \"sourceDataflow\": \"OECD:DF_MEI(1.0)\",\r\n       \"destinationDataspace\": \"staging\",\r\n       \"destinationDataflow\": \"OECD:DF_MEI(1.0)\"\r\n    }",
          "requestBody": {
            "content": {
              "multipart/form-data": {
                "schema": {
                  "required": [
                    "destinationDataflow",
                    "destinationDataspace",
                    "sourceDataflow",
                    "sourceDataspace"
                  ],
                  "type": "object",
                  "properties": {
                    "sourceDataspace": {
                      "type": "string",
                      "description": "The ID of the source dataspace. <br></br> Example: <code>design</code>"
                    },
                    "sourceDataflow": {
                      "type": "string",
                      "description": "The SDMX ID of the source dataflow. <br></br> Format: 'AGENCYID:DATAFLOWID(VERSION)'. <br></br> Example: <code>OECD:DF_MEI(1.0)</code>"
                    },
                    "sourceQuery": {
                      "type": "string",
                      "description": "Optional - SDMX query to filter the data/referential metadata to be transferred (as provided to the NSIWS to get data) <br></br> Example: <code>\"D.NOK.EUR.SP00.A?startPeriod=2012-01-01&endPeriod=2010-02-01\"</code>",
                      "nullable": true
                    },
                    "destinationDataspace": {
                      "type": "string",
                      "description": "The ID of the destination dataspace. <br></br> Example: <code>staging</code>"
                    },
                    "destinationDataflow": {
                      "type": "string",
                      "description": "The SDMX ID of the destination dataflow. <br></br> Format: 'AGENCYID:DATAFLOWID(VERSION)'. <br></br> Example: <code>OECD:DF_MEI(1.0)</code>"
                    },
                    "lang": {
                      "type": "string",
                      "description": "Optional - Two letter (ISO Alpha-2) language code to produce the response message/email<br></br>Example: <code>en</code>",
                      "nullable": true
                    },
                    "sourceVersion": {
                      "enum": [
                        0,
                        1
                      ],
                      "type": "integer",
                      "description": "Optional - The version of the data and referential metadata to be used from the <b>source</b> dataspace. <br></br>Possible values: Live (0), Point in Time PIT (1), Default (Live)",
                      "format": "int32",
                      "nullable": true
                    },
                    "targetVersion": {
                      "enum": [
                        0,
                        1
                      ],
                      "type": "integer",
                      "description": "Optional - The version of the data and referential metadata to be used to the <b>destination</b> dataspace. <br></br>Possible values: Live (0), Point in Time PIT (1), Default (Live)",
                      "format": "int32",
                      "nullable": true
                    },
                    "PITReleaseDate": {
                      "type": "string",
                      "description": "Optional - Point in time release date (YYYY-MM-DDThh:mm:ss.sTZD) Example: <code>2022-06-04T10:16:01</code>, <code>2022-06-04T08:16:01Z</code>, <code>2022-06-04T10:16:01+02:00</code>, <code>2022-06-04T10:16:01.021+02:00</code>",
                      "nullable": true
                    },
                    "validationType": {
                      "enum": [
                        0,
                        1
                      ],
                      "type": "integer",
                      "description": "Optional - The type of validation to use during import:  <br></br>Possible values: Import With <b>Basic Validation (0)</b>, Import With <b>Advanced Validation (1)</b>, Default (Import With Basic Validation)",
                      "format": "int32",
                      "nullable": true
                    },
                    "transferContent": {
                      "enum": [
                        0,
                        1,
                        2
                      ],
                      "type": "integer",
                      "description": "Optional - The content to be transferred across dataspaces: <br></br>Possible values: Transfer <b>both data and referential metadata (0)</b>, Transfer <b>data only (1)</b>, Transfer <b>referential metadata only (2)</b>, Default (Transfer both data and referential metadata)",
                      "format": "int32",
                      "default": 0,
                      "nullable": true
                    },
                    "restorationOptionRequired": {
                      "type": "boolean",
                      "description": "Optional - Indicate if the current LIVE version should be kept for restoration purposes when PIT release becomes active",
                      "default": false,
                      "nullable": true
                    },
                    "sendEmail": {
                      "enum": [
                        0,
                        1,
                        2
                      ],
                      "type": "integer",
                      "description": "Optional - Indicate when the service should send email. <br></br>Possible values: Always (0), Never (1), IfError (2), default (Always)",
                      "format": "int32",
                      "default": 0,
                      "nullable": true
                    }
                  }
                },
                "encoding": {
                  "sourceDataspace": {
                    "style": "form"
                  },
                  "sourceDataflow": {
                    "style": "form"
                  },
                  "sourceQuery": {
                    "style": "form"
                  },
                  "destinationDataspace": {
                    "style": "form"
                  },
                  "destinationDataflow": {
                    "style": "form"
                  },
                  "lang": {
                    "style": "form"
                  },
                  "sourceVersion": {
                    "style": "form"
                  },
                  "targetVersion": {
                    "style": "form"
                  },
                  "PITReleaseDate": {
                    "style": "form"
                  },
                  "validationType": {
                    "style": "form"
                  },
                  "transferContent": {
                    "style": "form"
                  },
                  "restorationOptionRequired": {
                    "style": "form"
                  },
                  "sendEmail": {
                    "style": "form"
                  }
                }
              }
            }
          },
          "responses": {
            "200": {
              "description": "Transfer task successfully submitted",
              "content": {
                "application/json": {
                  "schema": {
                    "$ref": "#/components/schemas/OperationResult"
                  }
                }
              }
            },
            "400": {
              "description": "Data database version is incompatible, Validation or Internal error",
              "content": {
                "application/json": {
                  "schema": {
                    "$ref": "#/components/schemas/OperationResult"
                  }
                }
              }
            },
            "401": {
              "description": "Unauthorized",
              "content": {
                "application/json": {
                  "schema": {
                    "$ref": "#/components/schemas/ProblemDetails"
                  }
                }
              }
            },
            "403": {
              "description": "Forbidden",
              "content": {
                "application/json": {
                  "schema": {
                    "$ref": "#/components/schemas/ProblemDetails"
                  }
                }
              }
            }
          }
        }
      },
      "/3/validate/transferDataflow": {
        "post": {
          "tags": [
            "Transfer"
          ],
          "summary": "Validates a transfer of data and/or referential metadata from one source dataspace to a destination dataspace.",
          "description": "Example: Validate a transfer request\r\n\r\n    POST /validate/transferDataflow\r\n    {\r\n       \"sourceDataspace\": \"design\",\r\n       \"sourceDataflow\": \"OECD:DF_MEI(1.0)\",\r\n       \"destinationDataspace\": \"staging\",\r\n       \"destinationDataflow\": \"OECD:DF_MEI(1.0)\"\r\n    }",
          "requestBody": {
            "content": {
              "multipart/form-data": {
                "schema": {
                  "required": [
                    "destinationDataflow",
                    "destinationDataspace",
                    "sourceDataflow",
                    "sourceDataspace"
                  ],
                  "type": "object",
                  "properties": {
                    "sourceDataspace": {
                      "type": "string",
                      "description": "The ID of the source dataspace. <br></br> Example: <code>design</code>"
                    },
                    "sourceDataflow": {
                      "type": "string",
                      "description": "The SDMX ID of the source dataflow. <br></br> Format: 'AGENCYID:DATAFLOWID(VERSION)'. <br></br> Example: <code>OECD:DF_MEI(1.0)</code>"
                    },
                    "sourceQuery": {
                      "type": "string",
                      "description": "Optional - SDMX query to filter the data/referential metadata to be validated (as provided to the NSIWS to get data) <br></br> Example: <code>\"D.NOK.EUR.SP00.A?startPeriod=2012-01-01&endPeriod=2010-02-01\"</code>",
                      "nullable": true
                    },
                    "destinationDataspace": {
                      "type": "string",
                      "description": "The ID of the destination dataspace. <br></br> Example: <code>staging</code>"
                    },
                    "destinationDataflow": {
                      "type": "string",
                      "description": "The SDMX ID of the destination dataflow. <br></br> Format: 'AGENCYID:DATAFLOWID(VERSION)'. <br></br> Example: <code>OECD:DF_MEI(1.0)</code>"
                    },
                    "lang": {
                      "type": "string",
                      "description": "Optional - Two letter (ISO Alpha-2) language code to produce the response message/email<br></br>Example: <code>en</code>",
                      "nullable": true
                    },
                    "sourceVersion": {
                      "enum": [
                        0,
                        1
                      ],
                      "type": "integer",
                      "description": "Optional - The version of the data and referential metadata to be used from the <b>source</b> dataspace. <br></br>Possible values: Live (0), PIT (1), Default(Live)",
                      "format": "int32",
                      "nullable": true
                    },
                    "targetVersion": {
                      "enum": [
                        0,
                        1
                      ],
                      "type": "integer",
                      "description": "Optional - The version of the data and referential metadata to be used to the <b>destination</b> dataspace. <br></br>Possible values: Live (0), Point in Time PIT (1), Default (Live)",
                      "format": "int32",
                      "nullable": true
                    },
                    "transferContent": {
                      "enum": [
                        0,
                        1,
                        2
                      ],
                      "type": "integer",
                      "description": "Optional - The content to be validated across dataspaces: <br></br>Possible values: Transfer <b>both data and referential metadata (0)</b>, Transfer <b>data only (1)</b>, Transfer <b>referential metadata only (2)</b>, Default (Transfer both data and referential metadata)",
                      "format": "int32",
                      "default": 0,
                      "nullable": true
                    },
                    "sendEmail": {
                      "enum": [
                        0,
                        1,
                        2
                      ],
                      "type": "integer",
                      "description": "Optional - Indicate when the service should send email. <br></br>Possible values: Always (0), Never (1), IfError (2), default (Always)",
                      "format": "int32",
                      "default": 0,
                      "nullable": true
                    }
                  }
                },
                "encoding": {
                  "sourceDataspace": {
                    "style": "form"
                  },
                  "sourceDataflow": {
                    "style": "form"
                  },
                  "sourceQuery": {
                    "style": "form"
                  },
                  "destinationDataspace": {
                    "style": "form"
                  },
                  "destinationDataflow": {
                    "style": "form"
                  },
                  "lang": {
                    "style": "form"
                  },
                  "sourceVersion": {
                    "style": "form"
                  },
                  "targetVersion": {
                    "style": "form"
                  },
                  "transferContent": {
                    "style": "form"
                  },
                  "sendEmail": {
                    "style": "form"
                  }
                }
              }
            }
          },
          "responses": {
            "200": {
              "description": "The transfer validation task successfully submitted",
              "content": {
                "application/json": {
                  "schema": {
                    "$ref": "#/components/schemas/OperationResult"
                  }
                }
              }
            },
            "400": {
              "description": "Data database version is incompatible, Validation or Internal error",
              "content": {
                "application/json": {
                  "schema": {
                    "$ref": "#/components/schemas/OperationResult"
                  }
                }
              }
            },
            "401": {
              "description": "Unauthorized",
              "content": {
                "application/json": {
                  "schema": {
                    "$ref": "#/components/schemas/ProblemDetails"
                  }
                }
              }
            },
            "403": {
              "description": "Forbidden",
              "content": {
                "application/json": {
                  "schema": {
                    "$ref": "#/components/schemas/ProblemDetails"
                  }
                }
              }
            }
          }
        }
      },
      "/3/transfer/dsd": {
        "post": {
          "tags": [
            "Transfer"
          ],
          "summary": "Transfer DSD level referential metadata from one source dataspace to a destination dataspace.",
          "description": "Example: transfer request\r\n\r\n    POST /transfer/dsd\r\n    {\r\n       \"sourceDataspace\": \"design\",\r\n       \"sourceDsd\": \"OECD:DSD_MEI(1.0)\",\r\n       \"destinationDataspace\": \"staging\",\r\n       \"destinationDsd\": \"OECD:DSD_MEI(1.0)\"\r\n    }",
          "requestBody": {
            "content": {
              "multipart/form-data": {
                "schema": {
                  "required": [
                    "destinationDataspace",
                    "destinationDsd",
                    "sourceDataspace",
                    "sourceDsd"
                  ],
                  "type": "object",
                  "properties": {
                    "sourceDataspace": {
                      "type": "string",
                      "description": "The ID of the source dataspace. <br></br> Example: <code>design</code>"
                    },
                    "sourceDsd": {
                      "type": "string",
                      "description": "The SDMX ID of the source dsd. <br></br> Format: 'AGENCYID:DSD_ID(VERSION)'. <br></br> Example: <code>OECD:DSD_MEI(1.0)</code>"
                    },
                    "destinationDataspace": {
                      "type": "string",
                      "description": "The ID of the destination dataspace. <br></br> Example: <code>staging</code>"
                    },
                    "destinationDsd": {
                      "type": "string",
                      "description": "The SDMX ID of the destination dsd. <br></br> Format: 'AGENCYID:DSD_ID(VERSION)'. <br></br> Example: <code>OECD:DSD_MEI(1.0)</code>"
                    },
                    "lang": {
                      "type": "string",
                      "description": "Optional - Two letter (ISO Alpha-2) language code to produce the response message/email<br></br>Example: <code>en</code>",
                      "nullable": true
                    },
                    "sourceVersion": {
                      "enum": [
                        0,
                        1
                      ],
                      "type": "integer",
                      "description": "Optional - The version of the data and referential metadata to be used from the <b>source</b> dataspace. <br></br>Possible values: Live (0), Point in Time PIT (1), Default (Live)",
                      "format": "int32",
                      "nullable": true
                    },
                    "targetVersion": {
                      "enum": [
                        0,
                        1
                      ],
                      "type": "integer",
                      "description": "Optional - The version of the data and referential metadata to be used to the <b>destination</b> dataspace. <br></br>Possible values: Live (0), Point in Time PIT (1), Default (Live)",
                      "format": "int32",
                      "nullable": true
                    },
                    "PITReleaseDate": {
                      "type": "string",
                      "description": "Optional - Point in time release date (YYYY-MM-DDThh:mm:ss.sTZD) Example: <code>2022-06-04T10:16:01</code>, <code>2022-06-04T08:16:01Z</code>, <code>2022-06-04T10:16:01+02:00</code>, <code>2022-06-04T10:16:01.021+02:00</code>",
                      "nullable": true
                    },
                    "validationType": {
                      "enum": [
                        0,
                        1
                      ],
                      "type": "integer",
                      "description": "Optional - The type of validation to use during import:  <br></br>Possible values: Import With <b>Basic Validation (0)</b>, Import With <b>Advanced Validation (1)</b>, Default (Import With Basic Validation)",
                      "format": "int32",
                      "nullable": true
                    },
                    "restorationOptionRequired": {
                      "type": "boolean",
                      "description": "Optional - Indicate if the current LIVE version should be kept for restoration purposes when PIT release becomes active",
                      "default": false,
                      "nullable": true
                    },
                    "sendEmail": {
                      "enum": [
                        0,
                        1,
                        2
                      ],
                      "type": "integer",
                      "description": "Optional - Indicate when the service should send email. <br></br>Possible values: Always (0), Never (1), IfError (2), default (Always)",
                      "format": "int32",
                      "default": 0,
                      "nullable": true
                    }
                  }
                },
                "encoding": {
                  "sourceDataspace": {
                    "style": "form"
                  },
                  "sourceDsd": {
                    "style": "form"
                  },
                  "destinationDataspace": {
                    "style": "form"
                  },
                  "destinationDsd": {
                    "style": "form"
                  },
                  "lang": {
                    "style": "form"
                  },
                  "sourceVersion": {
                    "style": "form"
                  },
                  "targetVersion": {
                    "style": "form"
                  },
                  "PITReleaseDate": {
                    "style": "form"
                  },
                  "validationType": {
                    "style": "form"
                  },
                  "restorationOptionRequired": {
                    "style": "form"
                  },
                  "sendEmail": {
                    "style": "form"
                  }
                }
              }
            }
          },
          "responses": {
            "200": {
              "description": "Transfer task successfully submitted",
              "content": {
                "application/json": {
                  "schema": {
                    "$ref": "#/components/schemas/OperationResult"
                  }
                }
              }
            },
            "400": {
              "description": "Data database version is incompatible, Validation or Internal error",
              "content": {
                "application/json": {
                  "schema": {
                    "$ref": "#/components/schemas/OperationResult"
                  }
                }
              }
            },
            "401": {
              "description": "Unauthorized",
              "content": {
                "application/json": {
                  "schema": {
                    "$ref": "#/components/schemas/ProblemDetails"
                  }
                }
              }
            },
            "403": {
              "description": "Forbidden",
              "content": {
                "application/json": {
                  "schema": {
                    "$ref": "#/components/schemas/ProblemDetails"
                  }
                }
              }
            }
          }
        }
      },
      "/3/validate/transferDsd": {
        "post": {
          "tags": [
            "Transfer"
          ],
          "summary": "Validates a transfer of Dsd level referential metadata from one source dataspace to a destination dataspace.",
          "description": "Example: Validate a transfer request\r\n\r\n    POST /validate/transferDsd\r\n    {\r\n       \"sourceDataspace\": \"design\",\r\n       \"sourceDsd\": \"OECD:DSD_MEI(1.0)\",\r\n       \"destinationDataspace\": \"staging\",\r\n       \"destinationDsd\": \"OECD:DSD_MEI(1.0)\"\r\n    }",
          "requestBody": {
            "content": {
              "multipart/form-data": {
                "schema": {
                  "required": [
                    "destinationDataspace",
                    "destinationDsd",
                    "sourceDataspace",
                    "sourceDsd"
                  ],
                  "type": "object",
                  "properties": {
                    "sourceDataspace": {
                      "type": "string",
                      "description": "The ID of the source dataspace. <br></br> Example: <code>design</code>"
                    },
                    "sourceDsd": {
                      "type": "string",
                      "description": "The SDMX ID of the source DSD. <br></br> Format: 'AGENCYID:DSD_ID(VERSION)'. <br></br> Example: <code>OECD:DSD_MEI(1.0)</code>"
                    },
                    "destinationDataspace": {
                      "type": "string",
                      "description": "The ID of the destination dataspace. <br></br> Example: <code>staging</code>"
                    },
                    "destinationDsd": {
                      "type": "string",
                      "description": "The SDMX ID of the destination DSD. <br></br> Format: 'AGENCYID:DSD_ID(VERSION)'. <br></br> Example: <code>OECD:DSD_MEI(1.0)</code>"
                    },
                    "lang": {
                      "type": "string",
                      "description": "Optional - Two letter (ISO Alpha-2) language code to produce the response message/email<br></br>Example: <code>en</code>",
                      "nullable": true
                    },
                    "sourceVersion": {
                      "enum": [
                        0,
                        1
                      ],
                      "type": "integer",
                      "description": "Optional - The version of the data and referential metadata to be used from the <b>source</b> dataspace. <br></br>Possible values: Live (0), PIT (1), Default(Live)",
                      "format": "int32",
                      "nullable": true
                    },
                    "targetVersion": {
                      "enum": [
                        0,
                        1
                      ],
                      "type": "integer",
                      "description": "Optional - The version of the data and referential metadata to be used to the <b>destination</b> dataspace. <br></br>Possible values: Live (0), Point in Time PIT (1), Default (Live)",
                      "format": "int32",
                      "nullable": true
                    },
                    "sendEmail": {
                      "enum": [
                        0,
                        1,
                        2
                      ],
                      "type": "integer",
                      "description": "Optional - Indicate when the service should send email. <br></br>Possible values: Always (0), Never (1), IfError (2), default (Always)",
                      "format": "int32",
                      "default": 0,
                      "nullable": true
                    }
                  }
                },
                "encoding": {
                  "sourceDataspace": {
                    "style": "form"
                  },
                  "sourceDsd": {
                    "style": "form"
                  },
                  "destinationDataspace": {
                    "style": "form"
                  },
                  "destinationDsd": {
                    "style": "form"
                  },
                  "lang": {
                    "style": "form"
                  },
                  "sourceVersion": {
                    "style": "form"
                  },
                  "targetVersion": {
                    "style": "form"
                  },
                  "sendEmail": {
                    "style": "form"
                  }
                }
              }
            }
          },
          "responses": {
            "200": {
              "description": "The transfer validation task successfully submitted",
              "content": {
                "application/json": {
                  "schema": {
                    "$ref": "#/components/schemas/OperationResult"
                  }
                }
              }
            },
            "400": {
              "description": "Data database version is incompatible, Validation or Internal error",
              "content": {
                "application/json": {
                  "schema": {
                    "$ref": "#/components/schemas/OperationResult"
                  }
                }
              }
            },
            "401": {
              "description": "Unauthorized",
              "content": {
                "application/json": {
                  "schema": {
                    "$ref": "#/components/schemas/ProblemDetails"
                  }
                }
              }
            },
            "403": {
              "description": "Forbidden",
              "content": {
                "application/json": {
                  "schema": {
                    "$ref": "#/components/schemas/ProblemDetails"
                  }
                }
              }
            }
          }
        }
      }
    },
    "components": {
      "schemas": {
        "OperationResult": {
          "type": "object",
          "properties": {
            "success": {
              "type": "boolean",
              "readOnly": true
            },
            "message": {
              "type": "string",
              "nullable": true
            },
            "detail": {
              "nullable": true
            }
          },
          "additionalProperties": false
        },
        "ProblemDetails": {
          "type": "object",
          "properties": {
            "type": {
              "type": "string",
              "nullable": true
            },
            "title": {
              "type": "string",
              "nullable": true
            },
            "status": {
              "type": "integer",
              "format": "int32",
              "nullable": true
            },
            "detail": {
              "type": "string",
              "nullable": true
            },
            "instance": {
              "type": "string",
              "nullable": true
            }
          },
          "additionalProperties": { }
        }
      },
      "securitySchemes": {
        "oauth2": {
          "type": "oauth2",
          "flows": {
            "authorizationCode": {
              "authorizationUrl": "https://kc.daten.uba.de/realms/dctest/protocol/openid-connect/auth",
              "tokenUrl": "https://kc.daten.uba.de/realms/dctest/protocol/openid-connect/token",
              "scopes": {
                "openid": "openid",
                "profile": "profile",
                "email": "email"
              }
            }
          }
        }
      }
    },
    "security": [
      {
        "oauth2": [
          "openid",
          "profile",
          "email"
        ]
      }
    ]
  }