[
    {
        "id": "1f2d93215d29f7c3",
        "type": "subflow",
        "name": "getObservationByDatastreamName",
        "info": "",
        "category": "FROST-Server",
        "in": [
            {
                "x": 60,
                "y": 140,
                "wires": [
                    {
                        "id": "013186437e521c0e"
                    }
                ]
            }
        ],
        "out": [
            {
                "x": 1020,
                "y": 120,
                "wires": [
                    {
                        "id": "6c6b63742ef59905",
                        "port": 0
                    }
                ]
            }
        ],
        "env": [],
        "meta": {},
        "color": "#DDAA99",
        "icon": "font-awesome/fa-area-chart"
    },
    {
        "id": "6c6b63742ef59905",
        "type": "change",
        "z": "1f2d93215d29f7c3",
        "name": "",
        "rules": [
            {
                "t": "set",
                "p": "latestObservation",
                "pt": "msg",
                "to": "payload.value[0].result",
                "tot": "msg"
            }
        ],
        "action": "",
        "property": "",
        "from": "",
        "to": "",
        "reg": false,
        "x": 700,
        "y": 140,
        "wires": [
            []
        ]
    },
    {
        "id": "59f4a6839a78dfcd",
        "type": "catch",
        "z": "1f2d93215d29f7c3",
        "name": "",
        "scope": null,
        "uncaught": false,
        "x": 360,
        "y": 300,
        "wires": [
            [
                "84b45ca970968870"
            ]
        ]
    },
    {
        "id": "84b45ca970968870",
        "type": "debug",
        "z": "1f2d93215d29f7c3",
        "name": "debug 20",
        "active": true,
        "tosidebar": true,
        "console": false,
        "tostatus": false,
        "complete": "true",
        "targetType": "full",
        "statusVal": "",
        "statusType": "auto",
        "x": 600,
        "y": 300,
        "wires": []
    },
    {
        "id": "1ab102e6070c038c",
        "type": "subflow:95dbc532074f1e81",
        "z": "1f2d93215d29f7c3",
        "name": "",
        "x": 170,
        "y": 400,
        "wires": [
            [
                "6c6b63742ef59905"
            ]
        ]
    },
    {
        "id": "013186437e521c0e",
        "type": "change",
        "z": "1f2d93215d29f7c3",
        "name": "",
        "rules": [
            {
                "t": "set",
                "p": "frost_call",
                "pt": "msg",
                "to": "frost_url&\"/v1.1/Observations?$filter=Datastream/name eq '\"& latestObservationDatastream&\"'&$expand=Datastream/Thing&$orderBy=resultTime%20desc&$top=1\"",
                "tot": "jsonata"
            },
            {
                "t": "set",
                "p": "method",
                "pt": "msg",
                "to": "GET",
                "tot": "str"
            }
        ],
        "action": "",
        "property": "",
        "from": "",
        "to": "",
        "reg": false,
        "x": 170,
        "y": 340,
        "wires": [
            [
                "1ab102e6070c038c"
            ]
        ]
    },
    {
        "id": "abe04f3e63507447",
        "type": "subflow",
        "name": "get or create featureOfInterest",
        "info": "",
        "category": "FROST-Server",
        "in": [
            {
                "x": 50,
                "y": 30,
                "wires": [
                    {
                        "id": "6ea9f1b105d9bc56"
                    }
                ]
            }
        ],
        "out": [
            {
                "x": 1340,
                "y": 100,
                "wires": [
                    {
                        "id": "102b859a03466786",
                        "port": 0
                    }
                ]
            }
        ],
        "env": [],
        "meta": {
            "module": "FROST-Server-write",
            "version": "0.1",
            "desc": "A set of nodes to write observations to a FROST-Server"
        },
        "color": "#DDAA99",
        "icon": "font-awesome/fa-eye"
    },
    {
        "id": "102b859a03466786",
        "type": "function",
        "z": "abe04f3e63507447",
        "name": "extract iot id to payload",
        "func": "msg.featureOfInterest.id = msg.payload.value[0][\"@iot.id\"]\nreturn msg;",
        "outputs": 1,
        "noerr": 0,
        "initialize": "",
        "finalize": "",
        "libs": [],
        "x": 1150,
        "y": 100,
        "wires": [
            []
        ]
    },
    {
        "id": "c90a06c08b4d7b0d",
        "type": "debug",
        "z": "abe04f3e63507447",
        "name": "debug featureOfInterest",
        "active": true,
        "tosidebar": true,
        "console": false,
        "tostatus": false,
        "complete": "true",
        "targetType": "full",
        "statusVal": "",
        "statusType": "auto",
        "x": 1270,
        "y": 780,
        "wires": []
    },
    {
        "id": "2a9c9dd3cfb138bd",
        "type": "function",
        "z": "abe04f3e63507447",
        "name": "featureOfInterest to payload",
        "func": "msg.payload=new Object();\nmsg.payload.name = msg.featureOfInterest.name;\nmsg.payload.description = msg.featureOfInterest.description;\nmsg.payload.encodingType = msg.featureOfInterest.encodingType;\nmsg.payload.feature = msg.featureOfInterest.feature;\nreturn msg;",
        "outputs": 1,
        "noerr": 0,
        "initialize": "",
        "finalize": "",
        "libs": [],
        "x": 400,
        "y": 180,
        "wires": [
            [
                "bce8983be5ce64a5"
            ]
        ]
    },
    {
        "id": "0b45c37e6d2210dd",
        "type": "switch",
        "z": "abe04f3e63507447",
        "name": "featureOfInterest existing?",
        "property": "payload.value",
        "propertyType": "msg",
        "rules": [
            {
                "t": "nempty"
            },
            {
                "t": "empty"
            }
        ],
        "checkall": "true",
        "repair": false,
        "outputs": 2,
        "x": 320,
        "y": 100,
        "wires": [
            [
                "102b859a03466786"
            ],
            [
                "2a9c9dd3cfb138bd"
            ]
        ]
    },
    {
        "id": "bce8983be5ce64a5",
        "type": "json",
        "z": "abe04f3e63507447",
        "name": "",
        "property": "payload",
        "action": "",
        "pretty": false,
        "x": 610,
        "y": 180,
        "wires": [
            [
                "77662c17921674c3"
            ]
        ]
    },
    {
        "id": "045847d9fe55e62b",
        "type": "catch",
        "z": "abe04f3e63507447",
        "name": "",
        "scope": null,
        "uncaught": false,
        "x": 1140,
        "y": 640,
        "wires": [
            [
                "c90a06c08b4d7b0d"
            ]
        ]
    },
    {
        "id": "6ea9f1b105d9bc56",
        "type": "change",
        "z": "abe04f3e63507447",
        "name": "",
        "rules": [
            {
                "t": "set",
                "p": "frost_call",
                "pt": "msg",
                "to": "frost_url&\"/v1.1/FeaturesOfInterest?$filter=name%20eq%20'\"&featureOfInterest.name&\"'\"",
                "tot": "jsonata"
            },
            {
                "t": "set",
                "p": "method",
                "pt": "msg",
                "to": "GET",
                "tot": "str"
            }
        ],
        "action": "",
        "property": "",
        "from": "",
        "to": "",
        "reg": false,
        "x": 230,
        "y": 460,
        "wires": [
            [
                "b91baacac924e3a2"
            ]
        ]
    },
    {
        "id": "b91baacac924e3a2",
        "type": "subflow:95dbc532074f1e81",
        "z": "abe04f3e63507447",
        "name": "",
        "x": 230,
        "y": 520,
        "wires": [
            [
                "0b45c37e6d2210dd"
            ]
        ]
    },
    {
        "id": "30bd329e83c36cb0",
        "type": "subflow:95dbc532074f1e81",
        "z": "abe04f3e63507447",
        "name": "",
        "x": 570,
        "y": 520,
        "wires": [
            [
                "54cd2968b3f8bb80"
            ]
        ]
    },
    {
        "id": "77662c17921674c3",
        "type": "change",
        "z": "abe04f3e63507447",
        "name": "",
        "rules": [
            {
                "t": "set",
                "p": "frost_call",
                "pt": "msg",
                "to": "frost_url&\"/v1.1/FeaturesOfInterest\"",
                "tot": "jsonata"
            },
            {
                "t": "set",
                "p": "method",
                "pt": "msg",
                "to": "POST",
                "tot": "str"
            }
        ],
        "action": "",
        "property": "",
        "from": "",
        "to": "",
        "reg": false,
        "x": 570,
        "y": 460,
        "wires": [
            [
                "30bd329e83c36cb0"
            ]
        ]
    },
    {
        "id": "38cc6a94f1bb88db",
        "type": "subflow:95dbc532074f1e81",
        "z": "abe04f3e63507447",
        "name": "",
        "x": 810,
        "y": 520,
        "wires": [
            [
                "102b859a03466786"
            ]
        ]
    },
    {
        "id": "54cd2968b3f8bb80",
        "type": "change",
        "z": "abe04f3e63507447",
        "name": "",
        "rules": [
            {
                "t": "set",
                "p": "frost_call",
                "pt": "msg",
                "to": "frost_url&\"/v1.1/FeaturesOfInterest?$filter=name%20eq%20'\"&featureOfInterest.name&\"'\"",
                "tot": "jsonata"
            },
            {
                "t": "set",
                "p": "method",
                "pt": "msg",
                "to": "GET",
                "tot": "str"
            }
        ],
        "action": "",
        "property": "",
        "from": "",
        "to": "",
        "reg": false,
        "x": 810,
        "y": 460,
        "wires": [
            [
                "38cc6a94f1bb88db"
            ]
        ]
    },
    {
        "id": "059f3e4ef08b79dd",
        "type": "subflow",
        "name": "write observation",
        "info": "",
        "category": "FROST-Server",
        "in": [
            {
                "x": 80,
                "y": 120,
                "wires": [
                    {
                        "id": "8d912168f13f281e"
                    }
                ]
            }
        ],
        "out": [
            {
                "x": 880,
                "y": 120,
                "wires": [
                    {
                        "id": "8481049845e42692",
                        "port": 0
                    }
                ]
            }
        ],
        "env": [],
        "meta": {
            "module": "FROST-Server-write"
        },
        "color": "#DDAA99",
        "icon": "font-awesome/fa-database"
    },
    {
        "id": "30a5330331fb69e9",
        "type": "debug",
        "z": "059f3e4ef08b79dd",
        "name": "debug 10",
        "active": true,
        "tosidebar": true,
        "console": false,
        "tostatus": false,
        "complete": "true",
        "targetType": "full",
        "statusVal": "",
        "statusType": "auto",
        "x": 540,
        "y": 220,
        "wires": []
    },
    {
        "id": "8d912168f13f281e",
        "type": "function",
        "z": "059f3e4ef08b79dd",
        "name": "thing to payload",
        "func": "msg.payload=new Object();\nmsg.payload.result = msg.observation.result;\nmsg.payload.phenomenonTime = msg.observation.phenomenonTime;\nmsg.payload.resultTime = msg.observation.resultTime;\nmsg.payload.FeatureOfInterest = {\"@iot.id\":msg.featureOfInterest.id};\nmsg.payload.Datastream = { \"@iot.id\": msg.datastream.id };\n\nreturn msg;",
        "outputs": 1,
        "noerr": 0,
        "initialize": "",
        "finalize": "",
        "libs": [],
        "x": 260,
        "y": 120,
        "wires": [
            [
                "21e53d1714d19077"
            ]
        ]
    },
    {
        "id": "21e53d1714d19077",
        "type": "json",
        "z": "059f3e4ef08b79dd",
        "name": "",
        "property": "payload",
        "action": "",
        "pretty": false,
        "x": 430,
        "y": 120,
        "wires": [
            [
                "82afe4a89bfa6335"
            ]
        ]
    },
    {
        "id": "633d64e15081ea5d",
        "type": "catch",
        "z": "059f3e4ef08b79dd",
        "name": "",
        "scope": null,
        "uncaught": false,
        "x": 320,
        "y": 220,
        "wires": [
            [
                "30a5330331fb69e9"
            ]
        ]
    },
    {
        "id": "82afe4a89bfa6335",
        "type": "change",
        "z": "059f3e4ef08b79dd",
        "name": "",
        "rules": [
            {
                "t": "set",
                "p": "frost_call",
                "pt": "msg",
                "to": "frost_url&\"/v1.1/Observations\"",
                "tot": "jsonata"
            },
            {
                "t": "set",
                "p": "method",
                "pt": "msg",
                "to": "POST",
                "tot": "str"
            }
        ],
        "action": "",
        "property": "",
        "from": "",
        "to": "",
        "reg": false,
        "x": 530,
        "y": 340,
        "wires": [
            [
                "8481049845e42692"
            ]
        ]
    },
    {
        "id": "8481049845e42692",
        "type": "subflow:95dbc532074f1e81",
        "z": "059f3e4ef08b79dd",
        "name": "",
        "x": 530,
        "y": 400,
        "wires": [
            []
        ]
    },
    {
        "id": "9a7dfc39cf7aaa5e",
        "type": "subflow",
        "name": "get or create location",
        "info": "",
        "category": "FROST-Server",
        "in": [
            {
                "x": 50,
                "y": 30,
                "wires": [
                    {
                        "id": "5f7bd2092c4444d3"
                    }
                ]
            }
        ],
        "out": [
            {
                "x": 1320,
                "y": 720,
                "wires": [
                    {
                        "id": "dac859b80e4cdcfe",
                        "port": 0
                    },
                    {
                        "id": "86a12a777ef75ee0",
                        "port": 0
                    },
                    {
                        "id": "16ec5c251622fea8",
                        "port": 0
                    },
                    {
                        "id": "37ec8f554173dfa4",
                        "port": 0
                    },
                    {
                        "id": "8f587c4ff2360d45",
                        "port": 0
                    }
                ]
            }
        ],
        "env": [],
        "meta": {
            "module": "FROST-Server-write"
        },
        "color": "#DDAA99",
        "icon": "node-red/white-globe.svg"
    },
    {
        "id": "a49f784962d824d4",
        "type": "function",
        "z": "9a7dfc39cf7aaa5e",
        "name": "extract iot id to payload",
        "func": "msg.location.id = msg.payload.value[0][\"@iot.id\"]\nreturn msg;",
        "outputs": 1,
        "noerr": 0,
        "initialize": "",
        "finalize": "",
        "libs": [],
        "x": 610,
        "y": 620,
        "wires": [
            [
                "dac859b80e4cdcfe"
            ]
        ]
    },
    {
        "id": "eec1cf4b39a82c3f",
        "type": "debug",
        "z": "9a7dfc39cf7aaa5e",
        "name": "debug 9",
        "active": true,
        "tosidebar": true,
        "console": false,
        "tostatus": false,
        "complete": "true",
        "targetType": "full",
        "statusVal": "",
        "statusType": "auto",
        "x": 1160,
        "y": 320,
        "wires": []
    },
    {
        "id": "ade4dbe547bf0dde",
        "type": "function",
        "z": "9a7dfc39cf7aaa5e",
        "name": "location to payload",
        "func": "msg.payload=new Object();\nmsg.payload.name = msg.location.name;\nmsg.payload.description = msg.location.description;\nmsg.payload.encodingType = msg.location.encodingType;\nmsg.payload.location = msg.location.location;\nmsg.payload.Things=[{\"@iot.id\":msg.thing.id}]\nreturn msg;",
        "outputs": 1,
        "noerr": 0,
        "initialize": "",
        "finalize": "",
        "libs": [],
        "x": 250,
        "y": 480,
        "wires": [
            [
                "a71dee8bbfebee06"
            ]
        ]
    },
    {
        "id": "b7bd17d7100d0f67",
        "type": "switch",
        "z": "9a7dfc39cf7aaa5e",
        "name": "location existing?",
        "property": "payload.value",
        "propertyType": "msg",
        "rules": [
            {
                "t": "nempty"
            },
            {
                "t": "empty"
            }
        ],
        "checkall": "true",
        "repair": false,
        "outputs": 2,
        "x": 250,
        "y": 420,
        "wires": [
            [
                "37ec8f554173dfa4",
                "eec1cf4b39a82c3f"
            ],
            [
                "ade4dbe547bf0dde"
            ]
        ]
    },
    {
        "id": "a71dee8bbfebee06",
        "type": "json",
        "z": "9a7dfc39cf7aaa5e",
        "name": "",
        "property": "payload",
        "action": "",
        "pretty": false,
        "x": 210,
        "y": 540,
        "wires": [
            [
                "03e4a6152c6dc9c9"
            ]
        ]
    },
    {
        "id": "8f587c4ff2360d45",
        "type": "catch",
        "z": "9a7dfc39cf7aaa5e",
        "name": "",
        "scope": null,
        "uncaught": false,
        "x": 940,
        "y": 300,
        "wires": [
            [
                "eec1cf4b39a82c3f"
            ]
        ]
    },
    {
        "id": "5f7bd2092c4444d3",
        "type": "change",
        "z": "9a7dfc39cf7aaa5e",
        "name": "",
        "rules": [
            {
                "t": "set",
                "p": "frost_call",
                "pt": "msg",
                "to": "frost_url&\"/v1.1/Locations?$filter=name%20eq%20'\"&location.name&\"'\"",
                "tot": "jsonata"
            },
            {
                "t": "set",
                "p": "method",
                "pt": "msg",
                "to": "GET",
                "tot": "str"
            }
        ],
        "action": "",
        "property": "",
        "from": "",
        "to": "",
        "reg": false,
        "x": 230,
        "y": 300,
        "wires": [
            [
                "8b89c32f9d0986a7"
            ]
        ]
    },
    {
        "id": "8b89c32f9d0986a7",
        "type": "subflow:95dbc532074f1e81",
        "z": "9a7dfc39cf7aaa5e",
        "name": "",
        "x": 230,
        "y": 360,
        "wires": [
            [
                "b7bd17d7100d0f67",
                "eec1cf4b39a82c3f"
            ]
        ]
    },
    {
        "id": "03e4a6152c6dc9c9",
        "type": "change",
        "z": "9a7dfc39cf7aaa5e",
        "name": "",
        "rules": [
            {
                "t": "set",
                "p": "frost_call",
                "pt": "msg",
                "to": "frost_url&\"/v1.1/Locations\"",
                "tot": "jsonata"
            },
            {
                "t": "set",
                "p": "method",
                "pt": "msg",
                "to": "POST",
                "tot": "str"
            }
        ],
        "action": "",
        "property": "",
        "from": "",
        "to": "",
        "reg": false,
        "x": 250,
        "y": 600,
        "wires": [
            [
                "5f49bbe0f5ce8af4"
            ]
        ]
    },
    {
        "id": "5f49bbe0f5ce8af4",
        "type": "subflow:95dbc532074f1e81",
        "z": "9a7dfc39cf7aaa5e",
        "name": "",
        "x": 250,
        "y": 660,
        "wires": [
            [
                "98a6e2ca67ebf1e4"
            ]
        ]
    },
    {
        "id": "98a6e2ca67ebf1e4",
        "type": "change",
        "z": "9a7dfc39cf7aaa5e",
        "name": "",
        "rules": [
            {
                "t": "set",
                "p": "frost_call",
                "pt": "msg",
                "to": "frost_url&\"/v1.1/Locations?$filter=name%20eq%20'\"&location.name&\"'\"",
                "tot": "jsonata"
            },
            {
                "t": "set",
                "p": "method",
                "pt": "msg",
                "to": "GET",
                "tot": "str"
            }
        ],
        "action": "",
        "property": "",
        "from": "",
        "to": "",
        "reg": false,
        "x": 250,
        "y": 720,
        "wires": [
            [
                "93d59c4f3ec495c0"
            ]
        ]
    },
    {
        "id": "93d59c4f3ec495c0",
        "type": "subflow:95dbc532074f1e81",
        "z": "9a7dfc39cf7aaa5e",
        "name": "",
        "x": 250,
        "y": 780,
        "wires": [
            [
                "a49f784962d824d4"
            ]
        ]
    },
    {
        "id": "dac859b80e4cdcfe",
        "type": "switch",
        "z": "9a7dfc39cf7aaa5e",
        "name": "Thing gesetzt?",
        "property": "thing.id",
        "propertyType": "msg",
        "rules": [
            {
                "t": "empty"
            },
            {
                "t": "nempty"
            }
        ],
        "checkall": "true",
        "repair": false,
        "outputs": 2,
        "x": 600,
        "y": 680,
        "wires": [
            [],
            [
                "86a12a777ef75ee0"
            ]
        ]
    },
    {
        "id": "86a12a777ef75ee0",
        "type": "switch",
        "z": "9a7dfc39cf7aaa5e",
        "name": "Location gesetzt?",
        "property": "location.id",
        "propertyType": "msg",
        "rules": [
            {
                "t": "empty"
            },
            {
                "t": "nempty"
            }
        ],
        "checkall": "true",
        "repair": false,
        "outputs": 2,
        "x": 630,
        "y": 740,
        "wires": [
            [],
            [
                "1e0b2bada3b4cb8d"
            ]
        ]
    },
    {
        "id": "1e0b2bada3b4cb8d",
        "type": "switch",
        "z": "9a7dfc39cf7aaa5e",
        "name": "Result Time gesetzt?",
        "property": "observation.resultTime",
        "propertyType": "msg",
        "rules": [
            {
                "t": "nempty"
            },
            {
                "t": "empty"
            }
        ],
        "checkall": "true",
        "repair": false,
        "outputs": 2,
        "x": 680,
        "y": 800,
        "wires": [
            [
                "68158beb22c29fa7"
            ],
            [
                "08afa57b0a306942"
            ]
        ]
    },
    {
        "id": "08afa57b0a306942",
        "type": "switch",
        "z": "9a7dfc39cf7aaa5e",
        "name": "Phenomenon Time gesetzt?",
        "property": "observation.phenomenonTime",
        "propertyType": "msg",
        "rules": [
            {
                "t": "nempty"
            },
            {
                "t": "empty"
            }
        ],
        "checkall": "true",
        "repair": false,
        "outputs": 2,
        "x": 720,
        "y": 860,
        "wires": [
            [
                "17ef3460c087b5c9"
            ],
            [
                "fd7a6edcc9074143"
            ]
        ]
    },
    {
        "id": "fd7a6edcc9074143",
        "type": "moment",
        "z": "9a7dfc39cf7aaa5e",
        "name": "",
        "topic": "",
        "input": "",
        "inputType": "date",
        "inTz": "Europe/Berlin",
        "adjAmount": 0,
        "adjType": "days",
        "adjDir": "add",
        "format": "YYYY-MM-DDTHH:mm:ssZ",
        "locale": "de-DE",
        "output": "historicalLocation",
        "outputType": "msg",
        "outTz": "Europe/Berlin",
        "x": 1020,
        "y": 920,
        "wires": [
            [
                "77f12fa348709c77"
            ]
        ]
    },
    {
        "id": "68158beb22c29fa7",
        "type": "change",
        "z": "9a7dfc39cf7aaa5e",
        "name": "",
        "rules": [
            {
                "t": "set",
                "p": "historicalLocation",
                "pt": "msg",
                "to": "observation.resultTime",
                "tot": "msg"
            }
        ],
        "action": "",
        "property": "",
        "from": "",
        "to": "",
        "reg": false,
        "x": 1040,
        "y": 800,
        "wires": [
            [
                "77f12fa348709c77"
            ]
        ]
    },
    {
        "id": "17ef3460c087b5c9",
        "type": "change",
        "z": "9a7dfc39cf7aaa5e",
        "name": "",
        "rules": [
            {
                "t": "set",
                "p": "historicalLocation",
                "pt": "msg",
                "to": "observation.phenomenonTime",
                "tot": "msg"
            }
        ],
        "action": "",
        "property": "",
        "from": "",
        "to": "",
        "reg": false,
        "x": 1040,
        "y": 860,
        "wires": [
            [
                "77f12fa348709c77"
            ]
        ]
    },
    {
        "id": "77f12fa348709c77",
        "type": "function",
        "z": "9a7dfc39cf7aaa5e",
        "name": "location to payload",
        "func": "msg.payload=new Object();\nmsg.payload.time = msg.historicalLocation.time;\nmsg.payload.Things = [{ \"@iot.id\": msg.thing.id }];\nmsg.payload.Locations = [{ \"@iot.id\": msg.location.id }];\nreturn msg;",
        "outputs": 1,
        "noerr": 0,
        "initialize": "",
        "finalize": "",
        "libs": [],
        "x": 1070,
        "y": 1000,
        "wires": [
            [
                "ed133d84e233b91d"
            ]
        ]
    },
    {
        "id": "ed133d84e233b91d",
        "type": "change",
        "z": "9a7dfc39cf7aaa5e",
        "name": "",
        "rules": [
            {
                "t": "set",
                "p": "frost_call",
                "pt": "msg",
                "to": "frost_url&\"/v1.1/HistoricalLocations\"",
                "tot": "jsonata"
            },
            {
                "t": "set",
                "p": "method",
                "pt": "msg",
                "to": "POST",
                "tot": "str"
            }
        ],
        "action": "",
        "property": "",
        "from": "",
        "to": "",
        "reg": false,
        "x": 1119,
        "y": 1052,
        "wires": [
            [
                "16ec5c251622fea8"
            ]
        ]
    },
    {
        "id": "16ec5c251622fea8",
        "type": "subflow:95dbc532074f1e81",
        "z": "9a7dfc39cf7aaa5e",
        "name": "",
        "x": 1119,
        "y": 1112,
        "wires": [
            []
        ]
    },
    {
        "id": "37ec8f554173dfa4",
        "type": "function",
        "z": "9a7dfc39cf7aaa5e",
        "name": "extract iot id to payload",
        "func": "msg.location.id = msg.payload[\"@iot.id\"]\nreturn msg;",
        "outputs": 1,
        "noerr": 0,
        "initialize": "",
        "finalize": "",
        "libs": [],
        "x": 610,
        "y": 540,
        "wires": [
            []
        ]
    },
    {
        "id": "dcf15c8830e5cfe9",
        "type": "subflow",
        "name": "get or create sensor",
        "info": "",
        "category": "FROST-Server",
        "in": [
            {
                "x": 50,
                "y": 30,
                "wires": [
                    {
                        "id": "a9563368a85cb5e3"
                    }
                ]
            }
        ],
        "out": [
            {
                "x": 980,
                "y": 180,
                "wires": [
                    {
                        "id": "565bb7571d74b6e8",
                        "port": 0
                    }
                ]
            }
        ],
        "env": [],
        "meta": {
            "module": "FROST-Server-write"
        },
        "color": "#DDAA99",
        "icon": "font-awesome/fa-thermometer-2"
    },
    {
        "id": "565bb7571d74b6e8",
        "type": "function",
        "z": "dcf15c8830e5cfe9",
        "name": "extract iot id to payload",
        "func": "msg.sensor.id = msg.payload.value[0][\"@iot.id\"]\nreturn msg;",
        "outputs": 1,
        "noerr": 0,
        "initialize": "",
        "finalize": "",
        "libs": [],
        "x": 1110,
        "y": 300,
        "wires": [
            []
        ]
    },
    {
        "id": "ba509bdd5ef32520",
        "type": "debug",
        "z": "dcf15c8830e5cfe9",
        "name": "debug 8",
        "active": true,
        "tosidebar": true,
        "console": false,
        "tostatus": false,
        "complete": "true",
        "targetType": "full",
        "statusVal": "",
        "statusType": "auto",
        "x": 1060,
        "y": 440,
        "wires": []
    },
    {
        "id": "1f4b6abb9af61fb9",
        "type": "function",
        "z": "dcf15c8830e5cfe9",
        "name": "sensor to payload",
        "func": "msg.payload=new Object();\nmsg.payload.name = msg.sensor.name;\nmsg.payload.description = msg.sensor.description;\nmsg.payload.encodingType = msg.sensor.encodingType;\nmsg.payload.metadata = msg.sensor.metadata;\nreturn msg;",
        "outputs": 1,
        "noerr": 0,
        "initialize": "",
        "finalize": "",
        "libs": [],
        "x": 530,
        "y": 360,
        "wires": [
            [
                "ee6c236e183b0acb"
            ]
        ]
    },
    {
        "id": "d40b96296c1cd414",
        "type": "switch",
        "z": "dcf15c8830e5cfe9",
        "name": "sensor existing?",
        "property": "payload.value",
        "propertyType": "msg",
        "rules": [
            {
                "t": "nempty"
            },
            {
                "t": "empty"
            }
        ],
        "checkall": "true",
        "repair": false,
        "outputs": 2,
        "x": 300,
        "y": 300,
        "wires": [
            [
                "565bb7571d74b6e8"
            ],
            [
                "1f4b6abb9af61fb9"
            ]
        ]
    },
    {
        "id": "ee6c236e183b0acb",
        "type": "json",
        "z": "dcf15c8830e5cfe9",
        "name": "",
        "property": "payload",
        "action": "",
        "pretty": false,
        "x": 690,
        "y": 360,
        "wires": [
            [
                "48141bdc95c90fe8"
            ]
        ]
    },
    {
        "id": "4a2eeff3475c6937",
        "type": "catch",
        "z": "dcf15c8830e5cfe9",
        "name": "",
        "scope": null,
        "uncaught": false,
        "x": 840,
        "y": 440,
        "wires": [
            [
                "ba509bdd5ef32520"
            ]
        ]
    },
    {
        "id": "a9563368a85cb5e3",
        "type": "change",
        "z": "dcf15c8830e5cfe9",
        "name": "",
        "rules": [
            {
                "t": "set",
                "p": "frost_call",
                "pt": "msg",
                "to": "frost_url&\"/v1.1/Sensors?$filter=name%20eq%20'\"&sensor.name&\"'\"",
                "tot": "jsonata"
            },
            {
                "t": "set",
                "p": "method",
                "pt": "msg",
                "to": "GET",
                "tot": "str"
            }
        ],
        "action": "",
        "property": "",
        "from": "",
        "to": "",
        "reg": false,
        "x": 150,
        "y": 380,
        "wires": [
            [
                "0e0b371967838195"
            ]
        ]
    },
    {
        "id": "48141bdc95c90fe8",
        "type": "change",
        "z": "dcf15c8830e5cfe9",
        "name": "",
        "rules": [
            {
                "t": "set",
                "p": "frost_call",
                "pt": "msg",
                "to": "frost_url&\"/v1.1/Sensors\"",
                "tot": "jsonata"
            },
            {
                "t": "set",
                "p": "method",
                "pt": "msg",
                "to": "POST",
                "tot": "str"
            }
        ],
        "action": "",
        "property": "",
        "from": "",
        "to": "",
        "reg": false,
        "x": 890,
        "y": 520,
        "wires": [
            [
                "2dae9695c59f591d"
            ]
        ]
    },
    {
        "id": "be26070a29ca3100",
        "type": "change",
        "z": "dcf15c8830e5cfe9",
        "name": "",
        "rules": [
            {
                "t": "set",
                "p": "frost_call",
                "pt": "msg",
                "to": "frost_url&\"/v1.1/Sensors?$filter=name%20eq%20'\"&sensor.name&\"'\"",
                "tot": "jsonata"
            },
            {
                "t": "set",
                "p": "method",
                "pt": "msg",
                "to": "GET",
                "tot": "str"
            }
        ],
        "action": "",
        "property": "",
        "from": "",
        "to": "",
        "reg": false,
        "x": 1190,
        "y": 520,
        "wires": [
            [
                "d97df90b9fdd4359"
            ]
        ]
    },
    {
        "id": "0e0b371967838195",
        "type": "subflow:95dbc532074f1e81",
        "z": "dcf15c8830e5cfe9",
        "name": "",
        "x": 130,
        "y": 440,
        "wires": [
            [
                "d40b96296c1cd414"
            ]
        ]
    },
    {
        "id": "2dae9695c59f591d",
        "type": "subflow:95dbc532074f1e81",
        "z": "dcf15c8830e5cfe9",
        "name": "",
        "x": 890,
        "y": 600,
        "wires": [
            [
                "be26070a29ca3100"
            ]
        ]
    },
    {
        "id": "d97df90b9fdd4359",
        "type": "subflow:95dbc532074f1e81",
        "z": "dcf15c8830e5cfe9",
        "name": "",
        "x": 1190,
        "y": 600,
        "wires": [
            [
                "565bb7571d74b6e8"
            ]
        ]
    },
    {
        "id": "09f4a163ad3eea4d",
        "type": "subflow",
        "name": "get or create observedProperty",
        "info": "",
        "category": "FROST-Server",
        "in": [
            {
                "x": 50,
                "y": 30,
                "wires": [
                    {
                        "id": "6f8a7d9df26ab15a"
                    }
                ]
            }
        ],
        "out": [
            {
                "x": 980,
                "y": 40,
                "wires": [
                    {
                        "id": "9c7a3f7ca979fdb9",
                        "port": 0
                    }
                ]
            }
        ],
        "env": [],
        "meta": {
            "module": "FROST-Server-write"
        },
        "color": "#DDAA99",
        "icon": "font-awesome/fa-sliders"
    },
    {
        "id": "9c7a3f7ca979fdb9",
        "type": "function",
        "z": "09f4a163ad3eea4d",
        "name": "extract iot id to payload",
        "func": "msg.observedProperty.id = msg.payload.value[0][\"@iot.id\"]\nreturn msg;",
        "outputs": 1,
        "noerr": 0,
        "initialize": "",
        "finalize": "",
        "libs": [],
        "x": 1150,
        "y": 140,
        "wires": [
            []
        ]
    },
    {
        "id": "62fdf591d41e05ca",
        "type": "function",
        "z": "09f4a163ad3eea4d",
        "name": "observedProperty to payload",
        "func": "msg.payload=new Object();\nmsg.payload.name = msg.observedProperty.name;\nmsg.payload.description = msg.observedProperty.description;\nmsg.payload.definition = msg.observedProperty.definition;\nreturn msg;",
        "outputs": 1,
        "noerr": 0,
        "initialize": "",
        "finalize": "",
        "libs": [],
        "x": 600,
        "y": 200,
        "wires": [
            [
                "c9ec0d5b47925e33"
            ]
        ]
    },
    {
        "id": "acdce267aa0560df",
        "type": "switch",
        "z": "09f4a163ad3eea4d",
        "name": "observedProperty existing?",
        "property": "payload.value",
        "propertyType": "msg",
        "rules": [
            {
                "t": "nempty"
            },
            {
                "t": "empty"
            }
        ],
        "checkall": "true",
        "repair": false,
        "outputs": 2,
        "x": 380,
        "y": 140,
        "wires": [
            [
                "9c7a3f7ca979fdb9"
            ],
            [
                "62fdf591d41e05ca"
            ]
        ]
    },
    {
        "id": "c9ec0d5b47925e33",
        "type": "json",
        "z": "09f4a163ad3eea4d",
        "name": "",
        "property": "payload",
        "action": "",
        "pretty": false,
        "x": 730,
        "y": 280,
        "wires": [
            [
                "5eaa4189088eb3e1"
            ]
        ]
    },
    {
        "id": "3e4b3c9370f8690f",
        "type": "debug",
        "z": "09f4a163ad3eea4d",
        "name": "debug 7",
        "active": true,
        "tosidebar": true,
        "console": false,
        "tostatus": false,
        "complete": "false",
        "statusVal": "",
        "statusType": "auto",
        "x": 180,
        "y": 480,
        "wires": []
    },
    {
        "id": "6f8a7d9df26ab15a",
        "type": "change",
        "z": "09f4a163ad3eea4d",
        "name": "",
        "rules": [
            {
                "t": "set",
                "p": "frost_call",
                "pt": "msg",
                "to": "frost_url&\"/v1.1/ObservedProperties?$filter=name%20eq%20'\"&observedProperty.name&\"'\"",
                "tot": "jsonata"
            },
            {
                "t": "set",
                "p": "method",
                "pt": "msg",
                "to": "GET",
                "tot": "str"
            }
        ],
        "action": "",
        "property": "",
        "from": "",
        "to": "",
        "reg": false,
        "x": 150,
        "y": 240,
        "wires": [
            [
                "f1544b1075d273ee"
            ]
        ]
    },
    {
        "id": "5eaa4189088eb3e1",
        "type": "change",
        "z": "09f4a163ad3eea4d",
        "name": "",
        "rules": [
            {
                "t": "set",
                "p": "frost_call",
                "pt": "msg",
                "to": "frost_url&\"/v1.1/ObservedProperties\"",
                "tot": "jsonata"
            },
            {
                "t": "set",
                "p": "method",
                "pt": "msg",
                "to": "POST",
                "tot": "str"
            }
        ],
        "action": "",
        "property": "",
        "from": "",
        "to": "",
        "reg": false,
        "x": 1010,
        "y": 320,
        "wires": [
            [
                "60fb93c3eb87c74c"
            ]
        ]
    },
    {
        "id": "f42325e656ba9444",
        "type": "change",
        "z": "09f4a163ad3eea4d",
        "name": "",
        "rules": [
            {
                "t": "set",
                "p": "frost_call",
                "pt": "msg",
                "to": "frost_url&\"/v1.1/ObservedProperties?$filter=name%20eq%20'\"&observedProperty.name&\"'\"",
                "tot": "jsonata"
            },
            {
                "t": "set",
                "p": "method",
                "pt": "msg",
                "to": "GET",
                "tot": "str"
            }
        ],
        "action": "",
        "property": "",
        "from": "",
        "to": "",
        "reg": false,
        "x": 1330,
        "y": 320,
        "wires": [
            [
                "46bea703d3623b4b"
            ]
        ]
    },
    {
        "id": "f1544b1075d273ee",
        "type": "subflow:95dbc532074f1e81",
        "z": "09f4a163ad3eea4d",
        "name": "",
        "x": 190,
        "y": 300,
        "wires": [
            [
                "acdce267aa0560df",
                "3e4b3c9370f8690f"
            ]
        ]
    },
    {
        "id": "60fb93c3eb87c74c",
        "type": "subflow:95dbc532074f1e81",
        "z": "09f4a163ad3eea4d",
        "name": "",
        "x": 1030,
        "y": 360,
        "wires": [
            [
                "f42325e656ba9444"
            ]
        ]
    },
    {
        "id": "46bea703d3623b4b",
        "type": "subflow:95dbc532074f1e81",
        "z": "09f4a163ad3eea4d",
        "name": "",
        "x": 1330,
        "y": 380,
        "wires": [
            [
                "9c7a3f7ca979fdb9"
            ]
        ]
    },
    {
        "id": "32540f96f402831d",
        "type": "subflow",
        "name": "get or create datastreams",
        "info": "",
        "category": "FROST-Server",
        "in": [
            {
                "x": 80,
                "y": 220,
                "wires": [
                    {
                        "id": "651ecb6a074ea5b0"
                    }
                ]
            }
        ],
        "out": [
            {
                "x": 1560,
                "y": 380,
                "wires": [
                    {
                        "id": "23c1592d898ad378",
                        "port": 0
                    }
                ]
            }
        ],
        "env": [],
        "meta": {
            "module": "FROST-Server-write"
        },
        "color": "#DDAA99",
        "icon": "node-red/status.svg"
    },
    {
        "id": "23c1592d898ad378",
        "type": "function",
        "z": "32540f96f402831d",
        "name": "extract iot id to payload",
        "func": "msg.datastream.id = msg.payload.value[0][\"@iot.id\"]\nreturn msg;",
        "outputs": 1,
        "noerr": 0,
        "initialize": "",
        "finalize": "",
        "libs": [],
        "x": 1330,
        "y": 380,
        "wires": [
            []
        ]
    },
    {
        "id": "8cd93c44f0a65834",
        "type": "debug",
        "z": "32540f96f402831d",
        "name": "debug 6",
        "active": true,
        "tosidebar": true,
        "console": false,
        "tostatus": false,
        "complete": "true",
        "targetType": "full",
        "statusVal": "",
        "statusType": "auto",
        "x": 1140,
        "y": 520,
        "wires": []
    },
    {
        "id": "4285d89f65693190",
        "type": "function",
        "z": "32540f96f402831d",
        "name": "datastream to payload",
        "func": "msg.payload=new Object();\nmsg.payload.name = msg.datastream.name;\nmsg.payload.description = msg.datastream.description;\nmsg.payload.observationType = msg.datastream.observationType;\nmsg.payload.unitOfMeasurement = new Object();\nmsg.payload.unitOfMeasurement.name = msg.datastream.unitOfMeasurement.name;\nmsg.payload.unitOfMeasurement.symbol = msg.datastream.unitOfMeasurement.symbol;\nmsg.payload.unitOfMeasurement.definition = msg.datastream.unitOfMeasurement.definition;\nmsg.payload.Thing = new Object();\nmsg.payload.Thing = {\"@iot.id\":msg.thing.id};\nmsg.payload.ObservedProperty = new Object();\nmsg.payload.ObservedProperty = {\"@iot.id\":msg.observedProperty.id};\nmsg.payload.Sensor = new Object();\nmsg.payload.Sensor = { \"@iot.id\": msg.sensor.id };\nreturn msg;",
        "outputs": 1,
        "noerr": 0,
        "initialize": "",
        "finalize": "",
        "libs": [],
        "x": 620,
        "y": 440,
        "wires": [
            [
                "fcbbb44fc16fd40c"
            ]
        ]
    },
    {
        "id": "5079db3949b1849a",
        "type": "switch",
        "z": "32540f96f402831d",
        "name": "datastream existing?",
        "property": "payload.value",
        "propertyType": "msg",
        "rules": [
            {
                "t": "nempty"
            },
            {
                "t": "empty"
            }
        ],
        "checkall": "true",
        "repair": false,
        "outputs": 2,
        "x": 480,
        "y": 380,
        "wires": [
            [
                "23c1592d898ad378"
            ],
            [
                "4285d89f65693190"
            ]
        ]
    },
    {
        "id": "fcbbb44fc16fd40c",
        "type": "json",
        "z": "32540f96f402831d",
        "name": "",
        "property": "payload",
        "action": "",
        "pretty": false,
        "x": 790,
        "y": 440,
        "wires": [
            [
                "551f565433c35820"
            ]
        ]
    },
    {
        "id": "7caff5f0a1ed230a",
        "type": "catch",
        "z": "32540f96f402831d",
        "name": "",
        "scope": null,
        "uncaught": false,
        "x": 920,
        "y": 520,
        "wires": [
            [
                "8cd93c44f0a65834"
            ]
        ]
    },
    {
        "id": "651ecb6a074ea5b0",
        "type": "change",
        "z": "32540f96f402831d",
        "name": "",
        "rules": [
            {
                "t": "set",
                "p": "frost_call",
                "pt": "msg",
                "to": "frost_url&\"/v1.1/Datastreams?$filter=name%20eq%20'\"&datastream.name&\"'\"",
                "tot": "jsonata"
            },
            {
                "t": "set",
                "p": "method",
                "pt": "msg",
                "to": "GET",
                "tot": "str"
            }
        ],
        "action": "",
        "property": "",
        "from": "",
        "to": "",
        "reg": false,
        "x": 230,
        "y": 280,
        "wires": [
            [
                "c381429b236b2c64"
            ]
        ]
    },
    {
        "id": "c381429b236b2c64",
        "type": "subflow:95dbc532074f1e81",
        "z": "32540f96f402831d",
        "name": "",
        "x": 230,
        "y": 340,
        "wires": [
            [
                "5079db3949b1849a"
            ]
        ]
    },
    {
        "id": "551f565433c35820",
        "type": "change",
        "z": "32540f96f402831d",
        "name": "",
        "rules": [
            {
                "t": "set",
                "p": "frost_call",
                "pt": "msg",
                "to": "frost_url&\"/v1.1/Datastreams\"",
                "tot": "jsonata"
            },
            {
                "t": "set",
                "p": "method",
                "pt": "msg",
                "to": "POST",
                "tot": "str"
            }
        ],
        "action": "",
        "property": "",
        "from": "",
        "to": "",
        "reg": false,
        "x": 1010,
        "y": 660,
        "wires": [
            [
                "64c34589ae8c21ce"
            ]
        ]
    },
    {
        "id": "69530c7c9e3c4c8d",
        "type": "change",
        "z": "32540f96f402831d",
        "name": "",
        "rules": [
            {
                "t": "set",
                "p": "frost_call",
                "pt": "msg",
                "to": "frost_url&\"/v1.1/Datastreams?$filter=name%20eq%20'\"&datastream.name&\"'\"",
                "tot": "jsonata"
            },
            {
                "t": "set",
                "p": "method",
                "pt": "msg",
                "to": "GET",
                "tot": "str"
            }
        ],
        "action": "",
        "property": "",
        "from": "",
        "to": "",
        "reg": false,
        "x": 1310,
        "y": 660,
        "wires": [
            [
                "68b2627cc0c493c0"
            ]
        ]
    },
    {
        "id": "64c34589ae8c21ce",
        "type": "subflow:95dbc532074f1e81",
        "z": "32540f96f402831d",
        "name": "",
        "x": 1010,
        "y": 720,
        "wires": [
            [
                "69530c7c9e3c4c8d"
            ]
        ]
    },
    {
        "id": "68b2627cc0c493c0",
        "type": "subflow:95dbc532074f1e81",
        "z": "32540f96f402831d",
        "name": "",
        "x": 1310,
        "y": 720,
        "wires": [
            [
                "23c1592d898ad378"
            ]
        ]
    },
    {
        "id": "95dbc532074f1e81",
        "type": "subflow",
        "name": "FROST Call",
        "info": "",
        "category": "FROST-Server",
        "in": [
            {
                "x": 140,
                "y": 80,
                "wires": [
                    {
                        "id": "61058a4e67c99b20"
                    }
                ]
            }
        ],
        "out": [
            {
                "x": 440,
                "y": 80,
                "wires": [
                    {
                        "id": "61058a4e67c99b20",
                        "port": 0
                    }
                ]
            }
        ],
        "env": [],
        "meta": {},
        "color": "#DDAA99",
        "icon": "font-awesome/fa-snowflake-o"
    },
    {
        "id": "61058a4e67c99b20",
        "type": "http request",
        "z": "95dbc532074f1e81",
        "name": "",
        "method": "use",
        "ret": "obj",
        "paytoqs": "ignore",
        "url": "{{{frost_call}}}",
        "tls": "f653fbc037e40592",
        "persist": false,
        "proxy": "",
        "insecureHTTPParser": false,
        "authType": "basic",
        "senderr": true,
        "headers": [],
        "x": 290,
        "y": 80,
        "wires": [
            []
        ]
    },
    {
        "id": "f653fbc037e40592",
        "type": "tls-config",
        "name": "TLS ohne Verifikation",
        "cert": "",
        "key": "",
        "ca": "",
        "certname": "",
        "keyname": "",
        "caname": "",
        "servername": "",
        "verifyservercert": false,
        "alpnprotocol": ""
    },
    {
        "id": "61ec79b66a2bf0e2",
        "type": "subflow",
        "name": "get or create thing",
        "info": "",
        "category": "FROST-Server",
        "in": [
            {
                "x": 160,
                "y": 120,
                "wires": [
                    {
                        "id": "1829a2240c9ef4ae"
                    }
                ]
            }
        ],
        "out": [
            {
                "x": 1740,
                "y": 120,
                "wires": [
                    {
                        "id": "2e229f50d9fc0395",
                        "port": 0
                    }
                ]
            }
        ],
        "env": [
            {
                "name": "thing_name",
                "type": "str",
                "value": "Kitchen",
                "ui": {
                    "type": "input",
                    "opts": {
                        "types": [
                            "str"
                        ]
                    }
                }
            }
        ],
        "meta": {
            "module": "FROST-Server-write"
        },
        "color": "#DDAA99",
        "inputLabels": [
            "thing_name"
        ],
        "icon": "font-awesome/fa-archive"
    },
    {
        "id": "2e229f50d9fc0395",
        "type": "function",
        "z": "61ec79b66a2bf0e2",
        "name": "extract iot id to payload",
        "func": "msg.thing.id = msg.payload.value[0][\"@iot.id\"]\nreturn msg;",
        "outputs": 1,
        "noerr": 0,
        "initialize": "",
        "finalize": "",
        "libs": [],
        "x": 1470,
        "y": 60,
        "wires": [
            []
        ]
    },
    {
        "id": "8b385f6fed6f6c3a",
        "type": "debug",
        "z": "61ec79b66a2bf0e2",
        "name": "debug 5",
        "active": true,
        "tosidebar": true,
        "console": false,
        "tostatus": false,
        "complete": "true",
        "targetType": "full",
        "statusVal": "",
        "statusType": "auto",
        "x": 1300,
        "y": 260,
        "wires": []
    },
    {
        "id": "13b8f638b56f3ef8",
        "type": "function",
        "z": "61ec79b66a2bf0e2",
        "name": "thing to payload",
        "func": "msg.payload=new Object();\nmsg.payload.name=msg.thing.name;\nmsg.payload.description=msg.thing.description;\nreturn msg;",
        "outputs": 1,
        "noerr": 0,
        "initialize": "",
        "finalize": "",
        "libs": [],
        "x": 760,
        "y": 180,
        "wires": [
            [
                "28bd4147c533a7fc"
            ]
        ]
    },
    {
        "id": "1015e6da08ab806f",
        "type": "switch",
        "z": "61ec79b66a2bf0e2",
        "name": "thing existing?",
        "property": "payload.value",
        "propertyType": "msg",
        "rules": [
            {
                "t": "nempty"
            },
            {
                "t": "empty"
            }
        ],
        "checkall": "true",
        "repair": false,
        "outputs": 2,
        "x": 540,
        "y": 120,
        "wires": [
            [
                "2e229f50d9fc0395"
            ],
            [
                "13b8f638b56f3ef8"
            ]
        ]
    },
    {
        "id": "28bd4147c533a7fc",
        "type": "json",
        "z": "61ec79b66a2bf0e2",
        "name": "",
        "property": "payload",
        "action": "",
        "pretty": false,
        "x": 930,
        "y": 180,
        "wires": [
            [
                "65dea7a69808b54c"
            ]
        ]
    },
    {
        "id": "1c046fc10be46b8d",
        "type": "catch",
        "z": "61ec79b66a2bf0e2",
        "name": "",
        "scope": null,
        "uncaught": false,
        "x": 1080,
        "y": 260,
        "wires": [
            [
                "8b385f6fed6f6c3a"
            ]
        ]
    },
    {
        "id": "1829a2240c9ef4ae",
        "type": "change",
        "z": "61ec79b66a2bf0e2",
        "name": "",
        "rules": [
            {
                "t": "set",
                "p": "frost_call",
                "pt": "msg",
                "to": "frost_url&\"/v1.1/Things?$filter=name%20eq%20'\"&thing.name&\"'\"",
                "tot": "jsonata"
            },
            {
                "t": "set",
                "p": "method",
                "pt": "msg",
                "to": "GET",
                "tot": "str"
            }
        ],
        "action": "",
        "property": "",
        "from": "",
        "to": "",
        "reg": false,
        "x": 230,
        "y": 240,
        "wires": [
            [
                "5b8f9521151dc425"
            ]
        ]
    },
    {
        "id": "5b8f9521151dc425",
        "type": "subflow:95dbc532074f1e81",
        "z": "61ec79b66a2bf0e2",
        "name": "",
        "x": 450,
        "y": 240,
        "wires": [
            [
                "1015e6da08ab806f"
            ]
        ]
    },
    {
        "id": "65dea7a69808b54c",
        "type": "change",
        "z": "61ec79b66a2bf0e2",
        "name": "",
        "rules": [
            {
                "t": "set",
                "p": "frost_call",
                "pt": "msg",
                "to": "frost_url&\"/v1.1/Things\"",
                "tot": "jsonata"
            },
            {
                "t": "set",
                "p": "method",
                "pt": "msg",
                "to": "POST",
                "tot": "str"
            }
        ],
        "action": "",
        "property": "",
        "from": "",
        "to": "",
        "reg": false,
        "x": 1030,
        "y": 120,
        "wires": [
            [
                "9f48840bac37018f"
            ]
        ]
    },
    {
        "id": "9f48840bac37018f",
        "type": "subflow:95dbc532074f1e81",
        "z": "61ec79b66a2bf0e2",
        "name": "",
        "x": 1130,
        "y": 180,
        "wires": [
            [
                "0555cb49d6c8a653"
            ]
        ]
    },
    {
        "id": "0555cb49d6c8a653",
        "type": "change",
        "z": "61ec79b66a2bf0e2",
        "name": "",
        "rules": [
            {
                "t": "set",
                "p": "frost_call",
                "pt": "msg",
                "to": "frost_url&\"/v1.1/Things?$filter=name%20eq%20'\"&thing.name&\"'\"",
                "tot": "jsonata"
            },
            {
                "t": "set",
                "p": "method",
                "pt": "msg",
                "to": "GET",
                "tot": "str"
            }
        ],
        "action": "",
        "property": "",
        "from": "",
        "to": "",
        "reg": false,
        "x": 1330,
        "y": 180,
        "wires": [
            [
                "7c6519ecca351ac7"
            ]
        ]
    },
    {
        "id": "7c6519ecca351ac7",
        "type": "subflow:95dbc532074f1e81",
        "z": "61ec79b66a2bf0e2",
        "name": "",
        "x": 1530,
        "y": 180,
        "wires": [
            [
                "2e229f50d9fc0395"
            ]
        ]
    },
    {
        "id": "26ba0252a3e31fb3",
        "type": "tab",
        "label": "FROST Usage",
        "disabled": false,
        "info": "",
        "env": [
            {
                "name": "frost_url",
                "value": "https://yourfrostserver.url",
                "type": "str"
            }
        ]
    },
    {
        "id": "d04c052439977bb2",
        "type": "inject",
        "z": "26ba0252a3e31fb3",
        "name": "",
        "props": [
            {
                "p": "timestamp",
                "v": "",
                "vt": "date"
            },
            {
                "p": "topic",
                "vt": "str"
            }
        ],
        "repeat": "",
        "crontab": "",
        "once": false,
        "onceDelay": 0.1,
        "topic": "",
        "x": 330,
        "y": 100,
        "wires": [
            [
                "648d7ad23b1648e9"
            ]
        ]
    },
    {
        "id": "648d7ad23b1648e9",
        "type": "function",
        "z": "26ba0252a3e31fb3",
        "name": "FROST Daten vorbereiten",
        "func": "msg.sensor = new Object();\nmsg.sensor.name = \"Sensor Name\";\nmsg.sensor.description = \"Sensor Description\";\nmsg.sensor.encodingType = \"\";\nmsg.sensor.metadata = \"\";\nmsg.observedProperty = new Object();\nmsg.observedProperty.name=\"Observed Property Name\";\nmsg.observedProperty.description=\"Observed PRoperty Description\";\nmsg.observedProperty.definition=\"Die Definition\";\nmsg.featureOfInterest = new Object();\nmsg.featureOfInterest.name = \"Feature Name\";\nmsg.featureOfInterest.description = \"Feature Description\";\nmsg.featureOfInterest.encodingType = \"\";\nmsg.featureOfInterest.feature = \"\";\nmsg.observedProperty.name = \"Availability\";\nmsg.observedProperty.description = \"Availability of intensive care units\";\nmsg.observedProperty.definition = \"Availability can be one of 'NICHT VERFUEGBAR', 'VERFUEGBAR', 'EINGESCHRAENKT', 'NICHT BEKANNT'\";\nmsg.featureOfInterest = new Object();\nmsg.featureOfInterest.name = \"DIVI_Availability\";\nmsg.featureOfInterest.description = \"Availability of intensive care units\";\nmsg.featureOfInterest.encodingType = \"\";\nmsg.featureOfInterest.feature = \"\";\nmsg.thing = new Object();\nmsg.thing.name = \"ThingName\";\nmsg.thing.description = \"ThingDescription\";\nmsg.datastream = new Object();\nmsg.datastream.name = \"Datastream Name\";\nmsg.datastream.description = \"datastream Description\";\nmsg.datastream.observationType = \"\";\nmsg.datastream.unitOfMeasurement = new Object();\nmsg.datastream.unitOfMeasurement.name = \"AvailabilityName of Measured Unit\";\nmsg.datastream.unitOfMeasurement.symbol = \"...\";\nmsg.datastream.unitOfMeasurement.definition = \"The Definition\";\nmsg.observation = new Object();\nmsg.observation.result = \"Das Ergebnis der Messung\"; //Muss nicht String sein, kann beliebiger Datentyp sein.\nmsg.observation.phenomenonTime = msg.timestamp;// Der Zeitstemüel des Messwertes, das korrekte Format muss hier eingehalten werden.\nmsg.observation.resultTime = msg.timestamp;// Der Zeitstemüel der Messung, das korrekte Format muss hier eingehalten werden.\nmsg.location = new Object();\nmsg.location.name = \"Location Name\";\nmsg.location.description = \"Location Description\";\nmsg.location.encodingType = \"application/geo+json\"\nmsg.location.location = { \"type\": \"Point\", \"coordinates\": [51.4963341, 6.8637765] };\n\n\nreturn msg;",
        "outputs": 1,
        "noerr": 0,
        "initialize": "",
        "finalize": "",
        "libs": [],
        "x": 570,
        "y": 100,
        "wires": [
            [
                "c9330f3cd88162dc"
            ]
        ]
    },
    {
        "id": "570fc47ceba0ed30",
        "type": "subflow:61ec79b66a2bf0e2",
        "z": "26ba0252a3e31fb3",
        "name": "",
        "x": 570,
        "y": 280,
        "wires": [
            [
                "03c8b423128a6514"
            ]
        ]
    },
    {
        "id": "2979ac07b9e63eb7",
        "type": "subflow:32540f96f402831d",
        "z": "26ba0252a3e31fb3",
        "name": "",
        "x": 590,
        "y": 360,
        "wires": [
            [
                "0b3858ba4e389e03"
            ]
        ]
    },
    {
        "id": "c9330f3cd88162dc",
        "type": "subflow:09f4a163ad3eea4d",
        "z": "26ba0252a3e31fb3",
        "name": "",
        "x": 610,
        "y": 140,
        "wires": [
            [
                "cea906f7cf674491"
            ]
        ]
    },
    {
        "id": "cea906f7cf674491",
        "type": "subflow:dcf15c8830e5cfe9",
        "z": "26ba0252a3e31fb3",
        "name": "",
        "x": 580,
        "y": 180,
        "wires": [
            [
                "50a79b677cd9f1db"
            ]
        ]
    },
    {
        "id": "03c8b423128a6514",
        "type": "subflow:9a7dfc39cf7aaa5e",
        "z": "26ba0252a3e31fb3",
        "name": "",
        "x": 580,
        "y": 320,
        "wires": [
            [
                "2979ac07b9e63eb7"
            ]
        ]
    },
    {
        "id": "0b3858ba4e389e03",
        "type": "subflow:059f3e4ef08b79dd",
        "z": "26ba0252a3e31fb3",
        "name": "",
        "x": 570,
        "y": 420,
        "wires": [
            [
                "8ea6e7d616384811"
            ]
        ]
    },
    {
        "id": "50a79b677cd9f1db",
        "type": "subflow:abe04f3e63507447",
        "z": "26ba0252a3e31fb3",
        "name": "",
        "x": 610,
        "y": 220,
        "wires": [
            [
                "570fc47ceba0ed30"
            ]
        ]
    },
    {
        "id": "e62fdc7e5f328777",
        "type": "subflow:1f2d93215d29f7c3",
        "z": "26ba0252a3e31fb3",
        "name": "",
        "x": 600,
        "y": 660,
        "wires": [
            []
        ]
    },
    {
        "id": "bc8165c08ca5f0f4",
        "type": "subflow:95dbc532074f1e81",
        "z": "26ba0252a3e31fb3",
        "name": "",
        "x": 530,
        "y": 580,
        "wires": [
            []
        ]
    },
    {
        "id": "8ea6e7d616384811",
        "type": "debug",
        "z": "26ba0252a3e31fb3",
        "name": "debug 88",
        "active": true,
        "tosidebar": true,
        "console": false,
        "tostatus": false,
        "complete": "false",
        "statusVal": "",
        "statusType": "auto",
        "x": 760,
        "y": 420,
        "wires": []
    },
    {
        "id": "65b85d8cec618d66",
        "type": "comment",
        "z": "26ba0252a3e31fb3",
        "name": "Konfiguration FROST Call Subflow",
        "info": "Im FROST Call Subflow ist einmalig der Nutzername und das Passwort für die Authentifizierung zu hinterlegen. Ggf. sind auch die Proxy Einstellungen einzurichten.",
        "x": 940,
        "y": 580,
        "wires": []
    },
    {
        "id": "910ccd2585a78e47",
        "type": "comment",
        "z": "26ba0252a3e31fb3",
        "name": "Vorbereitung Datenobjekte des FROST Servers mittels JavaScript Funktion",
        "info": "Zur Vorbereitung der einzelnen FROST Calls sind die entsprechenden Datenobjekte vorzubereiten.\n\n",
        "x": 1060,
        "y": 100,
        "wires": []
    },
    {
        "id": "7b8ee28192f800ea",
        "type": "comment",
        "z": "26ba0252a3e31fb3",
        "name": "FROST Calls für die Anlage der einzelnen Objekte",
        "info": "Bei der Anlage der einzelnen Objekte wird geprüft, ob ein Objekt mit entsprechendem Namen bereits vorhanden ist. Bei Übereinstimmung des Namens wird die ID entsprechend zurückgegeben. Sollte keine Übereinstimmung im Namen vorhanden sein, wird ein neues Objekt angelegt und die zurückgegebene ID ausgelesen.\n\nDie jeweiligen IDs werden dann zur Anlage weiterer Objekte und deren Verknüpfung genutzt.",
        "x": 990,
        "y": 180,
        "wires": []
    }
]
