====== ToDo-List======

Co-ordination: Michael Kotzulla


===== General Information =====
^  Task                                                                                   ^  By whom?                                                      ^  Status                                            ^
| [[Summary:Start| Executive Summary ]]                                                   |  TV                                                            |  TBD (revised charts)                              |
| [[General:Start| Chapter 1 - Introduction ]]                                            |  TV                                                            |  check structure                                   |
| [[General:Inventory Background:Start| Chapter 1.1 - National Inventory Background ]]    |  TV                                                            |  TBD                                               |
| [[General:Institutional Arrangements:Start| Chapter 1.2 - Institutional Arrangements]]  |  DG                                                            |  timeless                                          |
| [[General:Inventory Preparation:Start| Chapter 1.3 - Inventory Preparation Process]]    |  DG                                                            |  timeless                                          |
| [[General:Method Data:Start| Chapter 1.4 - Methods and Data Sources]]                   |  TV, with support of FAPs                                      |  mostly timeless, please check                     |
| [[General:Key Categories:Start| Chapter 1.5 - Key Sources (+)]]                         |  CM, with support of FAPs                                      |  TBD                                               |
| [[General:Quality Verification:Start| Chapter 1.6 - QA/QC and Verification methods]]    |  StS                                                           |  timeless                                          |
| [[general:uncertainty_evaluation:start| Chapter 1.7 - General Uncertainty Evaluation]]  |  KH                                                            |  done                                              |
| [[General:Assessment Completeness:Start| Chapter 1.8 - Completeness]]                   |  TV, CM (text, Stage 1 review table), FAPs (NE and IE tables)  |  TV, CM: TBD / FAPs: TBD                           |
| [[General:Trends:Start|Chapter 2 - Explanation of Key Trends (+)]]                      |  TV, with support of FAPs                                      |  TBD                                               |
| [[general:Recalculations:start| Chapter 8.1 - Recalculations (+)]]                      |  MK, with support of FAPs                                      |  TBD                                               |
| [[general:planned_improvements:start| Chapter 8.2 - Improvements (+)]]                  |  TV, with support of FAPs                                      |  TBD  (until April 15th)                           |
| [[general:Projections:start| Chapter 9 - Projections]]                                  |  Bryan Brauns (II 4.1) with KH                                 |  TBD (Update not available yet, disclaimer added)  |
| [[General:Point Sources:Start| Chapter 10.1 - Point Sources]]                           |  N.N.                                                          |  TBD 1st May in 2025                               |
| [[General:Gridded Data:Start| Chapter 10.2 - Gridded Data]]                             |  N.N.                                                          |  TBD in 2025                                       |
| [[general:Adjustments:start| Chapter 11 - Adjustments]]                                 |  TV, with support of FAPs                                      |  TBD                                               |
| References                                                                              |  ??                                                            |  TBD                                               |
| [[iir:Authors]]                                                                         |  everybody                                                     |  do it yourself                                    |
| [[playground:playground|BLUEPRINT for SECTORAL CHAPTER]]                                |  MK                                                            |  ready if needed                                   |
|                                                                                         |                                                                |                                                    |
| All other chapters, general review and editing                                          |  MK                                                            |                                                    |
|                                                                                         |                                                                |                                                    |

===== Sectoral chapters =====
==== 1 - Energy ====
^  Task                                                                                                                                                                                                    ^  By whom?                     ^  Status                     ^
| **[[sector:energy:start| 1 - ENERGY]]**                                                                                                                                                                  |  FAPs / TV (Overview Charts)  |  FAPs: see below / TV: TBD  |
| //[[sector:energy:fuel_combustion:start| 1.A - FUEL COMBUSTION ACTIVITIES ]]//                                                                                                                           |  s. below                     |  s. below                   |
| **[[sector:energy:fuel_combustion:energy_industries:start| 1.A.1 - Energy Industries ]]**                                                                                                                |  s. below                     |  s. below                   |
| [[sector:energy:fuel_combustion:energy_industries:public_electricity_and_heat_production| 1.A.1.a - Public electricity and heat production]]                                                             |  ÖC                           |  TBD                        |
| [[sector:energy:fuel_combustion:energy_industries:petroleum_refining| 1.A.1.b - Petroleum refining]]                                                                                                     |  ÖC                           |  TBD                        |
| [[sector:energy:fuel_combustion:energy_industries:manufacture_of_solid_fuels_and_other_energy_industries| 1.A.1.c - Manufacture of solid fuels and other energy industries]]                             |  ÖC                           |  TBD                        |
| **[[sector:energy:fuel_combustion:industry:start| 1.A.2 - Fuel Combustion Activities in Industries and Construction]]**                                                                                  |  s. below                     |  s. below                   |
| [[sector:energy:fuel_combustion:industry:iron_and_steel| 1.A.2.a - Stationary combustion in manufacturing industries and construction: Iron and Steel ]]                                                 |  JR                           |  TBD                        |
| [[sector:energy:fuel_combustion:industry:non-ferrous_metals| 1.A.2.b - Stationary combustion in manufacturing industries and construction: Non-ferrous Metals ]]                                         |  JR                           |  TBD                        |
| [[sector:energy:fuel_combustion:industry:chemicals| 1.A.2.c - Stationary combustion in manufacturing industries and construction: Chemicals ]]                                                           |  JZ                           |  timeless                   |
| [[sector:energy:fuel_combustion:industry:pulp_paper_and_print| 1.A.2.d - Stationary combustion in manufacturing industries and construction: Pulp, Paper and Print ]]                                    |  RK                           |  TBD                        |
| [[sector:energy:fuel_combustion:industry:food_processing_beverages_and_tobacco| 1.A.2.e - Stationary combustion in manufacturing industries and construction: Food Processing, Beverages and Tobacco ]]  |  RK                           |  TBD                        |
| [[sector:energy:fuel_combustion:industry:non-metallic_minerals| 1.A.2.f - Stationary combustion in manufacturing industries and construction: Non-Metallic Minerals ]]                                   |  RK                           |  TBD                        |
| [[sector:energy:fuel_combustion:industry:mobile_combustion_in_manufacturing_industries_construction| 1.A.2.g vii -  Mobile Combustion in Manufacturing Industries & Construction ]]                      |  MK                           |  **DONE**                   |
| [[sector:energy:fuel_combustion:industry:other:start| 1.A.2.g viii - Stationary Combustion in Manufacturing Industries & Construction: Other  ]]                                                         |  ÖC                           |  TBD                        |
| **[[sector:energy:fuel_combustion:transport:start| 1.A.3 - Transport ]]**                                                                                                                                |  MK                           |  timeless                   |
| [[sector:energy:fuel_combustion:transport:civil_aviation:start| 1.A.3.a - Civil Aviation ]]                                                                                                              |  MK                           |  **DONE**                   |
| [[sector:energy:fuel_combustion:transport:civil_aviation:international_civil_aviation_-_lto| 1.A.3.a i (i) - International Civil Aviation: LTO ]]                                                        |  MK                           |  **DONE**                   |
| [[sector:energy:fuel_combustion:transport:civil_aviation:domestic_civil_aviation_-_lto| 1.A.3.a ii (i) - Domestic Civil Aviation: LTO ]]                                                                 |  MK                           |  **DONE**                   |
| [[sector:energy:fuel_combustion:transport:civil_aviation:international_civil_aviation_-_Cruise| 1.A.3.a i (ii) - International Civil Aviation: Cruise ]]                                                 |  MK                           |  TBD                        |
| [[sector:energy:fuel_combustion:transport:civil_aviation:domestic_civil_aviation_-_Cruise| 1.A.3.a ii (ii) - Domestic Civil Aviation: Cruise ]]                                                          |  MK                           |  TBD                        |
| [[sector:energy:fuel_combustion:transport:road_transport:start| 1.A.3.b - Road Transport ]]                                                                                                              |  MK                           |  TBD                        |
| [[sector:energy:fuel_combustion:transport:road_transport:emissions_from_fuel_combustion_in_road_vehicles:start| 1.A.3.bi-iv - Emissions from Fuel Combustion in Road Vehicles ]]                         |  MK                           |  TBD                        |
| [[sector:energy:fuel_combustion:transport:road_transport:emissions_from_fuel_combustion_in_road_vehicles:passenger_cars| 1.A.3.b i - Road Transport: Passenger Cars ]]                                   |  MK                           |  TBD                        |
| [[sector:energy:fuel_combustion:transport:road_transport:emissions_from_fuel_combustion_in_road_vehicles:light_duty_vehicles| 1.A.3.b ii - Road Transport: Light duty vehicles ]]                        |  MK                           |  TBD                        |
| [[sector:energy:fuel_combustion:transport:road_transport:emissions_from_fuel_combustion_in_road_vehicles:heavy_duty_vehicles| 1.A.3.b iii - Road Transport: Heavy duty vehicles ]]                       |  MK                           |  TBD                        |
| [[sector:energy:fuel_combustion:transport:road_transport:emissions_from_fuel_combustion_in_road_vehicles:mopeds_and_motorcycles| 1.A.3.b iv - Road Transport: Mopeds & Motorcycles ]]                    |  MK                           |  TBD                        |
| [[sector:energy:fuel_combustion:transport:road_transport:fugitive_emissions_from_gasoline_evaporation| 1.A.3.b v - Gasoline Evaporation ]]                                                               |  MK                           |  TBD                        |
| [[sector:energy:fuel_combustion:transport:road_transport:abrasive_emissions_from_road_vehicles:start| 1.A.3.b vi-vii - Emissions from Wear and Abrasion in Road Transport ]]                             |  MK                           |  TBD                        |
| [[sector:energy:fuel_combustion:transport:road_transport:abrasive_emissions_from_road_vehicles:tyre_and_brake_wear|1.A.3.b vi - Road Transport: Tyre and Brake Wear ]]                                   |  MK                           |  TBD                        |
| [[sector:energy:fuel_combustion:transport:road_transport:abrasive_emissions_from_road_vehicles:road_abrasion| 1.A.3.b vii - Road Transport: Road Abrasion ]]                                             |  MK                           |  TBD                        |
| [[sector:energy:fuel_combustion:transport:railways:start| 1.A.3.c - Railways ]]                                                                                                                          |  MK                           |  TBD                        |
| [[sector:energy:fuel_combustion:transport:navigation:start| 1.A.3.d - Navigation ]]                                                                                                                      |  MK                           |  TBD                        |
| [[sector:energy:fuel_combustion:transport:navigation:international_maritime_navigation| 1.A.3.d i - International Maritime Navigation ]]                                                                 |  MK                           |  TBD                        |
| [[sector:energy:fuel_combustion:transport:navigation:international_inland_waterways| 1.A.3.d i (ii) - International Inland Navigation ]]                                                                 |  MK                           |  dummy                      |
| [[sector:energy:fuel_combustion:transport:navigation:national_navigation| 1.A.3.d ii - National Navigation ]]                                                                                            |  MK                           |  TBD                        |
| [[sector:energy:fuel_combustion:transport:other_transport:start| 1.A.3.e - Other Transport ]]                                                                                                            |  ÖC (MK)                      |  timeless                   |
| [[sector:energy:fuel_combustion:transport:other_transport:pipeline_transport| 1.A.3.e i - Pipeline Transport ]]                                                                                          |  ÖC                           |  TBD                        |
| 1.A.3.e ii - Other Transport: Other                                                                                                                                                                      |  MK                           |  dummy                      |
| **[[sector:energy:fuel_combustion:small_combustion:start| 1.A.4 - Other: Small Stationary & Mobile Fuel Combustion ]]**                                                                                  |  ÖC, MK                       |  timeless                   |
| [[sector:energy:fuel_combustion:small_combustion:stationary_small_combustion|Stationary Small Combustion]]                                                                                               |  ÖC                           |  TBD                        |
| [[sector:energy:fuel_combustion:small_combustion:stationary_small_combustion:commercial_institutional| 1.A.4.a i - Commercial and Institutional - Stationary Combustion ]]                               |  ÖC                           |  TBD                        |
| [[sector:energy:fuel_combustion:small_combustion:stationary_small_combustion:residential| 1.A.4.b i - Residential - Stationary Combustion ]]                                                             |  ÖC                           |  TBD                        |
| [[sector:energy:fuel_combustion:small_combustion:stationary_small_combustion:agriculture_forestry_fishery| 1.A.4.c i - Agriculture, Forestry, Fishing - Stationary Combustion ]]                         |  ÖC                           |  TBD                        |
| [[sector:energy:fuel_combustion:small_combustion:mobile_small_combustion:start| Small Combustion: Mobile Sources ]]                                                                                      |  MK                           |  TBD                        |
| [[sector:energy:fuel_combustion:small_combustion:mobile_small_combustion:commercial_and_institutional| 1.A.4.a ii - Commercial / Institutional: Mobile ]]                                                |  MK                           |  **DONE**                   |
| [[sector:energy:fuel_combustion:small_combustion:mobile_small_combustion:residential| 1.A.4.b ii - Residential: Household and Gardening: Mobile ]]                                                       |  MK                           |  **DONE**                   |
| [[sector:energy:fuel_combustion:small_combustion:mobile_small_combustion:agriculture_and_forestry| 1.A.4.c ii - Agriculture/Forestry/Fishing: Off-road Vehicles and Other Machinery ]]                   |  MK                           |  TBD                        |
| [[sector:energy:fuel_combustion:small_combustion:mobile_small_combustion:agriculture_and_forestry:agriculture| 1.A.4.c ii (a) - Off-road Vehicles and Other Machinery: Agriculture ]]                    |  MK                           |  TBD                        |
| [[sector:energy:fuel_combustion:small_combustion:mobile_small_combustion:agriculture_and_forestry:forestry| 1.A.4.c ii (b) - Off-road Vehicles and Other Machinery: Forestry ]]                          |  MK                           |  TBD                        |
| [[sector:energy:fuel_combustion:small_combustion:mobile_small_combustion:fishing| 1.A.4.c iii - Agriculture/Forestry/Fishing: National Fishing ]]                                                        |  MK                           |  TBD                        |
| **[[sector:energy:fuel_combustion:other_including_military:start| 1.A.5 - Other: Military ]]**                                                                                                           |  RK, MK                       |  timeless                   |
| [[sector:energy:fuel_combustion:other_including_military:stationary_fuel_combustion_in_military_facilities| 1.A.5.a - Other: Stationary (including Military)]]                                           |  ÖC                           |  TBD                        |
| [[sector:energy:fuel_combustion:other_including_military:military_transport| 1.A.5.b - Other: Mobile (including Military) ]]                                                                             |  MK                           |  TBD                        |
| [[sector:energy:fuel_combustion:other_including_military:military_transport:ground-based| 1.A.5.b i - Land-based Military Transport and Machinery ]]                                                     |  MK                           |  TBD                        |
| [[sector:energy:fuel_combustion:other_including_military:military_transport:military_aviation| 1.A.5.b ii - Military Aviation ]]                                                                         |  MK                           |  TBD                        |
| [[sector:energy:fuel_combustion:other_including_military:military_transport:military_navigation| 1.A.5.b iii - Military Navigation ]]                                                                    |  MK                           |  TBD                        |
| //**[[Sector:Energy:Fugitive:Start| 1.B - FUGITIVE EMISSIONS FROM FUELS]]**//                                                                                                                            |  ChB                          |  TBD                        |
| [[Sector:Energy:Fugitive:Solid Fuels:Start| 1.B.1 - Solid Fuels]]                                                                                                                                        |  ChB                          |  TBD                        |
| [[sector:energy:fugitive:oil:start| 1.B.2.a - Oil]]                                                                                                                                                      |  ChB                          |  TBD                        |
| [[sector:energy:fugitive:gas:start| 1.B.2.b - Natural Gas ]]                                                                                                                                             |  ChB                          |  TBD                        |
| [[sector:energy:fugitive:flaring:start| 1.B.2.c - Flaring ]]                                                                                                                                             |  ChB                          |  TBD                        |
| [[sector:energy:fugitive:geothermal:start| 1.B.3 - Geothermal Energy]]                                                                                                                                   |  ChB                          |  TBD                        |

==== 2 - Industrial Processes ====
^  Task                                                                                                                                            ^  By whom?                     ^  Status                     ^
| **[[sector:ippu:start| 2 - INDUSTRIAL PROCESSES AND PRODUCT USE ]]**                                                                             |  FAPs / TV (Overview Charts)  |  FAPs: see below / TV: TBD  |
| //**[[sector:ippu:mineral_industry:start| 2.A - MINERAL INDUSTRY - Overview ]]**//                                                               |  RK                           |  TBD                        |
| [[sector:ippu:mineral_industry:cement_production:Start| 2.A.1 - Cement Production ]]                                                             |  RK                           |  TBD                        |
| [[sector:ippu:mineral_industry:lime_production:Start| 2.A.2 - Lime Production ]]                                                                 |  RK                           |  TBD                        |
| [[sector:ippu:mineral_industry:glass_production:Start| 2.A.3 - Glass Production ]]                                                               |  RK                           |  TBD                        |
| [[sector:ippu:mineral_industry:quarrying_mining:Start| 2.A.5.a Quarrying Mining Other Than Coal ]]                                               |  RK                           |  TBD                        |
| [[sector:ippu:mineral_industry:construction_demolition:Start| 2.A.5.b Construction And Demolition ]]                                             |  RK                           |  TBD                        |
| [[sector:ippu:mineral_industry:other_mineral_products:Start| 2.A.6 Other Mineral Products ]]                                                     |  RK                           |  TBD                        |
| //**[[Sector:IPPU:Chemical_Industry:Start| 2.B - CHEMICAL INDUSTRY ]]**//                                                                        |  JZ                           |  timeless                   |
| [[Sector:IPPU:Chemical_Industry:Ammonia_Production:Start| 2.B.1 - Ammonia Production ]]                                                          |  JZ                           |  Done                        |
| [[Sector:IPPU:Chemical_Industry:nitric_acid_production:start| 2.B.2 - Nitric Acid Production ]]                                                  |  JZ                           |  Done                        |
| [[Sector:IPPU:Chemical_Industry:adipic_acid_production:start| 2.B.3 - Adipic Acid Production ]]                                                  |  JZ                           |  Done                        |
| [[Sector:IPPU:Chemical_Industry:carbide_production:start| 2.B.5 - Carbide Production  ]]                                                         |  JZ                           |  Done                        |
| [[Sector:IPPU:Chemical_Industry:titanium_dioxide_production:start| 2.B.6 - Titanium Dioxide Production ]]                                        |  JZ                           |  Done                        |
| [[Sector:IPPU:Chemical_Industry:soda_ash_production:start| 2.B.7 - Soda Ash Production ]]                                                        |  RK                           |  TBD                        |
| [[Sector:IPPU:Chemical_Industry:other:start| 2.B.10.a - Chemical Industry: Other ]]                                                              |  JZ                           |  TBD                        |
| [[Sector:IPPU:Chemical_Industry:Storage_Handling_Transport_Chemicals:Start| 2.B.10.b - Storage, Handling and Transport of Chemical Products ]]   |  JZ                           |  Done                        |
| //**[[Sector:IPPU:Metal_Production:Start| 2.C - METAL INDUSTRY ]]**//                                                                            |  JR                           |  TBD                        |
| [[Sector:IPPU:Metal_Production:Iron_And_Steel_Production:Start| 2.C.1 - Iron and Steel Production]]                                              |  JR                           |  TBD                        |
| [[Sector:IPPU:Metal_Production:Ferroalloys_Production:Start| 2.C.2 - Ferroalloys Production]]                                                    |  JR                           |  TBD                        |
| [[Sector:IPPU:Metal_Production:Aluminum_Production:Start| 2.C.3 - Aluminum Production]]                                                          |  JR                           |  TBD                        |
| [[Sector:IPPU:Metal_Production:Magnesium_Production:Start| 2.C.4 - Magnesium Production]]                                                        |  JR                           |  dummy                      |
| [[Sector:IPPU:Metal_Production:Lead_Production:Start| 2.C.5 - Lead Production]]                                                                  |  JR                           |  TBD                        |
| [[Sector:IPPU:Metal_Production:Zinc_Production:Start| 2.C.6 - Zinc Production]]                                                                  |  JR                           |  TBD                        |
| [[Sector:IPPU:Metal_Production:Copper_Production:Start| 2.C.7.a - Copper Production]]                                                            |  JR                           |  TBD                        |
| [[Sector:IPPU:Metal_Production:Nickel_Production:Start| 2.C.7.b - Nickel Production]]                                                            |  JR                           |  TBD                        |
| [[Sector:IPPU:Metal_Production:Other_Metal_Production:Start| 2.C.7.c - Other Metal Production]]                                                  |  JR                           |  TBD                        |
| [[Sector:IPPU:Metal_Production:Storage_Handling_Transport_Metals:Start| 2.C.7.d - Storage, Handling and Transport of Metal Products]]            |  (MK)                         |  dummy                      |
| //**[[Sector:IPPU:Other_Solvent_And_Product_Use:Start| 2.D - SOLVENT USE & PRODUCT USE]]**//                                                     |  RK, JR                       |  timeless                   |
| [[Sector:IPPU:Other_Solvent_And_Product_Use:Domestic_Solvent_Use:Start| 2.D.3.a - Domestic Solvent Use including fungicides]]                    |  JR                           |  TBD                        |
| [[Sector:IPPU:Other_Solvent_And_Product_Use:Road_Paving:Start| 2.D.3.b - Road Paving with Asphalt]]                                              |  RK                           |  TBD                        |
| [[Sector:IPPU:Other_Solvent_And_Product_Use:Asphalt_Roofing:Start| 2.D.3.c - Asphalt Roofing]]                                                   |  RK                           |  TBD                        |
| [[Sector:IPPU:Other_Solvent_And_Product_Use:Coating_Applications:Start| 2.D.3.d - Coating Applications]]                                         |  JR                           |  TBD                        |
| [[Sector:IPPU:Other_Solvent_And_Product_Use:Degreasing:Start| 2.D.3.e - Degreasing]]                                                             |  JR                           |  TBD                        |
| [[Sector:IPPU:Other_Solvent_And_Product_Use:Dry_Cleaning:Start| 2.D.3.f - Dry Cleaning]]                                                         |  JR                           |  TBD                        |
| [[Sector:IPPU:Other_Solvent_And_Product_Use:Chemical_Products:Start| 2.D.3.g - Chemical Products]]                                               |  JR                           |  TBD                        |
| [[Sector:IPPU:Other_Solvent_And_Product_Use:Printing:Start| 2.D.3.h - Printing]]                                                                 |  JR                           |  TBD                        |
| [[Sector:IPPU:Other_Solvent_And_Product_Use:Other_Solvent_Use:Start| 2.D.3.i - Other Solvent Use]]                                               |  JR                           |  TBD                        |
| **//[[Sector:IPPU:Other_Product_Use:Start| 2.G - OTHER PRODUCT USE]]//**                                                                         |  JR                           |  TBD                        |
| [[Sector:IPPU:Other_Product_Use:Fireworks:Start| 2.G.4 - Use of Fireworks]]                                                                      |  JR                           |  TBD                        |
| [[Sector:IPPU:Other_Product_Use:Tobacco:Start| 2.G.4 - Use of Tobacco]]                                                                          |  JR                           |  TBD                        |
| [[Sector:IPPU:Other_Product_Use:Charcoal:Start| 2.G.4 - Charcoal]]                                                                               |  JR                           |  TBD                        |
| [[sector:IPPU:Other_Product_Use:Lubricants:start| 2.G.4 - Lubricants]]                                                                           |  JR, MK                       |  TBD                        |
| **//[[Sector:IPPU:Pulp_Paper_Food:Start| 2.H - Other: Pulp & Paper, Food]]//**                                                                   |  RK                           |  timeless                   |
| [[Sector:IPPU:Pulp_Paper_Food:Pulp_And_Paper_Industry:Start| 2.H.1 - Pulp and Paper Industry]]                                                   |  RK                           |  TBD                        |
| [[Sector:IPPU:Pulp_Paper_Food:Food_And_Beverages:Start| 2.H.2 - Food and Beverages Industry]]                                                    |  RK                           |  TBD                        |
| [[Sector:IPPU:Pulp_Paper_Food:Other_Industrial_Processes:Start| 2.H.3 - Other Industrial Processes]]                                             |  TV                           |  dummy                      |
| [[Sector:IPPU:Wood_Processing:Start| 2.I - Wood Processing]]                                                                                     |  RK                           |  TBD                        |
| [[Sector:IPPU:POP_Production:Start| 2.J - Production of POPs]]                                                                                   |  ?? (JR)                      |  TBD                        |
| [[sector:ippu:pops_and_hm_consumption:start| 2.K - Consumption of POPs and Heavy Metals]]                                                        |  ?? (JR)                      |  TBD                        |
| [[Sector:IPPU:Bulk Products:Start| 2.L - Other Production, Consumption, Storage, Transportation or Handling of Bulk Products]]                   |  MK                           |  TBD                        |
| [[Sector:IPPU:Bulk_Products:Handling_of_Bulk_Products:Start| 2.L(a) - Handling of Bulk Products]]                                                |  MK                           |  TBD                        |
| [[Sector:IPPU:Bulk_Products:Diffuse_Emissions_from_Industrial_Establishments:Start| 2.L(b) - Diffuse Emissions From Industrial Establishments]]  |  MK                           |  TBD                        |

==== 3 - Agriculture ====

^  Task                                                                                      ^  By whom?                   ^  Status              ^
| **[[Sector:Agriculture:Start| 3 - AGRICULTURE ]]**                                         |  JN / TV (Overview Charts)  |  JN: done / TV: TBD  |
| [[Sector:Agriculture:Manure_Management:Start| 3.B - Manure Management ]]                   |  JN                         |  done                |
| [[Sector:Agriculture:Agricultural_Soils:Start| 3.D - Agricultural Soils ]]                 |  JN                         |  done                |
| [[Sector:Agriculture:Field_Burning:Start| 3.F - Field burning of agricultural residues ]]  |  JN                         |  done                |
| [[sector:agriculture:agricultural_other:start|3.I - Other]]                                |  JN                         |  done                |

==== 4 - LULUCF ====
^  Task           ^  By whom?   ^  Status         ^
| **4 - LULUCF**  |  N.N. / MK  |  dummy / dummy  |

==== 5 - Waste ====
^  Task                                                                                                                                                                   ^  By whom?                     ^  Status                     ^
| **[[sector:waste:start| 5 - WASTE ]]**                                                                                                                                  |  FAPs / TV (Overview Charts)  |  FAPs: see below (StS: done; RK: TBD / TV: TBD  |
| [[Sector:Waste:Biological_Treatment_Solid_Waste_Disposal:Start| Biological Treatment of Waste: 5.A - Solid Waste Disposal on Land ]]                                    |  StS                          |  done                        |
| [[Sector:Waste:Biological_Treatment_Composting:Start| 5.B.1 - Biological Treatment of Waste: Composting ]]                                                              |  StS                          |  done                        |
| [[Sector:Waste:Biological_Treatment_Anaerobic_Digestion_At_Biogas_Facilities:Start| 5.B.2 - Biological Treatment of Waste: Anaerobic digestion at biogas facilities ]]  |  StS                          |  done                        |
| [[Sector:Waste:Cremation:Start| 5.C.1.b v - Cremation]]                                                                                                                 |  RK                           |  TBD                        |
| [[Sector:Waste:Open_Burning:Start| 5.C.2 - Open Burning of Waste]]                                                                                                      |  RK                           |  TBD                        |
| [[Sector:Waste:Domestic_And_Commercial_Wastewater_Handling:Start| 5.D.1 - Domestic & Commercial Wastewater Handling]]                                                   |  StS                          |  done                        |
| [[Sector:Waste:Industrial_Wastewater_Handling:Start| 5.D.2 - Industrial Wastewater Handling]]                                                                           |  StS                          |  done                        |
| [[sector:waste:other_waste:start| 5.E - Other Waste ]]                                                                                                                  |  StS/RK                       |  timeless/timeless          |
| [[Sector:Waste:Other_Waste:Mechanical-Biological_Treatment:Start| 5.E.1 - Other Waste: Mechanical-biological Treatment of Waste  ]]                                     |  StS                          |  timeless                   |
| [[Sector:Waste:Other_Waste:Building_And_Car_Fires:Start| 5.E.2 - building and car fires ]]                                                                              |  RK                           |  TBD                        |

==== 6 - OTHER SOURCES ====
^  Task                                                                                                                              ^  By whom?              ^  Status             ^
| **[[sector:other_and_natural_sources:start| 7 - Other Sources and Natural Sources]] (Table)**                                      |  JN                    |  TBD                |
| [[sector:other_and_natural_sources:other_sources| 6 - OTHER SOURCES - Overview]]                                                   |  text: MK; charts: TV  |  MK: DONE; TV: TBD  |
| [[sector:other_and_natural_sources:other_sources:human_sweating&breathing| 6.A.1 - Other Sources: Human sweating and breathing ]]  |  JN                    |  TBD                |
| [[sector:other_and_natural_sources:other_sources:pets| 6.A.2 - Other Sources: Ammonia emissions from pets ]]                       |  JN                    |  TBD                |

==== 11 - NATURAL SOURCES ====
^  Task                                                                                  ^  By whom?  ^  Status      ^
| **[[sector:other_and_natural_sources:natural_sources| 11 - Natural Sources]]**         |  JN, KH    |  (s. below)  |
| [[sector:other_and_natural_sources:natural_sources:forest_fires|11.B - Forest Fires]]  |  JN        |  done        |
| [[sector:other_and_natural_sources:natural_sources:other|11.C - Natural Sources]]      |  KH        |  TBD        |
==== Appendices ====
^  Task                                                                                                                                          ^  By whom?   ^  Status                                               ^
| **APPENDICES**                                                                                                                                 |  see below  |  see below                                            |
| [[appendices:appendix1_the_key_category_analysis| Appendix 1 - Key Category Analysis (KCA) ]]                                                  |  CM         |  dummy                                                |
| [[appendices:appendix2_detailed_mehodological_descriptions| Appendix 2 - Detailed Methodological Descriptions ]]                               |  FAPs       |  dummy                                                |
| [[appendices:appendix2.1_reporting_of_pm_emissions| Appendix 2.1 - Reporting of PM emissions ]]                                                |  KH         |  TBD                                                  |
| [[appendices:appendix2.2-road-transport| Appendix 2.2 - Road Transport ]]                                                                      |  MK         |  TBD                                                  |
| [[appendices:appendix2.3-HM-from-mobile-sources| Appendix 2.3 - Heavy Metal (HM) exhaust emissions from mobile sources ]]                      |  MK         |  TBD                                                  |
| [[appendices:appendix2.4_POPs_from_mobile_sources| Appendix 2.4 - Persistent Organic Pollutant (POP) exhaust emissions from mobile sources ]]  |  MK         |  TBD                                                  |
| [[appendices:appendix3_further_elaboration_of_completeness| Appendix 3 - Further Elaboration of Completeness ]]                                |  TV         |  dummy                                                |
| [[appendices:appendix4_the_national_energy_balance| Appendix 4 - The National Energy Balance (NEB)  ]]                                         |  MK         |  DONE; future responsibility should be with V 1.5     |
| [[appendices:appendix5_additional_information| Appendix 5 - Additional Information (Verification) ]]                                           |  CM         |  Update due in 2025 with new data from EDGAR AP etc.  |
| [[appendices:appendix6_other_appendices| Appendix 6 - Other Appendices  ]]                                                                     |  MK         |  dummy                                                |
|                                                                                                                                                |             |                                                       |
| **Extra work**                                                                                                                                 |             |                                                       |
| Migrate Wiki to Code.de                                                                                                                        |  div.       |  TBD                                                  |
| Redirect to new platform                                                                                                                       |  KH         |  TBD                                                  |
| **Create PDF copy for publication**                                                                                                            |  MK (PG)    |  **TBD** after April 15th                             |
| Backup task                                                                                                                                    |  MK         |  running every Friday                                 |