====== Chapter 7 - NFR 6 - Other Sources & NFR 11 - Natural Sources ======

^  NFR-Code                                        ^  Name of category                                                                                                                 ^                         Method ^  AD  ^  EF  ^  Key Category                              ^
|  **6**                                           | **[[sector:other_and_natural_sources:other_sources| Other Sources]]**                                                             |  //see sub-categories//                                                                ||||
| //consisting of / including source categories//                                                                                                                                                                                                                             ||||||
|  6.A                                             | [[sector:other_and_natural_sources:other_sources:human_sweating&breathing| Ammonia emissions from human sweating and breathing]]  |  T1                            |  NS  |  D   |                                            |
|                                                                                                                                                                                                                                                                             ||||||
^  NFR-Code                                        ^  Name of category                                                                                                                 ^                         Method ^  AD  ^  EF  ^  Key Category                              ^
|  **11**                                          | **[[sector:other_and_natural_sources:forest_fires| Natural Sources]]**                                                            |  //see sub-categories//                                                                ||||
| //consisting of / including source categories//                                                                                                                                                                                                                             ||||||
|  11.A                                            | Volcanoes                                                                                                                         |  //not occurring in Germany//                                                          ||||
|  11.B                                            | [[sector:other_and_natural_sources:forest_fires| Forest Fires]]                                                                   |  CS, T2                        |  CS  |  D   | //not included in key category analysis//  |
|  11.C                                            | [[sector:other_and_natural_sources:natural_sources| Other Natural Sources]]                                                       |  //see sub-categories//                                                                ||||