Vorgang gestartet
Berechne Variable Other LULUCF.Settlements, Ereignis #29334 (1/352)
Berechne Variable Other LULUCF.Settlements, Ereignis #29335 (2/352)
Berechne Variable Other LULUCF.Settlements, Ereignis #29336 (3/352)
Berechne Variable Other LULUCF.Settlements, Ereignis #29337 (4/352)
Berechne Variable Other LULUCF.Settlements, Ereignis #29338 (5/352)
Berechne Variable Other LULUCF.Settlements, Ereignis #29339 (6/352)
Berechne Variable Other LULUCF.Settlements, Ereignis #29340 (7/352)
Berechne Variable Other LULUCF.Settlements, Ereignis #29341 (8/352)
Berechne Variable Other LULUCF.Settlements, Ereignis #29394 (9/352)
Berechne Variable Other LULUCF.Settlements, Ereignis #29395 (10/352)
Berechne Variable Other LULUCF.Settlements, Ereignis #29396 (11/352)
Berechne Variable Other LULUCF.Settlements, Ereignis #29397 (12/352)
Berechne Variable Settlements, Ereignis #23110 (13/352)
Berechne Variable Settlements, Ereignis #23114 (14/352)
Berechne Variable Settlements, Ereignis #23120 (15/352)
Berechne Variable Settlements, Ereignis #24369 (16/352)
Berechne Variable Settlements, Ereignis #24376 (17/352)
Berechne Variable Settlements, Ereignis #24383 (18/352)
Berechne Variable Settlements, Ereignis #24386 (19/352)
Berechne Variable Settlements, Ereignis #24388 (20/352)
Berechne Variable Settlements, Ereignis #24389 (21/352)
Berechne Variable Settlements, Ereignis #24390 (22/352)
Berechne Variable Settlements, Ereignis #24391 (23/352)
Berechne Variable Settlements, Ereignis #24393 (24/352)
Berechne Variable Settlements, Ereignis #24394 (25/352)
Berechne Variable Settlements, Ereignis #24395 (26/352)
Berechne Variable Settlements, Ereignis #24398 (27/352)
Berechne Variable Settlements, Ereignis #24401 (28/352)
Berechne Variable Settlements, Ereignis #24402 (29/352)
Berechne Variable Settlements, Ereignis #24404 (30/352)
Berechne Variable Settlements, Ereignis #24407 (31/352)
Berechne Variable Settlements, Ereignis #24409 (32/352)
Berechne Variable Settlements, Ereignis #24410 (33/352)
Berechne Variable Settlements, Ereignis #24411 (34/352)
Berechne Variable Settlements, Ereignis #24412 (35/352)
Berechne Variable Settlements, Ereignis #24413 (36/352)
Berechne Variable Settlements, Ereignis #24414 (37/352)
Berechne Variable Settlements, Ereignis #24419 (38/352)
Berechne Variable Settlements, Ereignis #24420 (39/352)
Berechne Variable Settlements, Ereignis #24421 (40/352)
Berechne Variable Settlements, Ereignis #24422 (41/352)
Berechne Variable Settlements, Ereignis #24423 (42/352)
Berechne Variable Settlements, Ereignis #24426 (43/352)
Berechne Variable Settlements, Ereignis #24427 (44/352)
Berechne Variable Settlements, Ereignis #24428 (45/352)
Berechne Variable Settlements, Ereignis #25674 (46/352)
Berechne Variable Settlements, Ereignis #25847 (47/352)
Berechne Variable Settlements, Ereignis #25848 (48/352)
Berechne Variable Settlements, Ereignis #25851 (49/352)
Berechne Variable Settlements, Ereignis #25856 (50/352)
Berechne Variable Settlements, Ereignis #25857 (51/352)
Berechne Variable Settlements, Ereignis #25858 (52/352)
Berechne Variable Settlements, Ereignis #25864 (53/352)
Berechne Variable Settlements, Ereignis #25869 (54/352)
Berechne Variable Settlements, Ereignis #25870 (55/352)
Berechne Variable Settlements, Ereignis #25872 (56/352)
Berechne Variable Settlements, Ereignis #25874 (57/352)
Berechne Variable Settlements, Ereignis #25878 (58/352)
Berechne Variable Settlements, Ereignis #25880 (59/352)
Berechne Variable Settlements, Ereignis #25881 (60/352)
Berechne Variable Settlements, Ereignis #25884 (61/352)
Berechne Variable Settlements, Ereignis #25889 (62/352)
Berechne Variable Settlements, Ereignis #25893 (63/352)
Berechne Variable Settlements, Ereignis #25741 (64/352)
Berechne Variable Settlements, Ereignis #25744 (65/352)
Berechne Variable Settlements, Ereignis #25752 (66/352)
Berechne Variable Settlements, Ereignis #25754 (67/352)
Berechne Variable Settlements, Ereignis #25755 (68/352)
Berechne Variable Settlements, Ereignis #25759 (69/352)
Berechne Variable Settlements, Ereignis #25760 (70/352)
Berechne Variable Settlements, Ereignis #25762 (71/352)
Berechne Variable Settlements, Ereignis #25766 (72/352)
Berechne Variable Settlements, Ereignis #25768 (73/352)
Berechne Variable Settlements, Ereignis #25771 (74/352)
Berechne Variable Settlements, Ereignis #25773 (75/352)
Berechne Variable Settlements, Ereignis #25774 (76/352)
Berechne Variable Settlements, Ereignis #25777 (77/352)
Berechne Variable Settlements, Ereignis #25781 (78/352)
Berechne Variable Settlements, Ereignis #25785 (79/352)
Berechne Variable Settlements, Ereignis #25788 (80/352)
Berechne Variable Settlements, Ereignis #25789 (81/352)
Berechne Variable Settlements, Ereignis #25790 (82/352)
Berechne Variable Settlements, Ereignis #25792 (83/352)
Berechne Variable Settlements, Ereignis #25807 (84/352)
Berechne Variable Settlements, Ereignis #25811 (85/352)
Berechne Variable Settlements, Ereignis #25831 (86/352)
Berechne Variable Settlements, Ereignis #25838 (87/352)
Berechne Variable Settlements, Ereignis #28886 (88/352)
Berechne Variable Settlements, Ereignis #28887 (89/352)
Berechne Variable Settlements, Ereignis #24430 (90/352)
Berechne Variable Settlements, Ereignis #24431 (91/352)
Berechne Variable Settlements, Ereignis #24433 (92/352)
Berechne Variable Settlements, Ereignis #24436 (93/352)
Berechne Variable Settlements, Ereignis #24438 (94/352)
Berechne Variable Settlements, Ereignis #24439 (95/352)
Berechne Variable Settlements, Ereignis #24440 (96/352)
Berechne Variable Settlements, Ereignis #24442 (97/352)
Berechne Variable Settlements, Ereignis #24444 (98/352)
Berechne Variable Settlements, Ereignis #24445 (99/352)
Berechne Variable Settlements, Ereignis #24447 (100/352)
Berechne Variable Settlements, Ereignis #24448 (101/352)
Berechne Variable Settlements, Ereignis #24449 (102/352)
Berechne Variable Settlements, Ereignis #24452 (103/352)
Berechne Variable Settlements, Ereignis #24453 (104/352)
Berechne Variable Settlements, Ereignis #24455 (105/352)
Berechne Variable Landnutzung, Ereignis #25697 (106/352)
Berechne Variable Landnutzung, Ereignis #25699 (107/352)
Berechne Variable Settlements, Ereignis #25702 (108/352)
Berechne Variable Settlements, Ereignis #25711 (109/352)
Berechne Variable Settlements, Ereignis #25717 (110/352)
Berechne Variable Settlements, Ereignis #25718 (111/352)
Berechne Variable Settlements, Ereignis #24456 (112/352)
Berechne Variable Settlements, Ereignis #24457 (113/352)
Berechne Variable Settlements, Ereignis #24458 (114/352)
Berechne Variable Settlements, Ereignis #24461 (115/352)
Berechne Variable Settlements, Ereignis #24462 (116/352)
Berechne Variable Settlements, Ereignis #24463 (117/352)
Berechne Variable Settlements, Ereignis #24466 (118/352)
Berechne Variable Settlements, Ereignis #24469 (119/352)
Berechne Variable Settlements, Ereignis #24471 (120/352)
Berechne Variable Settlements, Ereignis #24472 (121/352)
Berechne Variable Settlements, Ereignis #24474 (122/352)
Berechne Variable Settlements, Ereignis #24476 (123/352)
Berechne Variable Settlements, Ereignis #24478 (124/352)
Berechne Variable Settlements, Ereignis #24480 (125/352)
Berechne Variable Settlements, Ereignis #24481 (126/352)
Berechne Variable Settlements, Ereignis #24482 (127/352)
Berechne Variable Settlements, Ereignis #24483 (128/352)
Berechne Variable Settlements, Ereignis #24486 (129/352)
Berechne Variable Settlements, Ereignis #24488 (130/352)
Berechne Variable Settlements, Ereignis #24489 (131/352)
Berechne Variable Settlements, Ereignis #24490 (132/352)
Berechne Variable Settlements, Ereignis #24493 (133/352)
Berechne Variable Settlements, Ereignis #24494 (134/352)
Berechne Variable Settlements, Ereignis #24495 (135/352)
Berechne Variable Settlements, Ereignis #24496 (136/352)
Berechne Variable Settlements, Ereignis #24498 (137/352)
Berechne Variable Settlements, Ereignis #24502 (138/352)
Berechne Variable Settlements, Ereignis #24503 (139/352)
Berechne Variable Settlements, Ereignis #24504 (140/352)
Berechne Variable Settlements, Ereignis #24505 (141/352)
Berechne Variable Settlements, Ereignis #24507 (142/352)
Berechne Variable Settlements, Ereignis #24508 (143/352)
Berechne Variable Settlements, Ereignis #24511 (144/352)
Berechne Variable Settlements, Ereignis #24512 (145/352)
Berechne Variable Settlements, Ereignis #24513 (146/352)
Berechne Variable Settlements, Ereignis #24514 (147/352)
Berechne Variable Settlements, Ereignis #24516 (148/352)
Berechne Variable Settlements, Ereignis #24518 (149/352)
Berechne Variable Settlements, Ereignis #24519 (150/352)
Berechne Variable Settlements, Ereignis #24520 (151/352)
Berechne Variable Settlements, Ereignis #24523 (152/352)
Berechne Variable Settlements, Ereignis #24524 (153/352)
Berechne Variable Settlements, Ereignis #24525 (154/352)
Berechne Variable Settlements, Ereignis #24526 (155/352)
Berechne Variable Settlements, Ereignis #24527 (156/352)
Berechne Variable Settlements, Ereignis #24528 (157/352)
Berechne Variable Settlements, Ereignis #24534 (158/352)
Berechne Variable Settlements, Ereignis #24535 (159/352)
Berechne Variable Settlements, Ereignis #24536 (160/352)
Berechne Variable Settlements, Ereignis #24538 (161/352)
Berechne Variable Settlements, Ereignis #24539 (162/352)
Berechne Variable Settlements, Ereignis #24540 (163/352)
Berechne Variable Settlements, Ereignis #24541 (164/352)
Berechne Variable Settlements, Ereignis #24542 (165/352)
Berechne Variable Settlements, Ereignis #24543 (166/352)
Berechne Variable Settlements, Ereignis #24545 (167/352)
Berechne Variable Settlements, Ereignis #24551 (168/352)
Berechne Variable Settlements, Ereignis #24552 (169/352)
Berechne Variable Settlements, Ereignis #24553 (170/352)
Berechne Variable Settlements, Ereignis #24554 (171/352)
Berechne Variable Settlements, Ereignis #24555 (172/352)
Berechne Variable Settlements, Ereignis #24556 (173/352)
Berechne Variable Settlements, Ereignis #24561 (174/352)
Berechne Variable Settlements, Ereignis #24562 (175/352)
Berechne Variable Settlements, Ereignis #24563 (176/352)
Berechne Variable Settlements, Ereignis #24564 (177/352)
Berechne Variable Settlements, Ereignis #24565 (178/352)
Berechne Variable Settlements, Ereignis #24566 (179/352)
Berechne Variable Settlements, Ereignis #24567 (180/352)
Berechne Variable Settlements, Ereignis #24569 (181/352)
Berechne Variable Settlements, Ereignis #24570 (182/352)
Berechne Variable Settlements, Ereignis #24575 (183/352)
Berechne Variable Settlements, Ereignis #24578 (184/352)
Berechne Variable Settlements, Ereignis #24580 (185/352)
Berechne Variable Settlements, Ereignis #24582 (186/352)
Berechne Variable Settlements, Ereignis #24585 (187/352)
Berechne Variable Settlements, Ereignis #24587 (188/352)
Berechne Variable Settlements, Ereignis #24588 (189/352)
Berechne Variable Settlements, Ereignis #24589 (190/352)
Berechne Variable Settlements, Ereignis #24590 (191/352)
Berechne Variable Settlements, Ereignis #24591 (192/352)
Berechne Variable Settlements, Ereignis #24592 (193/352)
Berechne Variable Settlements, Ereignis #24593 (194/352)
Berechne Variable Settlements, Ereignis #24594 (195/352)
Berechne Variable Settlements, Ereignis #24595 (196/352)
Berechne Variable Settlements, Ereignis #24599 (197/352)
Berechne Variable Settlements, Ereignis #24600 (198/352)
Berechne Variable Settlements, Ereignis #24603 (199/352)
Berechne Variable Settlements, Ereignis #24606 (200/352)
Berechne Variable Settlements, Ereignis #24607 (201/352)
Berechne Variable Settlements, Ereignis #24609 (202/352)
Berechne Variable Settlements, Ereignis #24610 (203/352)
Berechne Variable Settlements, Ereignis #24612 (204/352)
Berechne Variable Settlements, Ereignis #24613 (205/352)
Berechne Variable Settlements, Ereignis #24614 (206/352)
Berechne Variable Settlements, Ereignis #24615 (207/352)
Berechne Variable Settlements, Ereignis #24620 (208/352)
Berechne Variable Settlements, Ereignis #24621 (209/352)
Berechne Variable Settlements, Ereignis #24623 (210/352)
Berechne Variable Settlements, Ereignis #24624 (211/352)
Berechne Variable Settlements, Ereignis #24625 (212/352)
Berechne Variable Settlements, Ereignis #24626 (213/352)
Berechne Variable Settlements, Ereignis #24629 (214/352)
Berechne Variable Settlements, Ereignis #24631 (215/352)
Berechne Variable Settlements, Ereignis #24632 (216/352)
Berechne Variable Settlements, Ereignis #24633 (217/352)
Berechne Variable Settlements, Ereignis #24634 (218/352)
Berechne Variable Settlements, Ereignis #24638 (219/352)
Berechne Variable Settlements, Ereignis #24639 (220/352)
Berechne Variable Settlements, Ereignis #24640 (221/352)
Berechne Variable Settlements, Ereignis #24644 (222/352)
Berechne Variable Settlements, Ereignis #24645 (223/352)
Berechne Variable Landnutzung, Ereignis #25677 (224/352)
Berechne Variable Settlements, Ereignis #25681 (225/352)
Berechne Variable Settlements, Ereignis #25684 (226/352)
Berechne Variable Settlements, Ereignis #25692 (227/352)
Berechne Variable Settlements, Ereignis #25695 (228/352)
Berechne Variable Settlements, Ereignis #24646 (229/352)
Berechne Variable Settlements, Ereignis #24648 (230/352)
Berechne Variable Settlements, Ereignis #24650 (231/352)
Berechne Variable Settlements, Ereignis #24651 (232/352)
Berechne Variable Settlements, Ereignis #24653 (233/352)
Berechne Variable Settlements, Ereignis #24655 (234/352)
Berechne Variable Settlements, Ereignis #24657 (235/352)
Berechne Variable Settlements, Ereignis #24659 (236/352)
Berechne Variable Settlements, Ereignis #24660 (237/352)
Berechne Variable Settlements, Ereignis #24663 (238/352)
Berechne Variable Settlements, Ereignis #24665 (239/352)
Berechne Variable Settlements, Ereignis #24668 (240/352)
Berechne Variable Settlements, Ereignis #24669 (241/352)
Berechne Variable Settlements, Ereignis #24670 (242/352)
Berechne Variable Settlements, Ereignis #24671 (243/352)
Berechne Variable Settlements, Ereignis #24673 (244/352)
Berechne Variable Settlements, Ereignis #24677 (245/352)
Berechne Variable Settlements, Ereignis #24678 (246/352)
Berechne Variable Settlements, Ereignis #24679 (247/352)
Berechne Variable Settlements, Ereignis #24681 (248/352)
Berechne Variable Settlements, Ereignis #24682 (249/352)
Berechne Variable Settlements, Ereignis #24684 (250/352)
Berechne Variable Settlements, Ereignis #24685 (251/352)
Berechne Variable Settlements, Ereignis #24686 (252/352)
Berechne Variable Settlements, Ereignis #24687 (253/352)
Berechne Variable Settlements, Ereignis #24690 (254/352)
Berechne Variable Settlements, Ereignis #24692 (255/352)
Berechne Variable Settlements, Ereignis #24693 (256/352)
Berechne Variable Settlements, Ereignis #24695 (257/352)
Berechne Variable Settlements, Ereignis #24697 (258/352)
Berechne Variable Settlements, Ereignis #24698 (259/352)
Berechne Variable Settlements, Ereignis #24699 (260/352)
Berechne Variable Settlements, Ereignis #24701 (261/352)
Berechne Variable Settlements, Ereignis #24703 (262/352)
Berechne Variable Settlements, Ereignis #24704 (263/352)
Berechne Variable Settlements, Ereignis #24706 (264/352)
Berechne Variable Settlements, Ereignis #24707 (265/352)
Berechne Variable Settlements, Ereignis #24708 (266/352)
Berechne Variable Settlements, Ereignis #24710 (267/352)
Berechne Variable Settlements, Ereignis #24712 (268/352)
Berechne Variable Settlements, Ereignis #24713 (269/352)
Berechne Variable Settlements, Ereignis #24715 (270/352)
Berechne Variable Settlements, Ereignis #24716 (271/352)
Berechne Variable Settlements, Ereignis #24718 (272/352)
Berechne Variable Settlements, Ereignis #24719 (273/352)
Berechne Variable Settlements, Ereignis #24722 (274/352)
Berechne Variable Settlements, Ereignis #24724 (275/352)
Berechne Variable Settlements, Ereignis #24725 (276/352)
Berechne Variable Landnutzung, Ereignis #25720 (277/352)
Berechne Variable Landnutzung, Ereignis #25721 (278/352)
Berechne Variable Settlements, Ereignis #25722 (279/352)
Berechne Variable Settlements, Ereignis #25727 (280/352)
Berechne Variable Settlements, Ereignis #25732 (281/352)
Berechne Variable Settlements, Ereignis #25735 (282/352)
Berechne Variable Settlements, Ereignis #24628 (283/352)
Berechne Variable Settlements, Ereignis #24726 (284/352)
Berechne Variable Settlements, Ereignis #24727 (285/352)
Berechne Variable Settlements, Ereignis #24728 (286/352)
Berechne Variable Settlements, Ereignis #24729 (287/352)
Berechne Variable Settlements, Ereignis #24733 (288/352)
Berechne Variable Settlements, Ereignis #24734 (289/352)
Berechne Variable Settlements, Ereignis #24736 (290/352)
Berechne Variable Settlements, Ereignis #24737 (291/352)
Berechne Variable Settlements, Ereignis #24739 (292/352)
Berechne Variable Settlements, Ereignis #24740 (293/352)
Berechne Variable Settlements, Ereignis #24741 (294/352)
Berechne Variable Settlements, Ereignis #24742 (295/352)
Berechne Variable Settlements, Ereignis #24743 (296/352)
Berechne Variable Settlements, Ereignis #24745 (297/352)
Berechne Variable Settlements, Ereignis #24747 (298/352)
Berechne Variable Settlements, Ereignis #24748 (299/352)
Berechne Variable Settlements, Ereignis #24752 (300/352)
Berechne Variable Settlements, Ereignis #24757 (301/352)
Berechne Variable Settlements, Ereignis #24759 (302/352)
Berechne Variable Settlements, Ereignis #24760 (303/352)
Berechne Variable Settlements, Ereignis #24761 (304/352)
Berechne Variable Settlements, Ereignis #24762 (305/352)
Berechne Variable Settlements, Ereignis #24763 (306/352)
Berechne Variable Settlements, Ereignis #24764 (307/352)
Berechne Variable Settlements, Ereignis #24765 (308/352)
Berechne Variable Settlements, Ereignis #24768 (309/352)
Berechne Variable Settlements, Ereignis #24770 (310/352)
Berechne Variable Settlements, Ereignis #24771 (311/352)
Berechne Variable Settlements, Ereignis #24772 (312/352)
Berechne Variable Settlements, Ereignis #24774 (313/352)
Berechne Variable Settlements, Ereignis #24775 (314/352)
Berechne Variable Settlements, Ereignis #24777 (315/352)
Berechne Variable Settlements, Ereignis #24778 (316/352)
Berechne Variable Settlements, Ereignis #24781 (317/352)
Berechne Variable Settlements, Ereignis #24782 (318/352)
Berechne Variable Settlements, Ereignis #24784 (319/352)
Berechne Variable Settlements, Ereignis #24786 (320/352)
Berechne Variable Settlements, Ereignis #24787 (321/352)
Berechne Variable Settlements, Ereignis #24788 (322/352)
Berechne Variable Settlements, Ereignis #24790 (323/352)
Berechne Variable Settlements, Ereignis #24791 (324/352)
Berechne Variable Settlements, Ereignis #24792 (325/352)
Berechne Variable Settlements, Ereignis #24793 (326/352)
Berechne Variable Settlements, Ereignis #24795 (327/352)
Berechne Variable Settlements, Ereignis #24797 (328/352)
Berechne Variable Settlements, Ereignis #24799 (329/352)
Berechne Variable Settlements, Ereignis #24800 (330/352)
Berechne Variable Settlements, Ereignis #24802 (331/352)
Berechne Variable Settlements, Ereignis #24803 (332/352)
Berechne Variable Settlements, Ereignis #24833 (333/352)
Berechne Variable Settlements, Ereignis #24837 (334/352)
Berechne Variable Landnutzung, Ereignis #25117 (335/352)
Berechne Variable Landnutzung, Ereignis #25126 (336/352)
Berechne Variable Settlements, Ereignis #24805 (337/352)
Berechne Variable Settlements, Ereignis #24807 (338/352)
Berechne Variable Settlements, Ereignis #24809 (339/352)
Berechne Variable Settlements, Ereignis #24810 (340/352)
Berechne Variable Settlements, Ereignis #24811 (341/352)
Berechne Variable Settlements, Ereignis #24812 (342/352)
Berechne Variable Settlements, Ereignis #24817 (343/352)
Berechne Variable Settlements, Ereignis #24818 (344/352)
Berechne Variable Settlements, Ereignis #24820 (345/352)
Berechne Variable Settlements, Ereignis #24821 (346/352)
Berechne Variable Settlements, Ereignis #24822 (347/352)
Berechne Variable Settlements, Ereignis #24824 (348/352)
Berechne Variable Settlements, Ereignis #24825 (349/352)
Berechne Variable Settlements, Ereignis #24828 (350/352)
Berechne Variable Settlements, Ereignis #24829 (351/352)
Berechne Variable Settlements, Ereignis #24830 (352/352)
Datei 'C:\Program Files\Housesoft\Zentrales System Emissionen\tables\data\crf_exporter\reporter_import_files\Submission 2024\import files\4 LULUCF\4E.xml' wurde geschrieben (11616 Werte).
Vorgang beendet (00:20:29.4713593)
