Vorgang gestartet
Berechne Variable Public Electricity and Heat Production, Ereignis #1129 (1/232)
Berechne Variable Public Electricity and Heat Production, Ereignis #1130 (2/232)
Berechne Variable Public Electricity and Heat Production, Ereignis #1131 (3/232)
Berechne Variable Public Electricity and Heat Production, Ereignis #1132 (4/232)
Berechne Variable Public Electricity and Heat Production, Ereignis #1133 (5/232)
Berechne Variable Public Electricity and Heat Production, Ereignis #1134 (6/232)
Berechne Variable Public Electricity and Heat Production, Ereignis #1135 (7/232)
Berechne Variable Public Electricity and Heat Production, Ereignis #1136 (8/232)
Berechne Variable Public Electricity and Heat Production, Ereignis #1137 (9/232)
Berechne Variable Public Electricity and Heat Production, Ereignis #1138 (10/232)
Berechne Variable Public Electricity and Heat Production, Ereignis #1139 (11/232)
Berechne Variable Public Electricity and Heat Production, Ereignis #1140 (12/232)
Berechne Variable Public Electricity and Heat Production, Ereignis #1141 (13/232)
Berechne Variable Public Electricity and Heat Production, Ereignis #1142 (14/232)
Berechne Variable Public Electricity and Heat Production, Ereignis #1143 (15/232)
Berechne Variable Public Electricity and Heat Production, Ereignis #1144 (16/232)
Berechne Variable Public Electricity and Heat Production, Ereignis #1145 (17/232)
Berechne Variable Public Electricity and Heat Production, Ereignis #1146 (18/232)
Berechne Variable Public Electricity and Heat Production, Ereignis #1147 (19/232)
Berechne Variable Public Electricity and Heat Production, Ereignis #1148 (20/232)
Berechne Variable Public Electricity and Heat Production, Ereignis #1149 (21/232)
Berechne Variable Public Electricity and Heat Production, Ereignis #1150 (22/232)
Berechne Variable Public Electricity and Heat Production, Ereignis #1151 (23/232)
Berechne Variable Public Electricity and Heat Production, Ereignis #1152 (24/232)
Berechne Variable Public Electricity and Heat Production, Ereignis #1153 (25/232)
Berechne Variable Public Electricity and Heat Production, Ereignis #1154 (26/232)
Berechne Variable Public Electricity and Heat Production, Ereignis #1155 (27/232)
Berechne Variable Public Electricity and Heat Production, Ereignis #1156 (28/232)
Berechne Variable Public Electricity and Heat Production, Ereignis #1157 (29/232)
Berechne Variable Public Electricity and Heat Production, Ereignis #1158 (30/232)
Berechne Variable Public Electricity and Heat Production, Ereignis #1159 (31/232)
Berechne Variable Public Electricity and Heat Production, Ereignis #1160 (32/232)
Berechne Variable Public Electricity and Heat Production, Ereignis #1161 (33/232)
Berechne Variable Public Electricity and Heat Production, Ereignis #1162 (34/232)
Berechne Variable Public Electricity and Heat Production, Ereignis #1163 (35/232)
Berechne Variable Public Electricity and Heat Production, Ereignis #1164 (36/232)
Berechne Variable Public Electricity and Heat Production, Ereignis #1165 (37/232)
Berechne Variable Public Electricity and Heat Production, Ereignis #1166 (38/232)
Berechne Variable Public Electricity and Heat Production, Ereignis #1167 (39/232)
Berechne Variable Public Electricity and Heat Production, Ereignis #1168 (40/232)
Berechne Variable Public Electricity and Heat Production, Ereignis #1169 (41/232)
Berechne Variable Public Electricity and Heat Production, Ereignis #1170 (42/232)
Berechne Variable Public Electricity and Heat Production, Ereignis #1171 (43/232)
Berechne Variable Public Electricity and Heat Production, Ereignis #1172 (44/232)
Berechne Variable Public Electricity and Heat Production, Ereignis #1173 (45/232)
Berechne Variable Public Electricity and Heat Production, Ereignis #1174 (46/232)
Berechne Variable Public Electricity and Heat Production, Ereignis #1175 (47/232)
Berechne Variable Public Electricity and Heat Production, Ereignis #1176 (48/232)
Berechne Variable Public Electricity and Heat Production, Ereignis #1177 (49/232)
Berechne Variable Public Electricity and Heat Production, Ereignis #1178 (50/232)
Berechne Variable Public Electricity and Heat Production, Ereignis #1179 (51/232)
Berechne Variable Public Electricity and Heat Production, Ereignis #1180 (52/232)
Berechne Variable Public Electricity and Heat Production, Ereignis #1181 (53/232)
Berechne Variable Public Electricity and Heat Production, Ereignis #1182 (54/232)
Berechne Variable Public Electricity and Heat Production, Ereignis #1183 (55/232)
Berechne Variable Public Electricity and Heat Production, Ereignis #1184 (56/232)
Berechne Variable Public Electricity and Heat Production, Ereignis #1185 (57/232)
Berechne Variable Public Electricity and Heat Production, Ereignis #1186 (58/232)
Berechne Variable Public Electricity and Heat Production, Ereignis #1187 (59/232)
Berechne Variable Public Electricity and Heat Production, Ereignis #1188 (60/232)
Berechne Variable Public Electricity and Heat Production, Ereignis #1189 (61/232)
Berechne Variable Public Electricity and Heat Production, Ereignis #1190 (62/232)
Berechne Variable Public Electricity and Heat Production, Ereignis #1191 (63/232)
Berechne Variable Public Electricity and Heat Production, Ereignis #1192 (64/232)
Berechne Variable Public Electricity and Heat Production, Ereignis #1193 (65/232)
Berechne Variable Public Electricity and Heat Production, Ereignis #1194 (66/232)
Berechne Variable Public Electricity and Heat Production, Ereignis #1195 (67/232)
Berechne Variable Public Electricity and Heat Production, Ereignis #1196 (68/232)
Berechne Variable Public Electricity and Heat Production, Ereignis #1197 (69/232)
Berechne Variable Public Electricity and Heat Production, Ereignis #1198 (70/232)
Berechne Variable Public Electricity and Heat Production, Ereignis #1199 (71/232)
Berechne Variable Public Electricity and Heat Production, Ereignis #1200 (72/232)
Berechne Variable Public Electricity and Heat Production, Ereignis #1201 (73/232)
Berechne Variable Public Electricity and Heat Production, Ereignis #1202 (74/232)
Berechne Variable Public Electricity and Heat Production, Ereignis #1203 (75/232)
Berechne Variable Public Electricity and Heat Production, Ereignis #1204 (76/232)
Berechne Variable Public Electricity and Heat Production, Ereignis #1205 (77/232)
Berechne Variable Public Electricity and Heat Production, Ereignis #1206 (78/232)
Berechne Variable Petroleum Refining, Ereignis #1207 (79/232)
Berechne Variable Petroleum Refining, Ereignis #1208 (80/232)
Berechne Variable Petroleum Refining, Ereignis #1209 (81/232)
Berechne Variable Petroleum Refining, Ereignis #1210 (82/232)
Berechne Variable Petroleum Refining, Ereignis #1211 (83/232)
Berechne Variable Petroleum Refining, Ereignis #1212 (84/232)
Berechne Variable Petroleum Refining, Ereignis #1213 (85/232)
Berechne Variable Petroleum Refining, Ereignis #1214 (86/232)
Berechne Variable Petroleum Refining, Ereignis #1215 (87/232)
Berechne Variable Petroleum Refining, Ereignis #1216 (88/232)
Berechne Variable Petroleum Refining, Ereignis #1217 (89/232)
Berechne Variable Petroleum Refining, Ereignis #1218 (90/232)
Berechne Variable Petroleum Refining, Ereignis #1219 (91/232)
Berechne Variable Petroleum Refining, Ereignis #1220 (92/232)
Berechne Variable Petroleum Refining, Ereignis #1221 (93/232)
Berechne Variable Petroleum Refining, Ereignis #1222 (94/232)
Berechne Variable Petroleum Refining, Ereignis #1223 (95/232)
Berechne Variable Petroleum Refining, Ereignis #1224 (96/232)
Berechne Variable Petroleum Refining, Ereignis #1225 (97/232)
Berechne Variable Petroleum Refining, Ereignis #1226 (98/232)
Berechne Variable Petroleum Refining, Ereignis #1227 (99/232)
Berechne Variable Petroleum Refining, Ereignis #1228 (100/232)
Berechne Variable Petroleum Refining, Ereignis #1229 (101/232)
Berechne Variable Petroleum Refining, Ereignis #1230 (102/232)
Berechne Variable Petroleum Refining, Ereignis #1231 (103/232)
Berechne Variable Petroleum Refining, Ereignis #1232 (104/232)
Berechne Variable Petroleum Refining, Ereignis #1233 (105/232)
Berechne Variable Petroleum Refining, Ereignis #1234 (106/232)
Berechne Variable Petroleum Refining, Ereignis #1235 (107/232)
Berechne Variable Petroleum Refining, Ereignis #1236 (108/232)
Berechne Variable Petroleum Refining, Ereignis #1237 (109/232)
Berechne Variable Petroleum Refining, Ereignis #1238 (110/232)
Berechne Variable Petroleum Refining, Ereignis #1239 (111/232)
Berechne Variable Petroleum Refining, Ereignis #1240 (112/232)
Berechne Variable Petroleum Refining, Ereignis #1241 (113/232)
Berechne Variable Petroleum Refining, Ereignis #1242 (114/232)
Berechne Variable Petroleum Refining, Ereignis #1243 (115/232)
Berechne Variable Petroleum Refining, Ereignis #1244 (116/232)
Berechne Variable Petroleum Refining, Ereignis #1245 (117/232)
Berechne Variable Petroleum Refining, Ereignis #1246 (118/232)
Berechne Variable Petroleum Refining, Ereignis #1247 (119/232)
Berechne Variable Petroleum Refining, Ereignis #1248 (120/232)
Berechne Variable Petroleum Refining, Ereignis #1249 (121/232)
Berechne Variable Petroleum Refining, Ereignis #1250 (122/232)
Berechne Variable Petroleum Refining, Ereignis #1251 (123/232)
Berechne Variable Petroleum Refining, Ereignis #1252 (124/232)
Berechne Variable Petroleum Refining, Ereignis #1253 (125/232)
Berechne Variable Petroleum Refining, Ereignis #1254 (126/232)
Berechne Variable Petroleum Refining, Ereignis #1255 (127/232)
Berechne Variable Petroleum Refining, Ereignis #1256 (128/232)
Berechne Variable Petroleum Refining, Ereignis #1257 (129/232)
Berechne Variable Petroleum Refining, Ereignis #1258 (130/232)
Berechne Variable Petroleum Refining, Ereignis #1259 (131/232)
Berechne Variable Petroleum Refining, Ereignis #1260 (132/232)
Berechne Variable Petroleum Refining, Ereignis #1261 (133/232)
Berechne Variable Petroleum Refining, Ereignis #1262 (134/232)
Berechne Variable Petroleum Refining, Ereignis #1263 (135/232)
Berechne Variable Petroleum Refining, Ereignis #1264 (136/232)
Berechne Variable Petroleum Refining, Ereignis #1265 (137/232)
Berechne Variable Petroleum Refining, Ereignis #1266 (138/232)
Berechne Variable Petroleum Refining, Ereignis #1267 (139/232)
Berechne Variable Petroleum Refining, Ereignis #1268 (140/232)
Berechne Variable Petroleum Refining, Ereignis #1269 (141/232)
Berechne Variable Petroleum Refining, Ereignis #1270 (142/232)
Berechne Variable Petroleum Refining, Ereignis #1271 (143/232)
Berechne Variable Petroleum Refining, Ereignis #1272 (144/232)
Berechne Variable Petroleum Refining, Ereignis #1273 (145/232)
Berechne Variable Petroleum Refining, Ereignis #1274 (146/232)
Berechne Variable Petroleum Refining, Ereignis #1275 (147/232)
Berechne Variable Petroleum Refining, Ereignis #1276 (148/232)
Berechne Variable Petroleum Refining, Ereignis #1277 (149/232)
Berechne Variable Petroleum Refining, Ereignis #1278 (150/232)
Berechne Variable Petroleum Refining, Ereignis #1279 (151/232)
Berechne Variable Petroleum Refining, Ereignis #1280 (152/232)
Berechne Variable Petroleum Refining, Ereignis #1281 (153/232)
Berechne Variable Petroleum Refining, Ereignis #1282 (154/232)
Berechne Variable Petroleum Refining, Ereignis #1283 (155/232)
Berechne Variable Manufacture of Solid Fuels and Other Energy Industries, Ereignis #1284 (156/232)
Berechne Variable Manufacture of Solid Fuels and Other Energy Industries, Ereignis #1285 (157/232)
Berechne Variable Manufacture of Solid Fuels and Other Energy Industries, Ereignis #1286 (158/232)
Berechne Variable Manufacture of Solid Fuels and Other Energy Industries, Ereignis #1287 (159/232)
Berechne Variable Manufacture of Solid Fuels and Other Energy Industries, Ereignis #1288 (160/232)
Berechne Variable Manufacture of Solid Fuels and Other Energy Industries, Ereignis #1289 (161/232)
Berechne Variable Manufacture of Solid Fuels and Other Energy Industries, Ereignis #1290 (162/232)
Berechne Variable Manufacture of Solid Fuels and Other Energy Industries, Ereignis #1291 (163/232)
Berechne Variable Manufacture of Solid Fuels and Other Energy Industries, Ereignis #1292 (164/232)
Berechne Variable Manufacture of Solid Fuels and Other Energy Industries, Ereignis #1293 (165/232)
Berechne Variable Manufacture of Solid Fuels and Other Energy Industries, Ereignis #1294 (166/232)
Berechne Variable Manufacture of Solid Fuels and Other Energy Industries, Ereignis #1295 (167/232)
Berechne Variable Manufacture of Solid Fuels and Other Energy Industries, Ereignis #1296 (168/232)
Berechne Variable Manufacture of Solid Fuels and Other Energy Industries, Ereignis #1297 (169/232)
Berechne Variable Manufacture of Solid Fuels and Other Energy Industries, Ereignis #1298 (170/232)
Berechne Variable Manufacture of Solid Fuels and Other Energy Industries, Ereignis #1299 (171/232)
Berechne Variable Manufacture of Solid Fuels and Other Energy Industries, Ereignis #1300 (172/232)
Berechne Variable Manufacture of Solid Fuels and Other Energy Industries, Ereignis #1301 (173/232)
Berechne Variable Manufacture of Solid Fuels and Other Energy Industries, Ereignis #1302 (174/232)
Berechne Variable Manufacture of Solid Fuels and Other Energy Industries, Ereignis #1303 (175/232)
Berechne Variable Manufacture of Solid Fuels and Other Energy Industries, Ereignis #1304 (176/232)
Berechne Variable Manufacture of Solid Fuels and Other Energy Industries, Ereignis #1305 (177/232)
Berechne Variable Manufacture of Solid Fuels and Other Energy Industries, Ereignis #1306 (178/232)
Berechne Variable Manufacture of Solid Fuels and Other Energy Industries, Ereignis #1307 (179/232)
Berechne Variable Manufacture of Solid Fuels and Other Energy Industries, Ereignis #1308 (180/232)
Berechne Variable Manufacture of Solid Fuels and Other Energy Industries, Ereignis #1309 (181/232)
Berechne Variable Manufacture of Solid Fuels and Other Energy Industries, Ereignis #1310 (182/232)
Berechne Variable Manufacture of Solid Fuels and Other Energy Industries, Ereignis #1311 (183/232)
Berechne Variable Manufacture of Solid Fuels and Other Energy Industries, Ereignis #1312 (184/232)
Berechne Variable Manufacture of Solid Fuels and Other Energy Industries, Ereignis #1313 (185/232)
Berechne Variable Manufacture of Solid Fuels and Other Energy Industries, Ereignis #1314 (186/232)
Berechne Variable Manufacture of Solid Fuels and Other Energy Industries, Ereignis #1315 (187/232)
Berechne Variable Manufacture of Solid Fuels and Other Energy Industries, Ereignis #1316 (188/232)
Berechne Variable Manufacture of Solid Fuels and Other Energy Industries, Ereignis #1317 (189/232)
Berechne Variable Manufacture of Solid Fuels and Other Energy Industries, Ereignis #1318 (190/232)
Berechne Variable Manufacture of Solid Fuels and Other Energy Industries, Ereignis #1319 (191/232)
Berechne Variable Manufacture of Solid Fuels and Other Energy Industries, Ereignis #1320 (192/232)
Berechne Variable Manufacture of Solid Fuels and Other Energy Industries, Ereignis #1321 (193/232)
Berechne Variable Manufacture of Solid Fuels and Other Energy Industries, Ereignis #1322 (194/232)
Berechne Variable Manufacture of Solid Fuels and Other Energy Industries, Ereignis #1323 (195/232)
Berechne Variable Manufacture of Solid Fuels and Other Energy Industries, Ereignis #1324 (196/232)
Berechne Variable Manufacture of Solid Fuels and Other Energy Industries, Ereignis #1325 (197/232)
Berechne Variable Manufacture of Solid Fuels and Other Energy Industries, Ereignis #1326 (198/232)
Berechne Variable Manufacture of Solid Fuels and Other Energy Industries, Ereignis #1327 (199/232)
Berechne Variable Manufacture of Solid Fuels and Other Energy Industries, Ereignis #1328 (200/232)
Berechne Variable Manufacture of Solid Fuels and Other Energy Industries, Ereignis #1329 (201/232)
Berechne Variable Manufacture of Solid Fuels and Other Energy Industries, Ereignis #1330 (202/232)
Berechne Variable Manufacture of Solid Fuels and Other Energy Industries, Ereignis #1331 (203/232)
Berechne Variable Manufacture of Solid Fuels and Other Energy Industries, Ereignis #1332 (204/232)
Berechne Variable Manufacture of Solid Fuels and Other Energy Industries, Ereignis #1333 (205/232)
Berechne Variable Manufacture of Solid Fuels and Other Energy Industries, Ereignis #1334 (206/232)
Berechne Variable Manufacture of Solid Fuels and Other Energy Industries, Ereignis #1335 (207/232)
Berechne Variable Manufacture of Solid Fuels and Other Energy Industries, Ereignis #1336 (208/232)
Berechne Variable Manufacture of Solid Fuels and Other Energy Industries, Ereignis #1337 (209/232)
Berechne Variable Manufacture of Solid Fuels and Other Energy Industries, Ereignis #1338 (210/232)
Berechne Variable Manufacture of Solid Fuels and Other Energy Industries, Ereignis #1339 (211/232)
Berechne Variable Manufacture of Solid Fuels and Other Energy Industries, Ereignis #1340 (212/232)
Berechne Variable Manufacture of Solid Fuels and Other Energy Industries, Ereignis #1341 (213/232)
Berechne Variable Manufacture of Solid Fuels and Other Energy Industries, Ereignis #1342 (214/232)
Berechne Variable Manufacture of Solid Fuels and Other Energy Industries, Ereignis #1343 (215/232)
Berechne Variable Manufacture of Solid Fuels and Other Energy Industries, Ereignis #1344 (216/232)
Berechne Variable Manufacture of Solid Fuels and Other Energy Industries, Ereignis #1345 (217/232)
Berechne Variable Manufacture of Solid Fuels and Other Energy Industries, Ereignis #1346 (218/232)
Berechne Variable Manufacture of Solid Fuels and Other Energy Industries, Ereignis #1347 (219/232)
Berechne Variable Manufacture of Solid Fuels and Other Energy Industries, Ereignis #1348 (220/232)
Berechne Variable Manufacture of Solid Fuels and Other Energy Industries, Ereignis #1349 (221/232)
Berechne Variable Manufacture of Solid Fuels and Other Energy Industries, Ereignis #1350 (222/232)
Berechne Variable Manufacture of Solid Fuels and Other Energy Industries, Ereignis #1351 (223/232)
Berechne Variable Manufacture of Solid Fuels and Other Energy Industries, Ereignis #1352 (224/232)
Berechne Variable Manufacture of Solid Fuels and Other Energy Industries, Ereignis #1353 (225/232)
Berechne Variable Manufacture of Solid Fuels and Other Energy Industries, Ereignis #1354 (226/232)
Berechne Variable Manufacture of Solid Fuels and Other Energy Industries, Ereignis #1355 (227/232)
Berechne Variable Manufacture of Solid Fuels and Other Energy Industries, Ereignis #1356 (228/232)
Berechne Variable Manufacture of Solid Fuels and Other Energy Industries, Ereignis #1357 (229/232)
Berechne Variable Manufacture of Solid Fuels and Other Energy Industries, Ereignis #1358 (230/232)
Berechne Variable Manufacture of Solid Fuels and Other Energy Industries, Ereignis #1359 (231/232)
Berechne Variable Manufacture of Solid Fuels and Other Energy Industries, Ereignis #1360 (232/232)
Datei '\\tsclient\C\Program Files\Housesoft\ZSEnext\tables\data\crf_exporter\reporter_import_files\Submission 2024\import files\1 Energy\1A1.xml' wurde geschrieben (7656 Werte).
Vorgang beendet (00:06:21.7430601)
