Vorgang gestartet
Berechne Variable Feedstocks, reductants and other non-energy use of fuels, Ereignis #12530 (1/195)
Berechne Variable Feedstocks, reductants and other non-energy use of fuels, Ereignis #12531 (2/195)
Berechne Variable Feedstocks, reductants and other non-energy use of fuels, Ereignis #12533 (3/195)
Berechne Variable Feedstocks, reductants and other non-energy use of fuels, Ereignis #12535 (4/195)
Berechne Variable Feedstocks, reductants and other non-energy use of fuels, Ereignis #12536 (5/195)
Berechne Variable Feedstocks, reductants and other non-energy use of fuels, Ereignis #12537 (6/195)
Berechne Variable Feedstocks, reductants and other non-energy use of fuels, Ereignis #12538 (7/195)
Berechne Variable Feedstocks, reductants and other non-energy use of fuels, Ereignis #12539 (8/195)
Berechne Variable Feedstocks, reductants and other non-energy use of fuels, Ereignis #12540 (9/195)
Berechne Variable Feedstocks, reductants and other non-energy use of fuels, Ereignis #12541 (10/195)
Berechne Variable Feedstocks, reductants and other non-energy use of fuels, Ereignis #12542 (11/195)
Berechne Variable Feedstocks, reductants and other non-energy use of fuels, Ereignis #12545 (12/195)
Berechne Variable Feedstocks, reductants and other non-energy use of fuels, Ereignis #12547 (13/195)
Berechne Variable Feedstocks, reductants and other non-energy use of fuels, Ereignis #12548 (14/195)
Berechne Variable Feedstocks, reductants and other non-energy use of fuels, Ereignis #12549 (15/195)
Berechne Variable Feedstocks, reductants and other non-energy use of fuels, Ereignis #12550 (16/195)
Berechne Variable Feedstocks, reductants and other non-energy use of fuels, Ereignis #12551 (17/195)
Berechne Variable Feedstocks, reductants and other non-energy use of fuels, Ereignis #12552 (18/195)
Berechne Variable Feedstocks, reductants and other non-energy use of fuels, Ereignis #12554 (19/195)
Berechne Variable Feedstocks, reductants and other non-energy use of fuels, Ereignis #12555 (20/195)
Berechne Variable Feedstocks, reductants and other non-energy use of fuels, Ereignis #12556 (21/195)
Berechne Variable Feedstocks, reductants and other non-energy use of fuels, Ereignis #12557 (22/195)
Berechne Variable Feedstocks, reductants and other non-energy use of fuels, Ereignis #12559 (23/195)
Berechne Variable Feedstocks, reductants and other non-energy use of fuels, Ereignis #12560 (24/195)
Berechne Variable Feedstocks, reductants and other non-energy use of fuels, Ereignis #12562 (25/195)
Berechne Variable Feedstocks, reductants and other non-energy use of fuels, Ereignis #12563 (26/195)
Berechne Variable Feedstocks, reductants and other non-energy use of fuels, Ereignis #12564 (27/195)
Berechne Variable Feedstocks, reductants and other non-energy use of fuels, Ereignis #12567 (28/195)
Berechne Variable Feedstocks, reductants and other non-energy use of fuels, Ereignis #12568 (29/195)
Berechne Variable Feedstocks, reductants and other non-energy use of fuels, Ereignis #12569 (30/195)
Berechne Variable Feedstocks, reductants and other non-energy use of fuels, Ereignis #12570 (31/195)
Berechne Variable Feedstocks, reductants and other non-energy use of fuels, Ereignis #12573 (32/195)
Berechne Variable Feedstocks, reductants and other non-energy use of fuels, Ereignis #12574 (33/195)
Berechne Variable Feedstocks, reductants and other non-energy use of fuels, Ereignis #12575 (34/195)
Berechne Variable Feedstocks, reductants and other non-energy use of fuels, Ereignis #12576 (35/195)
Berechne Variable Feedstocks, reductants and other non-energy use of fuels, Ereignis #12577 (36/195)
Berechne Variable Feedstocks, reductants and other non-energy use of fuels, Ereignis #12578 (37/195)
Berechne Variable Feedstocks, reductants and other non-energy use of fuels, Ereignis #12579 (38/195)
Berechne Variable Feedstocks, reductants and other non-energy use of fuels, Ereignis #12580 (39/195)
Berechne Variable Feedstocks, reductants and other non-energy use of fuels, Ereignis #12581 (40/195)
Berechne Variable Feedstocks, reductants and other non-energy use of fuels, Ereignis #12584 (41/195)
Berechne Variable Feedstocks, reductants and other non-energy use of fuels, Ereignis #12585 (42/195)
Berechne Variable Feedstocks, reductants and other non-energy use of fuels, Ereignis #12587 (43/195)
Berechne Variable Feedstocks, reductants and other non-energy use of fuels, Ereignis #12588 (44/195)
Berechne Variable Feedstocks, reductants and other non-energy use of fuels, Ereignis #12589 (45/195)
Berechne Variable Feedstocks, reductants and other non-energy use of fuels, Ereignis #12590 (46/195)
Berechne Variable Feedstocks, reductants and other non-energy use of fuels, Ereignis #12592 (47/195)
Berechne Variable Feedstocks, reductants and other non-energy use of fuels, Ereignis #12593 (48/195)
Berechne Variable Feedstocks, reductants and other non-energy use of fuels, Ereignis #12599 (49/195)
Berechne Variable Feedstocks, reductants and other non-energy use of fuels, Ereignis #12600 (50/195)
Berechne Variable Feedstocks, reductants and other non-energy use of fuels, Ereignis #12601 (51/195)
Berechne Variable Feedstocks, reductants and other non-energy use of fuels, Ereignis #12602 (52/195)
Berechne Variable Feedstocks, reductants and other non-energy use of fuels, Ereignis #12603 (53/195)
Berechne Variable Feedstocks, reductants and other non-energy use of fuels, Ereignis #12604 (54/195)
Berechne Variable Feedstocks, reductants and other non-energy use of fuels, Ereignis #12605 (55/195)
Berechne Variable Feedstocks, reductants and other non-energy use of fuels, Ereignis #12607 (56/195)
Berechne Variable Feedstocks, reductants and other non-energy use of fuels, Ereignis #12608 (57/195)
Berechne Variable Feedstocks, reductants and other non-energy use of fuels, Ereignis #12609 (58/195)
Berechne Variable Feedstocks, reductants and other non-energy use of fuels, Ereignis #12636 (59/195)
Berechne Variable Feedstocks, reductants and other non-energy use of fuels, Ereignis #12635 (60/195)
Berechne Variable Feedstocks, reductants and other non-energy use of fuels, Ereignis #12632 (61/195)
Berechne Variable Feedstocks, reductants and other non-energy use of fuels, Ereignis #12631 (62/195)
Berechne Variable Feedstocks, reductants and other non-energy use of fuels, Ereignis #12630 (63/195)
Berechne Variable Feedstocks, reductants and other non-energy use of fuels, Ereignis #12629 (64/195)
Berechne Variable Feedstocks, reductants and other non-energy use of fuels, Ereignis #12628 (65/195)
Berechne Variable Feedstocks, reductants and other non-energy use of fuels, Ereignis #12627 (66/195)
Berechne Variable Feedstocks, reductants and other non-energy use of fuels, Ereignis #12626 (67/195)
Berechne Variable Feedstocks, reductants and other non-energy use of fuels, Ereignis #12624 (68/195)
Berechne Variable Feedstocks, reductants and other non-energy use of fuels, Ereignis #12623 (69/195)
Berechne Variable Feedstocks, reductants and other non-energy use of fuels, Ereignis #12622 (70/195)
Berechne Variable Feedstocks, reductants and other non-energy use of fuels, Ereignis #12620 (71/195)
Berechne Variable Feedstocks, reductants and other non-energy use of fuels, Ereignis #12618 (72/195)
Berechne Variable Feedstocks, reductants and other non-energy use of fuels, Ereignis #12617 (73/195)
Berechne Variable Feedstocks, reductants and other non-energy use of fuels, Ereignis #12616 (74/195)
Berechne Variable Feedstocks, reductants and other non-energy use of fuels, Ereignis #12615 (75/195)
Berechne Variable Feedstocks, reductants and other non-energy use of fuels, Ereignis #12613 (76/195)
Berechne Variable Feedstocks, reductants and other non-energy use of fuels, Ereignis #12612 (77/195)
Berechne Variable Feedstocks, reductants and other non-energy use of fuels, Ereignis #12637 (78/195)
Berechne Variable Feedstocks, reductants and other non-energy use of fuels, Ereignis #12639 (79/195)
Berechne Variable Feedstocks, reductants and other non-energy use of fuels, Ereignis #12640 (80/195)
Berechne Variable Feedstocks, reductants and other non-energy use of fuels, Ereignis #12641 (81/195)
Berechne Variable Feedstocks, reductants and other non-energy use of fuels, Ereignis #12669 (82/195)
Berechne Variable Feedstocks, reductants and other non-energy use of fuels, Ereignis #12671 (83/195)
Berechne Variable Feedstocks, reductants and other non-energy use of fuels, Ereignis #12673 (84/195)
Berechne Variable Feedstocks, reductants and other non-energy use of fuels, Ereignis #12642 (85/195)
Berechne Variable Feedstocks, reductants and other non-energy use of fuels, Ereignis #12651 (86/195)
Berechne Variable Feedstocks, reductants and other non-energy use of fuels, Ereignis #12652 (87/195)
Berechne Variable Feedstocks, reductants and other non-energy use of fuels, Ereignis #12653 (88/195)
Berechne Variable Feedstocks, reductants and other non-energy use of fuels, Ereignis #12655 (89/195)
Berechne Variable Feedstocks, reductants and other non-energy use of fuels, Ereignis #12656 (90/195)
Berechne Variable Feedstocks, reductants and other non-energy use of fuels, Ereignis #12657 (91/195)
Berechne Variable Feedstocks, reductants and other non-energy use of fuels, Ereignis #12659 (92/195)
Berechne Variable Feedstocks, reductants and other non-energy use of fuels, Ereignis #12660 (93/195)
Berechne Variable Feedstocks, reductants and other non-energy use of fuels, Ereignis #12662 (94/195)
Berechne Variable Feedstocks, reductants and other non-energy use of fuels, Ereignis #12664 (95/195)
Berechne Variable Feedstocks, reductants and other non-energy use of fuels, Ereignis #12665 (96/195)
Berechne Variable Feedstocks, reductants and other non-energy use of fuels, Ereignis #12666 (97/195)
Berechne Variable Feedstocks, reductants and other non-energy use of fuels, Ereignis #12667 (98/195)
Berechne Variable Feedstocks, reductants and other non-energy use of fuels, Ereignis #12668 (99/195)
Berechne Variable Feedstocks, reductants and other non-energy use of fuels, Ereignis #12674 (100/195)
Berechne Variable Feedstocks, reductants and other non-energy use of fuels, Ereignis #12676 (101/195)
Berechne Variable Feedstocks, reductants and other non-energy use of fuels, Ereignis #12678 (102/195)
Berechne Variable Feedstocks, reductants and other non-energy use of fuels, Ereignis #12679 (103/195)
Berechne Variable Feedstocks, reductants and other non-energy use of fuels, Ereignis #12680 (104/195)
Berechne Variable Feedstocks, reductants and other non-energy use of fuels, Ereignis #12681 (105/195)
Berechne Variable Feedstocks, reductants and other non-energy use of fuels, Ereignis #12682 (106/195)
Berechne Variable Feedstocks, reductants and other non-energy use of fuels, Ereignis #12683 (107/195)
Berechne Variable Feedstocks, reductants and other non-energy use of fuels, Ereignis #12684 (108/195)
Berechne Variable Feedstocks, reductants and other non-energy use of fuels, Ereignis #12685 (109/195)
Berechne Variable Feedstocks, reductants and other non-energy use of fuels, Ereignis #12690 (110/195)
Berechne Variable Feedstocks, reductants and other non-energy use of fuels, Ereignis #12699 (111/195)
Berechne Variable Feedstocks, reductants and other non-energy use of fuels, Ereignis #12701 (112/195)
Berechne Variable Feedstocks, reductants and other non-energy use of fuels, Ereignis #12698 (113/195)
Berechne Variable Feedstocks, reductants and other non-energy use of fuels, Ereignis #12691 (114/195)
Berechne Variable Feedstocks, reductants and other non-energy use of fuels, Ereignis #12692 (115/195)
Berechne Variable Feedstocks, reductants and other non-energy use of fuels, Ereignis #12694 (116/195)
Berechne Variable Feedstocks, reductants and other non-energy use of fuels, Ereignis #12695 (117/195)
Berechne Variable Feedstocks, reductants and other non-energy use of fuels, Ereignis #12696 (118/195)
Berechne Variable Feedstocks, reductants and other non-energy use of fuels, Ereignis #12702 (119/195)
Berechne Variable Feedstocks, reductants and other non-energy use of fuels, Ereignis #12703 (120/195)
Berechne Variable Feedstocks, reductants and other non-energy use of fuels, Ereignis #12704 (121/195)
Berechne Variable Feedstocks, reductants and other non-energy use of fuels, Ereignis #12705 (122/195)
Berechne Variable Feedstocks, reductants and other non-energy use of fuels, Ereignis #12707 (123/195)
Berechne Variable Feedstocks, reductants and other non-energy use of fuels, Ereignis #12708 (124/195)
Berechne Variable Feedstocks, reductants and other non-energy use of fuels, Ereignis #12709 (125/195)
Berechne Variable Feedstocks, reductants and other non-energy use of fuels, Ereignis #12711 (126/195)
Berechne Variable Feedstocks, reductants and other non-energy use of fuels, Ereignis #12712 (127/195)
Berechne Variable Feedstocks, reductants and other non-energy use of fuels, Ereignis #12716 (128/195)
Berechne Variable Feedstocks, reductants and other non-energy use of fuels, Ereignis #12717 (129/195)
Berechne Variable Feedstocks, reductants and other non-energy use of fuels, Ereignis #12718 (130/195)
Berechne Variable Feedstocks, reductants and other non-energy use of fuels, Ereignis #12713 (131/195)
Berechne Variable Feedstocks, reductants and other non-energy use of fuels, Ereignis #12722 (132/195)
Berechne Variable Feedstocks, reductants and other non-energy use of fuels, Ereignis #12723 (133/195)
Berechne Variable Feedstocks, reductants and other non-energy use of fuels, Ereignis #12724 (134/195)
Berechne Variable Feedstocks, reductants and other non-energy use of fuels, Ereignis #12720 (135/195)
Berechne Variable Feedstocks, reductants and other non-energy use of fuels, Ereignis #12727 (136/195)
Berechne Variable Feedstocks, reductants and other non-energy use of fuels, Ereignis #12728 (137/195)
Berechne Variable Feedstocks, reductants and other non-energy use of fuels, Ereignis #12729 (138/195)
Berechne Variable Feedstocks, reductants and other non-energy use of fuels, Ereignis #12730 (139/195)
Berechne Variable Feedstocks, reductants and other non-energy use of fuels, Ereignis #12731 (140/195)
Berechne Variable Feedstocks, reductants and other non-energy use of fuels, Ereignis #12735 (141/195)
Berechne Variable Feedstocks, reductants and other non-energy use of fuels, Ereignis #12736 (142/195)
Berechne Variable Feedstocks, reductants and other non-energy use of fuels, Ereignis #12726 (143/195)
Berechne Variable Feedstocks, reductants and other non-energy use of fuels, Ereignis #12738 (144/195)
Berechne Variable Feedstocks, reductants and other non-energy use of fuels, Ereignis #12740 (145/195)
Berechne Variable Feedstocks, reductants and other non-energy use of fuels, Ereignis #12737 (146/195)
Berechne Variable Feedstocks, reductants and other non-energy use of fuels, Ereignis #12742 (147/195)
Berechne Variable Feedstocks, reductants and other non-energy use of fuels, Ereignis #12743 (148/195)
Berechne Variable Feedstocks, reductants and other non-energy use of fuels, Ereignis #12744 (149/195)
Berechne Variable Feedstocks, reductants and other non-energy use of fuels, Ereignis #12746 (150/195)
Berechne Variable Feedstocks, reductants and other non-energy use of fuels, Ereignis #12750 (151/195)
Berechne Variable Feedstocks, reductants and other non-energy use of fuels, Ereignis #12751 (152/195)
Berechne Variable Feedstocks, reductants and other non-energy use of fuels, Ereignis #12752 (153/195)
Berechne Variable Feedstocks, reductants and other non-energy use of fuels, Ereignis #12753 (154/195)
Berechne Variable Feedstocks, reductants and other non-energy use of fuels, Ereignis #12754 (155/195)
Berechne Variable Feedstocks, reductants and other non-energy use of fuels, Ereignis #12755 (156/195)
Berechne Variable Feedstocks, reductants and other non-energy use of fuels, Ereignis #12756 (157/195)
Berechne Variable Feedstocks, reductants and other non-energy use of fuels, Ereignis #12757 (158/195)
Berechne Variable Feedstocks, reductants and other non-energy use of fuels, Ereignis #12748 (159/195)
Berechne Variable Feedstocks, reductants and other non-energy use of fuels, Ereignis #12749 (160/195)
Berechne Variable Feedstocks, reductants and other non-energy use of fuels, Ereignis #12762 (161/195)
Berechne Variable Feedstocks, reductants and other non-energy use of fuels, Ereignis #12763 (162/195)
Berechne Variable Feedstocks, reductants and other non-energy use of fuels, Ereignis #12764 (163/195)
Berechne Variable Feedstocks, reductants and other non-energy use of fuels, Ereignis #12759 (164/195)
Berechne Variable Feedstocks, reductants and other non-energy use of fuels, Ereignis #12765 (165/195)
Berechne Variable Feedstocks, reductants and other non-energy use of fuels, Ereignis #12767 (166/195)
Berechne Variable Feedstocks, reductants and other non-energy use of fuels, Ereignis #12768 (167/195)
Berechne Variable Feedstocks, reductants and other non-energy use of fuels, Ereignis #12761 (168/195)
Berechne Variable Feedstocks, reductants and other non-energy use of fuels, Ereignis #12773 (169/195)
Berechne Variable Feedstocks, reductants and other non-energy use of fuels, Ereignis #12774 (170/195)
Berechne Variable Feedstocks, reductants and other non-energy use of fuels, Ereignis #12776 (171/195)
Berechne Variable Feedstocks, reductants and other non-energy use of fuels, Ereignis #12778 (172/195)
Berechne Variable Feedstocks, reductants and other non-energy use of fuels, Ereignis #12770 (173/195)
Berechne Variable Feedstocks, reductants and other non-energy use of fuels, Ereignis #12772 (174/195)
Berechne Variable Feedstocks, reductants and other non-energy use of fuels, Ereignis #12790 (175/195)
Berechne Variable Feedstocks, reductants and other non-energy use of fuels, Ereignis #29343 (176/195)
Berechne Variable Feedstocks, reductants and other non-energy use of fuels, Ereignis #29344 (177/195)
Berechne Variable Feedstocks, reductants and other non-energy use of fuels, Ereignis #12792 (178/195)
Berechne Variable Feedstocks, reductants and other non-energy use of fuels, Ereignis #12793 (179/195)
Berechne Variable Feedstocks, reductants and other non-energy use of fuels, Ereignis #12794 (180/195)
Berechne Variable Feedstocks, reductants and other non-energy use of fuels, Ereignis #12795 (181/195)
Berechne Variable Feedstocks, reductants and other non-energy use of fuels, Ereignis #12797 (182/195)
Berechne Variable Feedstocks, reductants and other non-energy use of fuels, Ereignis #12799 (183/195)
Berechne Variable Feedstocks, reductants and other non-energy use of fuels, Ereignis #12781 (184/195)
Berechne Variable Feedstocks, reductants and other non-energy use of fuels, Ereignis #12782 (185/195)
Berechne Variable Feedstocks, reductants and other non-energy use of fuels, Ereignis #12802 (186/195)
Berechne Variable Feedstocks, reductants and other non-energy use of fuels, Ereignis #12803 (187/195)
Berechne Variable Feedstocks, reductants and other non-energy use of fuels, Ereignis #12804 (188/195)
Berechne Variable Feedstocks, reductants and other non-energy use of fuels, Ereignis #12805 (189/195)
Berechne Variable Feedstocks, reductants and other non-energy use of fuels, Ereignis #12800 (190/195)
Berechne Variable Feedstocks, reductants and other non-energy use of fuels, Ereignis #29347 (191/195)
Berechne Variable Feedstocks, reductants and other non-energy use of fuels, Ereignis #22584 (192/195)
Berechne Variable Feedstocks, reductants and other non-energy use of fuels, Ereignis #22585 (193/195)
Berechne Variable Feedstocks, reductants and other non-energy use of fuels, Ereignis #22586 (194/195)
Berechne Variable Feedstocks, reductants and other non-energy use of fuels, Ereignis #22588 (195/195)
Datei '\\tsclient\C\Program Files\Housesoft\ZSEnext\tables\data\crf_exporter\reporter_import_files\Submission 2024\import files\1 Energy\1A(d).xml' wurde geschrieben (6435 Werte).
Vorgang beendet (00:03:05.7007539)
