"ObjNr","ID","parent","label_en","label_de"
"64575","AIRCRAFT","","Aircraft","Luftfahrzeug"
"64576","LAND_VEHICLE","","Land vehicle","Landfahrzeug"
"64577","CONSTRUCTION_VEHICLE","LAND_VEHICLE","Construction site vehicle","Baufahrzeug"
"64578","ROAD_VEHICLE","LAND_VEHICLE","Road vehicle","Straßenfahrzeug"
"64436","PASSENGER_CAR","ROAD_VEHICLE","Passenger car","Personenkraftwagen"
"64437","LIGHT_DUTY_VEHICLE","ROAD_VEHICLE","Light duty vehicle","Leichtes Nutzfahrzeug"
"64438","HEAVY_DUTY_VEHICLE","ROAD_VEHICLE","Heavy duty vehicle","Schweres Nutzfahrzeug"
"64439","BUS","ROAD_VEHICLE","Bus","Bus"
"64440","MOPED","ROAD_VEHICLE","Moped","Moped"
"64441","MOTORCYCLE","ROAD_VEHICLE","Motorcycle","Motorrad"
"64579","RAIL_VEHICLE","LAND_VEHICLE","Rail vehicle","Schienenfahrzeug"
"64580","VESSEL","","Vessel","Schiff"
"64581","SEA_VESSEL","VESSEL","Sea vessel","Seeschiff"
"64582","INLAND_VESSEL","VESSEL","Inland vessel","Binnenschiff"
