Vorgang gestartet
Berechne Variable Other Sector, Ereignis #17036 (1/33)
Berechne Variable Other Sector, Ereignis #17037 (2/33)
Berechne Variable Other Sector, Ereignis #18981 (3/33)
Berechne Variable not assignable otherwise, Ereignis #27203 (4/33)
Berechne Variable not assignable otherwise, Ereignis #27204 (5/33)
Berechne Variable not assignable otherwise, Ereignis #27205 (6/33)
Berechne Variable not assignable otherwise, Ereignis #27206 (7/33)
Berechne Variable not assignable otherwise, Ereignis #27207 (8/33)
Berechne Variable not assignable otherwise, Ereignis #27208 (9/33)
Berechne Variable not assignable otherwise, Ereignis #27209 (10/33)
Berechne Variable not assignable otherwise, Ereignis #27210 (11/33)
Berechne Variable not assignable otherwise, Ereignis #27211 (12/33)
Berechne Variable not assignable otherwise, Ereignis #27212 (13/33)
Berechne Variable not assignable otherwise, Ereignis #27213 (14/33)
Berechne Variable not assignable otherwise, Ereignis #27214 (15/33)
Berechne Variable not assignable otherwise, Ereignis #27215 (16/33)
Berechne Variable not assignable otherwise, Ereignis #27216 (17/33)
Berechne Variable not assignable otherwise, Ereignis #27217 (18/33)
Berechne Variable not assignable otherwise, Ereignis #27218 (19/33)
Berechne Variable not assignable otherwise, Ereignis #27219 (20/33)
Berechne Variable not assignable otherwise, Ereignis #27220 (21/33)
Berechne Variable not assignable otherwise, Ereignis #27221 (22/33)
Berechne Variable not assignable otherwise, Ereignis #27222 (23/33)
Berechne Variable not assignable otherwise, Ereignis #27223 (24/33)
Berechne Variable not assignable otherwise, Ereignis #27224 (25/33)
Berechne Variable not assignable otherwise, Ereignis #27225 (26/33)
Berechne Variable not assignable otherwise, Ereignis #27226 (27/33)
Berechne Variable not assignable otherwise, Ereignis #27227 (28/33)
Berechne Variable not assignable otherwise, Ereignis #27228 (29/33)
Berechne Variable not assignable otherwise, Ereignis #27229 (30/33)
Berechne Variable not assignable otherwise, Ereignis #27230 (31/33)
Berechne Variable not assignable otherwise, Ereignis #27231 (32/33)
Berechne Variable Other Sector, Ereignis #29279 (33/33)
Datei 'C:\Program Files\Housesoft\ZSEnext\tables\data\crf_exporter\reporter_import_files\Submission 2024\import files\6 Other\6.xml' wurde geschrieben (1089 Werte).
Vorgang beendet (00:00:32.6859166)
