Vorgang gestartet
Berechne Variable Other LULUCF, Ereignis #26012 (1/19)
Berechne Variable Other LULUCF, Ereignis #26015 (2/19)
Berechne Variable Other LULUCF, Ereignis #26050 (3/19)
Berechne Variable Other LULUCF.Other, Ereignis #26064 (4/19)
Berechne Variable Other LULUCF.Other, Ereignis #26073 (5/19)
Berechne Variable Other LULUCF.Other, Ereignis #26077 (6/19)
Berechne Variable Other LULUCF.Other, Ereignis #26087 (7/19)
Berechne Variable Other LULUCF.Other, Ereignis #26091 (8/19)
Berechne Variable Other LULUCF.Other, Ereignis #26096 (9/19)
Berechne Variable Other LULUCF.Other, Ereignis #26097 (10/19)
Berechne Variable Other LULUCF.Other, Ereignis #26104 (11/19)
Berechne Variable Other LULUCF.Other, Ereignis #26109 (12/19)
Berechne Variable Other LULUCF.Other, Ereignis #26117 (13/19)
Berechne Variable Other LULUCF.Other, Ereignis #26118 (14/19)
Berechne Variable Other LULUCF.Other, Ereignis #26120 (15/19)
Berechne Variable Other LULUCF.Other, Ereignis #26123 (16/19)
Berechne Variable Other LULUCF.Other, Ereignis #26128 (17/19)
Berechne Variable Other LULUCF.Other, Ereignis #26151 (18/19)
Berechne Variable Other LULUCF.Other, Ereignis #26161 (19/19)
Datei 'C:\Program Files\Housesoft\Zentrales System Emissionen\tables\data\crf_exporter\reporter_import_files\Submission 2024\import files\4 LULUCF\4H.xml' wurde geschrieben (627 Werte).
Vorgang beendet (00:00:00.9448088)
