{
    "version": {
      "metadata_ver": "1.27.4",
      "country": "DEU",
      "metadata_type": "CRT"
    },
    "country_specific_data": {
      "variables": [],
      "nodes": [
        {"uid": "2EAE5AA4-BE1C-4E41-995B-5F3FF954AD8D"},
        {"uid": "8C501FE7-1D12-4DAD-AAF1-9422BD161AAD"},
        {"uid": "A41EB2E3-E2CF-448D-B3B7-FA2104BB03DE"},
        {"uid": "69724A46-444A-46F0-8BDC-94D4D9280B13"},
        
        {"uid": "44B4A15A-2545-4A86-8AE0-6108A245AACF"},
        {"uid": "FA7B8295-1593-42C0-9707-9AB9C67BAAA5"},
        {"uid": "DC2AC4AC-88F5-4D18-BC69-88F918CFB97C"},
        {"uid": "320C35DA-936A-44DB-A96F-192A211F139D"},

        {"uid": "26BD732D-055E-4FCE-9FC3-DCEAB4D658E5"},
        {"uid": "321F82C3-C3B4-4A44-A45B-CCDF611F9E73"},
        {"uid": "5F4E0AF6-7DEE-4C6F-9261-4B54DD0F7AE3"},
        {"uid": "C3D83479-2009-4F53-9F72-900438694D2A"},
        
        {"uid": "5B22AB8B-73BB-4C1D-88F9-7729168044F0"},
        {"uid": "DA525380-573A-45CA-B226-A569F2FDB08F"},
        {"uid": "D786F6E5-30EB-4BD2-88BA-BC2BB843DD94"},
        {"uid": "8F1D9A89-1BF2-4F3F-9533-47C2EC9E69AB"}
      ],
      "grids": [],
      "drop_downs": [],
      "line_description": [],
      "dimension_instances": []    
    },
    "data": {
      "values": []
    }
  }