Vorgang gestartet
Berechne Variable Digestate renewable raw material (atmospheric deposition), Ereignis #18525 (1/33)
Berechne Variable Digestate renewable raw material (atmospheric deposition), Ereignis #18526 (2/33)
Berechne Variable Digestate renewable raw material (atmospheric deposition), Ereignis #18530 (3/33)
Berechne Variable Digestate renewable raw material (atmospheric deposition), Ereignis #18531 (4/33)
Berechne Variable Digestate renewable raw material (atmospheric deposition), Ereignis #18532 (5/33)
Berechne Variable Digestate renewable raw material (atmospheric deposition), Ereignis #18533 (6/33)
Berechne Variable Digestate renewable raw material (atmospheric deposition), Ereignis #18534 (7/33)
Berechne Variable Digestate renewable raw material (atmospheric deposition), Ereignis #18535 (8/33)
Berechne Variable Digestate renewable raw material (atmospheric deposition), Ereignis #18537 (9/33)
Berechne Variable Digestate renewable raw material (atmospheric deposition), Ereignis #18538 (10/33)
Berechne Variable Digestate renewable raw material (atmospheric deposition), Ereignis #18539 (11/33)
Berechne Variable Digestate renewable raw material (storage of dry matter), Ereignis #18540 (12/33)
Berechne Variable Digestate renewable raw material (storage of dry matter), Ereignis #18541 (13/33)
Berechne Variable Digestate renewable raw material (storage of dry matter), Ereignis #18545 (14/33)
Berechne Variable Digestate renewable raw material (storage of dry matter), Ereignis #18546 (15/33)
Berechne Variable Digestate renewable raw material (storage of dry matter), Ereignis #18547 (16/33)
Berechne Variable Digestate renewable raw material (storage of dry matter), Ereignis #18548 (17/33)
Berechne Variable Digestate renewable raw material (storage of dry matter), Ereignis #18549 (18/33)
Berechne Variable Digestate renewable raw material (storage of dry matter), Ereignis #18550 (19/33)
Berechne Variable Digestate renewable raw material (storage of dry matter), Ereignis #18552 (20/33)
Berechne Variable Digestate renewable raw material (storage of dry matter), Ereignis #18553 (21/33)
Berechne Variable Digestate renewable raw material (storage of dry matter), Ereignis #18554 (22/33)
Berechne Variable Digestate renewable raw material (storage of N), Ereignis #18555 (23/33)
Berechne Variable Digestate renewable raw material (storage of N), Ereignis #18556 (24/33)
Berechne Variable Digestate renewable raw material (storage of N), Ereignis #18560 (25/33)
Berechne Variable Digestate renewable raw material (storage of N), Ereignis #18561 (26/33)
Berechne Variable Digestate renewable raw material (storage of N), Ereignis #18562 (27/33)
Berechne Variable Digestate renewable raw material (storage of N), Ereignis #18563 (28/33)
Berechne Variable Digestate renewable raw material (storage of N), Ereignis #18564 (29/33)
Berechne Variable Digestate renewable raw material (storage of N), Ereignis #18565 (30/33)
Berechne Variable Digestate renewable raw material (storage of N), Ereignis #18567 (31/33)
Berechne Variable Digestate renewable raw material (storage of N), Ereignis #18568 (32/33)
Berechne Variable Digestate renewable raw material (storage of N), Ereignis #18569 (33/33)
Datei '\\tsclient\c\Program Files\Housesoft\Zentrales System Emissionen\tables\data\crf_exporter\reporter_import_files\Submission 2024\import files\3 Agriculture\3J.xml' wurde geschrieben (1089 Werte).
Vorgang beendet (00:01:13.6184722)
