1A1,1A1,1
1A1a,1A1a,1
1A1b,1A1b,1
1A1c,1A1c,1
1A2,1A2,1
1A2a,1A2a,1
1A2b,1A2b,1
1A2e,1A2e,1
1A2f,1A2f,1
1A2gviii,1A2gviii,1
1A3a,1A3a,1
1A3ai(i),1A3ai(i),1
1A3aii(i),1A3aii(i),1
1A3b,1A3b,1
1A3bi,1A3bi,1
1A3biv,1A3biv,1
1A3bv,1A3bv,1
1A3bvi,1A3bvi,1
1A3c,1A3c,1
1A3di(ii),1A3di(ii),1
1A3dii,1A3dii,1
1A3ei,1A3ei,1
1A4,1A4,1
1A4ai,1A4ai,1
1A4aii,1A4aii,1
1A4bi,1A4bi,1
1A4bii,1A4bii,1
1A4ci,1A4ci,1
1A4cii,1A4cii,1
1A4ciii,1A4ciii,1
1A5,1A5,1
1A5a,1A5a,1
1A5b,1A5b,1
1B1,1B1,1
1B1a,1B1a,1
1B1b,1B1b,1
1B2aiv,1B2aiv,1
1B2d,1B2d,1
2,2_INDUSTRY,1
2A1,2A1,1
2A2,2A2,1
2A3,2A3,1
2B3,2B3,1
2B6,2B6,1
2B10a,2B10a,1
2C,2C,1
2C1,2C1,1
2C3,2C3,1
2C4,2C4,1
2C7a,2C7a,1
2D3,2D3,1
2D3a,2D3a,1
2D3c,2D3c,1
2D3d,2D3d,1
2D3g,2D3g,1
2G,2G,1
2H1,2H1,1
2J,2J,1
2K,2K,1
2L,2L,1
3B,3B,1
3B2,3B2,1
3D,3D,1
3Da1,3Da1,1
3Da2a,3Da2a,1
3Da2b,3Da2b,1
3Dc,3Dc,1
3F,3F,1
3I,3I,1
5,5_WASTE,1
5A,5A,1
5B,5B,1
5C,5C,1
5C2,5C2,1
5D,5D,1
5D1,#256,1
5D2,#228,1
5E,5E,1
6,6_OTHER,1
LPS,LPS,1
GRID,GRID,1
