REGION;CATEGORY;TYPE;SUBSTANCE;UNIT;2022
IT;11A;EM;As;t;NA
IT;11A;EM;BC;kt;NA
IT;11A;EM;BaP;t;NA
IT;11A;EM;BbF;t;NA
IT;11A;EM;BkF;t;NA
IT;11A;EM;CO;kt;NA
IT;11A;EM;Cd;t;NA
IT;11A;EM;Cr;t;NA
IT;11A;EM;Cu;t;NA
IT;11A;EM;HCB;t;NA
IT;11A;EM;Hg;t;NA
IT;11A;EM;IxP;t;NA
IT;11A;EM;NH3;kt;NA
IT;11A;EM;NMVOC;kt;NA
IT;11A;EM;NOx;kt;NA
IT;11A;EM;Ni;t;NA
IT;11A;EM;PAH4;t;NA
IT;11A;EM;PCB;t;NA
IT;11A;EM;PCDD/F;t;NA
IT;11A;EM;PM10;kt;NA
IT;11A;EM;PM2.5;kt;NA
IT;11A;EM;Pb;t;NA
IT;11A;EM;SO2;kt;943,444
IT;11A;EM;Se;t;NA
IT;11A;EM;TSP;kt;NA
IT;11A;EM;Zn;t;NA
IT;11B;EM;As;t;NA
IT;11B;EM;BC;kt;1,3090125391221128
IT;11B;EM;BaP;t;NE
IT;11B;EM;BbF;t;NE
IT;11B;EM;BkF;t;NE
IT;11B;EM;CO;kt;172,91894035316798
IT;11B;EM;Cd;t;NA
IT;11B;EM;Cr;t;NA
IT;11B;EM;Cu;t;NA
IT;11B;EM;HCB;t;NA
IT;11B;EM;Hg;t;NA
IT;11B;EM;IxP;t;NE
IT;11B;EM;NH3;kt;1,244751923565209
IT;11B;EM;NMVOC;kt;14,522105774927438
IT;11B;EM;NOx;kt;4,848194589341158
IT;11B;EM;Ni;t;NA
IT;11B;EM;PAH4;t;23,836956730927362
IT;11B;EM;PCB;t;NA
IT;11B;EM;PCDD/F;t;16,160648631137192
IT;11B;EM;PM10;kt;17,776713494250913
IT;11B;EM;PM2.5;kt;14,544583768023474
IT;11B;EM;Pb;t;NA
IT;11B;EM;SO2;kt;1,1064461542801858
IT;11B;EM;Se;t;NA
IT;11B;EM;TSP;kt;19,75190388250102
IT;11B;EM;Zn;t;NA
IT;11C;EM;As;t;NA
IT;11C;EM;BC;kt;4,180226419254731
IT;11C;EM;BaP;t;NE
IT;11C;EM;BbF;t;NE
IT;11C;EM;BkF;t;NE
IT;11C;EM;CO;kt;118,32916054504135
IT;11C;EM;Cd;t;NA
IT;11C;EM;Cr;t;NA
IT;11C;EM;Cu;t;NA
IT;11C;EM;HCB;t;NA
IT;11C;EM;Hg;t;NA
IT;11C;EM;IxP;t;NE
IT;11C;EM;NH3;kt;0,9355744843093923
IT;11C;EM;NMVOC;kt;1470,6084356502708
IT;11C;EM;NOx;kt;3,3176400152815333
IT;11C;EM;Ni;t;NA
IT;11C;EM;PAH4;t;16,311730075134207
IT;11C;EM;PCB;t;NA
IT;11C;EM;PCDD/F;t;11,058800050938444
IT;11C;EM;PM10;kt;12,164680056032289
IT;11C;EM;PM2.5;kt;9,9529200458446
IT;11C;EM;Pb;t;NA
IT;11C;EM;SO2;kt;0,831621763830571
IT;11C;EM;Se;t;NA
IT;11C;EM;TSP;kt;13,516311173369207
IT;11C;EM;Zn;t;NA
IT;1A1a;EM;As;t;1,9907903205085162
IT;1A1a;EM;BC;kt;0,009637168524731602
IT;1A1a;EM;BaP;t;NE
IT;1A1a;EM;BbF;t;NE
IT;1A1a;EM;BkF;t;NE
IT;1A1a;EM;CO;kt;20,705760595862124
IT;1A1a;EM;Cd;t;0,06128469691141371
IT;1A1a;EM;Cr;t;6,481421900107758
IT;1A1a;EM;Cu;t;2,646202404723366
IT;1A1a;EM;HCB;t;0,6350609955011565
IT;1A1a;EM;Hg;t;0,4649815193013439
IT;1A1a;EM;IxP;t;NE
IT;1A1a;EM;NH3;kt;0,10531763310048
IT;1A1a;EM;NMVOC;kt;2,6160353780333723
IT;1A1a;EM;NOx;kt;27,200169580123198
IT;1A1a;EM;Ni;t;4,458915131061177
IT;1A1a;EM;PAH4;t;0,3581823413076425
IT;1A1a;EM;PCB;t;0,32021499719426216
IT;1A1a;EM;PCDD/F;t;2,3591895207986155
IT;1A1a;EM;PM10;kt;0,4650840606944179
IT;1A1a;EM;PM2.5;kt;0,31013518456999467
IT;1A1a;EM;Pb;t;1,5821131861309485
IT;1A1a;EM;SO2;kt;6,927490813986942
IT;1A1a;EM;Se;t;1,898043870080691
IT;1A1a;EM;TSP;kt;0,48956216915201883
IT;1A1a;EM;Zn;t;2,2478053806760014
IT;1A1b;EM;As;t;0,08707169659693122
IT;1A1b;EM;BC;kt;0,0047269532760848285
IT;1A1b;EM;BaP;t;NE
IT;1A1b;EM;BbF;t;NE
IT;1A1b;EM;BkF;t;NE
IT;1A1b;EM;CO;kt;3,1050264852634792
IT;1A1b;EM;Cd;t;0,016141480194810678
IT;1A1b;EM;Cr;t;0,7141541112542059
IT;1A1b;EM;Cu;t;0,598564355556605
IT;1A1b;EM;HCB;t;NA
IT;1A1b;EM;Hg;t;0,09399393072541665
IT;1A1b;EM;IxP;t;NE
IT;1A1b;EM;NH3;kt;0,05517595740238145
IT;1A1b;EM;NMVOC;kt;0,6949214180529436
IT;1A1b;EM;NOx;kt;9,004609646304141
IT;1A1b;EM;Ni;t;3,080986736932638
IT;1A1b;EM;PAH4;t;0,03742056314976479
IT;1A1b;EM;PCB;t;NA
IT;1A1b;EM;PCDD/F;t;2,80337180711271
IT;1A1b;EM;PM10;kt;0,15048179129292066
IT;1A1b;EM;PM2.5;kt;0,11977434918380397
IT;1A1b;EM;Pb;t;0,28741272381034105
IT;1A1b;EM;SO2;kt;5,437640310464239
IT;1A1b;EM;Se;t;0,15424479688178355
IT;1A1b;EM;TSP;kt;0,18810223911615082
IT;1A1b;EM;Zn;t;0,35853754095779244
IT;1A1c;EM;As;t;0,005418990717441028
IT;1A1c;EM;BC;kt;0,0036222177613567416
IT;1A1c;EM;BaP;t;NE
IT;1A1c;EM;BbF;t;NE
IT;1A1c;EM;BkF;t;NE
IT;1A1c;EM;CO;kt;6,748999753585636
IT;1A1c;EM;Cd;t;0,0010160607595201925
IT;1A1c;EM;Cr;t;0,16455796810801845
IT;1A1c;EM;Cu;t;0,0775593046433747
IT;1A1c;EM;HCB;t;NA
IT;1A1c;EM;Hg;t;0,010499294515041991
IT;1A1c;EM;IxP;t;NE
IT;1A1c;EM;NH3;kt;0,00012985205873322064
IT;1A1c;EM;NMVOC;kt;0,28739026248760013
IT;1A1c;EM;NOx;kt;2,105689
IT;1A1c;EM;Ni;t;0,0907680945171372
IT;1A1c;EM;PAH4;t;0,016462191999999994
IT;1A1c;EM;PCB;t;NA
IT;1A1c;EM;PCDD/F;t;NO
IT;1A1c;EM;PM10;kt;0,01585091191794117
IT;1A1c;EM;PM2.5;kt;0,010882009258350126
IT;1A1c;EM;Pb;t;0,020321215190403853
IT;1A1c;EM;SO2;kt;1,294277860851269
IT;1A1c;EM;Se;t;0,035223439663366676
IT;1A1c;EM;TSP;kt;0,019813639897426464
IT;1A1c;EM;Zn;t;NA
IT;1A2a;EM;As;t;0,32166013868451077
IT;1A2a;EM;BC;kt;0,0005231259337246119
IT;1A2a;EM;BaP;t;NE
IT;1A2a;EM;BbF;t;NE
IT;1A2a;EM;BkF;t;NE
IT;1A2a;EM;CO;kt;61,67568016073599
IT;1A2a;EM;Cd;t;0,42887661531497945
IT;1A2a;EM;Cr;t;3,0491880988663156
IT;1A2a;EM;Cu;t;1,4146250777345248
IT;1A2a;EM;HCB;t;0,1292702451906432
IT;1A2a;EM;Hg;t;0,41086696334694234
IT;1A2a;EM;IxP;t;NE
IT;1A2a;EM;NH3;kt;0,01339
IT;1A2a;EM;NMVOC;kt;0,5888372824450032
IT;1A2a;EM;NOx;kt;8,782997134039999
IT;1A2a;EM;Ni;t;0,9507239877016993
IT;1A2a;EM;PAH4;t;0,1000824
IT;1A2a;EM;PCB;t;5,575758091112782
IT;1A2a;EM;PCDD/F;t;0,89
IT;1A2a;EM;PM10;kt;0,1854641688338842
IT;1A2a;EM;PM2.5;kt;0,14433611295652765
IT;1A2a;EM;Pb;t;4,18707293064963
IT;1A2a;EM;SO2;kt;3,1271179742273256
IT;1A2a;EM;Se;t;0,12638733177054487
IT;1A2a;EM;TSP;kt;0,2634103570224234
IT;1A2a;EM;Zn;t;4,070030947129328
IT;1A2b;EM;As;t;1,712528526355706
IT;1A2b;EM;BC;kt;0,031030639471308786
IT;1A2b;EM;BaP;t;NE
IT;1A2b;EM;BbF;t;NE
IT;1A2b;EM;BkF;t;NE
IT;1A2b;EM;CO;kt;6,673166777727392
IT;1A2b;EM;Cd;t;0,15266835085371216
IT;1A2b;EM;Cr;t;0,6951481833546177
IT;1A2b;EM;Cu;t;1,1253674352408405
IT;1A2b;EM;HCB;t;6,0962000000000005
IT;1A2b;EM;Hg;t;0,08968143531633617
IT;1A2b;EM;IxP;t;NE
IT;1A2b;EM;NH3;kt;NO
IT;1A2b;EM;NMVOC;kt;3,5817757604562868
IT;1A2b;EM;NOx;kt;0,7203935165525212
IT;1A2b;EM;Ni;t;0,3258764469793716
IT;1A2b;EM;PAH4;t;0,1361426
IT;1A2b;EM;PCB;t;5,3790000000000004
IT;1A2b;EM;PCDD/F;t;53,34526477809254
IT;1A2b;EM;PM10;kt;0,6369369663546457
IT;1A2b;EM;PM2.5;kt;0,46487458006559257
IT;1A2b;EM;Pb;t;5,720414914801612
IT;1A2b;EM;SO2;kt;1,2544867947005565
IT;1A2b;EM;Se;t;NA
IT;1A2b;EM;TSP;kt;0,9099099519352083
IT;1A2b;EM;Zn;t;9,804087033156197
IT;1A2c;EM;As;t;0,07619647120800212
IT;1A2c;EM;BC;kt;0,02002909813980127
IT;1A2c;EM;BaP;t;NE
IT;1A2c;EM;BbF;t;NE
IT;1A2c;EM;BkF;t;NE
IT;1A2c;EM;CO;kt;2,10497103838095
IT;1A2c;EM;Cd;t;0,014140710770259649
IT;1A2c;EM;Cr;t;0,7849907314525847
IT;1A2c;EM;Cu;t;0,5775080564282723
IT;1A2c;EM;HCB;t;NA
IT;1A2c;EM;Hg;t;0,08844899256300212
IT;1A2c;EM;IxP;t;NE
IT;1A2c;EM;NH3;kt;NA
IT;1A2c;EM;NMVOC;kt;0,457106235640603
IT;1A2c;EM;NOx;kt;3,016788221157144
IT;1A2c;EM;Ni;t;2,5616290973276334
IT;1A2c;EM;PAH4;t;0,029643770505725493
IT;1A2c;EM;PCB;t;NA
IT;1A2c;EM;PCDD/F;t;1,9703178114515292
IT;1A2c;EM;PM10;kt;0,66019965781435
IT;1A2c;EM;PM2.5;kt;0,5559135964368401
IT;1A2c;EM;Pb;t;0,2547577198069699
IT;1A2c;EM;SO2;kt;0,2999266706880784
IT;1A2c;EM;Se;t;0,1691203015226695
IT;1A2c;EM;TSP;kt;0,6949470082256315
IT;1A2c;EM;Zn;t;0,28402577853526395
IT;1A2d;EM;As;t;NA
IT;1A2d;EM;BC;kt;0,008312849999999998
IT;1A2d;EM;BaP;t;NA
IT;1A2d;EM;BbF;t;NA
IT;1A2d;EM;BkF;t;NA
IT;1A2d;EM;CO;kt;0,0004348
IT;1A2d;EM;Cd;t;NA
IT;1A2d;EM;Cr;t;NA
IT;1A2d;EM;Cu;t;NA
IT;1A2d;EM;HCB;t;NA
IT;1A2d;EM;Hg;t;NA
IT;1A2d;EM;IxP;t;NA
IT;1A2d;EM;NH3;kt;0,28262
IT;1A2d;EM;NMVOC;kt;4,3480000000000004e-05
IT;1A2d;EM;NOx;kt;4,00016
IT;1A2d;EM;Ni;t;NA
IT;1A2d;EM;PAH4;t;NA
IT;1A2d;EM;PCB;t;NA
IT;1A2d;EM;PCDD/F;t;NA
IT;1A2d;EM;PM10;kt;0,4263
IT;1A2d;EM;PM2.5;kt;0,31972500000000004
IT;1A2d;EM;Pb;t;NA
IT;1A2d;EM;SO2;kt;0,04381636871569164
IT;1A2d;EM;Se;t;NA
IT;1A2d;EM;TSP;kt;0,609
IT;1A2d;EM;Zn;t;NA
IT;1A2e;EM;As;t;0,010734046813957369
IT;1A2e;EM;BC;kt;0,0008576360075187119
IT;1A2e;EM;BaP;t;NE
IT;1A2e;EM;BbF;t;NE
IT;1A2e;EM;BkF;t;NE
IT;1A2e;EM;CO;kt;1,3968358284061597
IT;1A2e;EM;Cd;t;0,0020123278976958083
IT;1A2e;EM;Cr;t;0,3227594942326904
IT;1A2e;EM;Cu;t;0,15255710062144
IT;1A2e;EM;HCB;t;0,3054551475947033
IT;1A2e;EM;Hg;t;0,020673334333957363
IT;1A2e;EM;IxP;t;NE
IT;1A2e;EM;NH3;kt;0,00036960000000000026
IT;1A2e;EM;NMVOC;kt;0,9656381891833997
IT;1A2e;EM;NOx;kt;1,7174992273194292
IT;1A2e;EM;Ni;t;0,18248580392064012
IT;1A2e;EM;PAH4;t;0,19486607186879717
IT;1A2e;EM;PCB;t;0,18650327674263595
IT;1A2e;EM;PCDD/F;t;0,5151140804331227
IT;1A2e;EM;PM10;kt;0,0309631019632088
IT;1A2e;EM;PM2.5;kt;0,02829432978979086
IT;1A2e;EM;Pb;t;0,04018782900904623
IT;1A2e;EM;SO2;kt;0,030421003913922693
IT;1A2e;EM;Se;t;0,06908858030660982
IT;1A2e;EM;TSP;kt;0,032592738908640846
IT;1A2e;EM;Zn;t;0,0005945337767093101
IT;1A2f;EM;As;t;0,9920011550000002
IT;1A2f;EM;BC;kt;0,19378326134962834
IT;1A2f;EM;BaP;t;NE
IT;1A2f;EM;BbF;t;NE
IT;1A2f;EM;BkF;t;NE
IT;1A2f;EM;CO;kt;20,411534898636248
IT;1A2f;EM;Cd;t;0,5800109
IT;1A2f;EM;Cr;t;4,443765860000003
IT;1A2f;EM;Cu;t;3,8322133750000003
IT;1A2f;EM;HCB;t;0,20676193999999998
IT;1A2f;EM;Hg;t;0,5665923494234895
IT;1A2f;EM;IxP;t;NE
IT;1A2f;EM;NH3;kt;1,03003348390378
IT;1A2f;EM;NMVOC;kt;1,0353470190932665
IT;1A2f;EM;NOx;kt;35,21412415700347
IT;1A2f;EM;Ni;t;5,4290325341666685
IT;1A2f;EM;PAH4;t;0,013104
IT;1A2f;EM;PCB;t;NA
IT;1A2f;EM;PCDD/F;t;0,939827
IT;1A2f;EM;PM10;kt;5,157203873951272
IT;1A2f;EM;PM2.5;kt;4,5082404571382995
IT;1A2f;EM;Pb;t;67,49078658000002
IT;1A2f;EM;SO2;kt;23,263212745713066
IT;1A2f;EM;Se;t;1,9536997675000003
IT;1A2f;EM;TSP;kt;7,367155262580875
IT;1A2f;EM;Zn;t;18,281430803333336
IT;1A2gvii ;EM;As;t;NA
IT;1A2gvii ;EM;BC;kt;0,028964815960419017
IT;1A2gvii ;EM;BaP;t;0,01225484024505589
IT;1A2gvii ;EM;BbF;t;0,02042473374175982
IT;1A2gvii ;EM;BkF;t;NE
IT;1A2gvii ;EM;CO;kt;6,899810782860412
IT;1A2gvii ;EM;Cd;t;0,0007564194496086203
IT;1A2gvii ;EM;Cr;t;0,002222386454263639
IT;1A2gvii ;EM;Cu;t;0,05901057728576158
IT;1A2gvii ;EM;HCB;t;NA
IT;1A2gvii ;EM;Hg;t;NA
IT;1A2gvii ;EM;IxP;t;NE
IT;1A2gvii ;EM;NH3;kt;0,0029988974413287127
IT;1A2gvii ;EM;NMVOC;kt;0,8092891298667435
IT;1A2gvii ;EM;NOx;kt;3,564213778036525
IT;1A2gvii ;EM;Ni;t;0,004084946748351963
IT;1A2gvii ;EM;PAH4;t;0,0326795739868157
IT;1A2gvii ;EM;PCB;t;NA
IT;1A2gvii ;EM;PCDD/F;t;NA
IT;1A2gvii ;EM;PM10;kt;0,04671744509745003
IT;1A2gvii ;EM;PM2.5;kt;0,04671744509745003
IT;1A2gvii ;EM;Pb;t;NA
IT;1A2gvii ;EM;SO2;kt;0,0058006243826597866
IT;1A2gvii ;EM;Se;t;0,008169893496703926
IT;1A2gvii ;EM;TSP;kt;0,04767086234433677
IT;1A2gvii ;EM;Zn;t;0,012973696965944023
IT;1A2gviii;EM;As;t;0,09388922103703967
IT;1A2gviii;EM;BC;kt;0,011882900983718669
IT;1A2gviii;EM;BaP;t;NE
IT;1A2gviii;EM;BbF;t;NE
IT;1A2gviii;EM;BkF;t;NE
IT;1A2gviii;EM;CO;kt;1,7554839107027795
IT;1A2gviii;EM;Cd;t;0,007586270510112154
IT;1A2gviii;EM;Cr;t;0,720937275088151
IT;1A2gviii;EM;Cu;t;0,3815329295245373
IT;1A2gviii;EM;HCB;t;0,0035760256993532698
IT;1A2gviii;EM;Hg;t;0,05777625086830557
IT;1A2gviii;EM;IxP;t;NE
IT;1A2gviii;EM;NH3;kt;0,0035090869682935007
IT;1A2gviii;EM;NMVOC;kt;0,45363810928653675
IT;1A2gviii;EM;NOx;kt;1,8448629934187795
IT;1A2gviii;EM;Ni;t;0,9881419322855267
IT;1A2gviii;EM;PAH4;t;0,025301113898394716
IT;1A2gviii;EM;PCB;t;2,3159973990737106e-05
IT;1A2gviii;EM;PCDD/F;t;0,846192880412921
IT;1A2gviii;EM;PM10;kt;0,4221842867826952
IT;1A2gviii;EM;PM2.5;kt;0,2717179071610591
IT;1A2gviii;EM;Pb;t;0,1557157318670973
IT;1A2gviii;EM;SO2;kt;0,40122467684400276
IT;1A2gviii;EM;Se;t;0,17094022376275247
IT;1A2gviii;EM;TSP;kt;0,4444045124028371
IT;1A2gviii;EM;Zn;t;0,14691527003391416
IT;1A3ai(i);EM;As;t;NA
IT;1A3ai(i);EM;BC;kt;0,015642229502160012
IT;1A3ai(i);EM;BaP;t;NE
IT;1A3ai(i);EM;BbF;t;NE
IT;1A3ai(i);EM;BkF;t;NE
IT;1A3ai(i);EM;CO;kt;2,7255950110250002
IT;1A3ai(i);EM;Cd;t;0,00018464948199276856
IT;1A3ai(i);EM;Cr;t;0,00016872937156819437
IT;1A3ai(i);EM;Cu;t;0,00230482086879973
IT;1A3ai(i);EM;HCB;t;NA
IT;1A3ai(i);EM;Hg;t;NA
IT;1A3ai(i);EM;IxP;t;NE
IT;1A3ai(i);EM;NH3;kt;NE
IT;1A3ai(i);EM;NMVOC;kt;0,36021613691544957
IT;1A3ai(i);EM;NOx;kt;4,317242123130998
IT;1A3ai(i);EM;Ni;t;0,0005540174859783055
IT;1A3ai(i);EM;PAH4;t;0,0003635749329154497
IT;1A3ai(i);EM;PCB;t;NA
IT;1A3ai(i);EM;PCDD/F;t;NA
IT;1A3ai(i);EM;PM10;kt;0,03258820121500003
IT;1A3ai(i);EM;PM2.5;kt;0,03258820121500003
IT;1A3ai(i);EM;Pb;t;0,591413933487236
IT;1A3ai(i);EM;SO2;kt;0,3007808950857973
IT;1A3ai(i);EM;Se;t;0,005538983919783056
IT;1A3ai(i);EM;TSP;kt;0,0332532665459184
IT;1A3ai(i);EM;Zn;t;0,011055657130707051
IT;1A3ai(ii);EM;As;t;NA
IT;1A3ai(ii);EM;BC;kt;0,3320881818126481
IT;1A3ai(ii);EM;BaP;t;NE
IT;1A3ai(ii);EM;BbF;t;NE
IT;1A3ai(ii);EM;BkF;t;NE
IT;1A3ai(ii);EM;CO;kt;6,4672557821930035
IT;1A3ai(ii);EM;Cd;t;0,0018831451588246803
IT;1A3ai(ii);EM;Cr;t;0,0017199942533544595
IT;1A3ai(ii);EM;Cu;t;0,023475234563234443
IT;1A3ai(ii);EM;HCB;t;NA
IT;1A3ai(ii);EM;Hg;t;NA
IT;1A3ai(ii);EM;IxP;t;NE
IT;1A3ai(ii);EM;NH3;kt;NA
IT;1A3ai(ii);EM;NMVOC;kt;0,6918176861788502
IT;1A3ai(ii);EM;NOx;kt;34,50884932636101
IT;1A3ai(ii);EM;Ni;t;0,005649366436474041
IT;1A3ai(ii);EM;PAH4;t;0,0006884588901788502
IT;1A3ai(ii);EM;PCB;t;NA
IT;1A3ai(ii);EM;PCDD/F;t;NA
IT;1A3ai(ii);EM;PM10;kt;0,6918501556908502
IT;1A3ai(ii);EM;PM2.5;kt;0,6918501556908502
IT;1A3ai(ii);EM;Pb;t;6,032145859979217
IT;1A3ai(ii);EM;SO2;kt;2,448005741156008
IT;1A3ai(ii);EM;Se;t;0,0564948553047404
IT;1A3ai(ii);EM;TSP;kt;0,7059695466233166
IT;1A3ai(ii);EM;Zn;t;0,11274320801503362
IT;1A3aii(i);EM;As;t;NA
IT;1A3aii(i);EM;BC;kt;0,007779629261280002
IT;1A3aii(i);EM;BaP;t;NE
IT;1A3aii(i);EM;BbF;t;NE
IT;1A3aii(i);EM;BkF;t;NE
IT;1A3aii(i);EM;CO;kt;1,7306293214389998
IT;1A3aii(i);EM;Cd;t;9,650958387484337e-05
IT;1A3aii(i);EM;Cr;t;8,815185391128173e-05
IT;1A3aii(i);EM;Cu;t;0,0012032251041295078
IT;1A3aii(i);EM;HCB;t;NA
IT;1A3aii(i);EM;Hg;t;NA
IT;1A3aii(i);EM;IxP;t;NE
IT;1A3aii(i);EM;NH3;kt;NE
IT;1A3aii(i);EM;NMVOC;kt;0,24710399457170001
IT;1A3aii(i);EM;NOx;kt;2,36276003542
IT;1A3aii(i);EM;Ni;t;0,0002895287516245301
IT;1A3aii(i);EM;PAH4;t;0,0002471039945717
IT;1A3aii(i);EM;PCB;t;NA
IT;1A3aii(i);EM;PCDD/F;t;NA
IT;1A3aii(i);EM;PM10;kt;0,016207560961
IT;1A3aii(i);EM;PM2.5;kt;0,016207560961
IT;1A3aii(i);EM;Pb;t;0,3091394990678983
IT;1A3aii(i);EM;SO2;kt;0,17639763385439802
IT;1A3aii(i);EM;Se;t;0,0028952875162453
IT;1A3aii(i);EM;TSP;kt;0,016538327511224492
IT;1A3aii(i);EM;Zn;t;0,005778028786586871
IT;1A3aii(ii);EM;As;t;NA
IT;1A3aii(ii);EM;BC;kt;0,041951093888880006
IT;1A3aii(ii);EM;BaP;t;NE
IT;1A3aii(ii);EM;BbF;t;NE
IT;1A3aii(ii);EM;BkF;t;NE
IT;1A3aii(ii);EM;CO;kt;2,8285346812960004
IT;1A3aii(ii);EM;Cd;t;0,00029727664183673715
IT;1A3aii(ii);EM;Cr;t;0,0002716030193696751
IT;1A3aii(ii);EM;Cu;t;0,0037089904931016135
IT;1A3aii(ii);EM;HCB;t;NA
IT;1A3aii(ii);EM;Hg;t;NA
IT;1A3aii(ii);EM;IxP;t;NE
IT;1A3aii(ii);EM;NH3;kt;NA
IT;1A3aii(ii);EM;NMVOC;kt;0,3365065407049999
IT;1A3aii(ii);EM;NOx;kt;8,552827486043997
IT;1A3aii(ii);EM;Ni;t;0,0008918989655102113
IT;1A3aii(ii);EM;PAH4;t;0,000339865336705
IT;1A3aii(ii);EM;PCB;t;NA
IT;1A3aii(ii);EM;PCDD/F;t;NA
IT;1A3aii(ii);EM;PM10;kt;0,08739833535400002
IT;1A3aii(ii);EM;PM2.5;kt;0,08739833535400002
IT;1A3aii(ii);EM;Pb;t;0,9521812518994366
IT;1A3aii(ii);EM;SO2;kt;0,6199501130540568
IT;1A3aii(ii);EM;Se;t;0,008917798715102112
IT;1A3aii(ii);EM;TSP;kt;0,08918197485102042
IT;1A3aii(ii);EM;Zn;t;0,01779864519056545
IT;1A3bi;EM;As;t;0,0033013163056779373
IT;1A3bi;EM;BC;kt;2,23543743546722
IT;1A3bi;EM;BaP;t;0,42244765336463724
IT;1A3bi;EM;BbF;t;0,48554142457571065
IT;1A3bi;EM;BkF;t;0,36432105637945106
IT;1A3bi;EM;CO;kt;162,81090505136652
IT;1A3bi;EM;Cd;t;0,26678885683497716
IT;1A3bi;EM;Cr;t;1,262312561445081
IT;1A3bi;EM;Cu;t;45,27786765747384
IT;1A3bi;EM;HCB;t;0,005996688461145775
IT;1A3bi;EM;Hg;t;0,1250159951183724
IT;1A3bi;EM;IxP;t;0,4262883104091607
IT;1A3bi;EM;NH3;kt;4,857380744343196
IT;1A3bi;EM;NMVOC;kt;13,43745173042703
IT;1A3bi;EM;NOx;kt;124,34389615228733
IT;1A3bi;EM;Ni;t;1,8701943070793812
IT;1A3bi;EM;PAH4;t;1,69859844472896
IT;1A3bi;EM;PCB;t;0,0012005214919586782
IT;1A3bi;EM;PCDD/F;t;5,996688461145775
IT;1A3bi;EM;PM10;kt;2,7560071417351546
IT;1A3bi;EM;PM2.5;kt;2,7560071417351546
IT;1A3bi;EM;Pb;t;0,001927866464312698
IT;1A3bi;EM;SO2;kt;0,2356693263543287
IT;1A3bi;EM;Se;t;0,2662374461253154
IT;1A3bi;EM;TSP;kt;2,7560071417351546
IT;1A3bi;EM;Zn;t;26,590872244075253
IT;1A3bii;EM;As;t;0,0003995364435084643
IT;1A3bii;EM;BC;kt;0,5175712086658756
IT;1A3bii;EM;BaP;t;0,0836380544741376
IT;1A3bii;EM;BbF;t;0,0939554916062117
IT;1A3bii;EM;BkF;t;0,07345009016212557
IT;1A3bii;EM;CO;kt;7,353438655979414
IT;1A3bii;EM;Cd;t;0,032188645324170415
IT;1A3bii;EM;Cr;t;0,16669351838171464
IT;1A3bii;EM;Cu;t;5,478394450854349
IT;1A3bii;EM;HCB;t;0,0006715167337886476
IT;1A3bii;EM;Hg;t;0,020449483399957433
IT;1A3bii;EM;IxP;t;0,07831080609504107
IT;1A3bii;EM;NH3;kt;0,24151777898195614
IT;1A3bii;EM;NMVOC;kt;0,7241644399617583
IT;1A3bii;EM;NOx;kt;40,19421865844224
IT;1A3bii;EM;Ni;t;0,22464690790146077
IT;1A3bii;EM;PAH4;t;0,32935444233751593
IT;1A3bii;EM;PCB;t;0,00013564207734393632
IT;1A3bii;EM;PCDD/F;t;0,6715167337886476
IT;1A3bii;EM;PM10;kt;0,649748155000139
IT;1A3bii;EM;PM2.5;kt;0,649748155000139
IT;1A3bii;EM;Pb;t;0,0002328647693932169
IT;1A3bii;EM;SO2;kt;0,053346417150242624
IT;1A3bii;EM;Se;t;0,032233009645487885
IT;1A3bii;EM;TSP;kt;0,649748155000139
IT;1A3bii;EM;Zn;t;3,2275015961485414
IT;1A3biii;EM;As;t;0,0007440422501759139
IT;1A3biii;EM;BC;kt;0,9593569672238146
IT;1A3biii;EM;BaP;t;0,03133955303481977
IT;1A3biii;EM;BbF;t;0,18977840448863062
IT;1A3biii;EM;BkF;t;0,21206430886894684
IT;1A3biii;EM;CO;kt;26,870629477186775
IT;1A3biii;EM;Cd;t;0,02788084661517278
IT;1A3biii;EM;Cr;t;0,17906627056224955
IT;1A3biii;EM;Cu;t;4,735797820865102
IT;1A3biii;EM;HCB;t;0,0006170590255087453
IT;1A3biii;EM;Hg;t;0,03943277246317744
IT;1A3biii;EM;IxP;t;0,048750415831941805
IT;1A3biii;EM;NH3;kt;0,27147316912924235
IT;1A3biii;EM;NMVOC;kt;2,568438098252154
IT;1A3biii;EM;NOx;kt;84,26398382079763
IT;1A3biii;EM;Ni;t;0,1938691589071705
IT;1A3biii;EM;PAH4;t;0,4819326822243394
IT;1A3biii;EM;PCB;t;0,0001262962905881089
IT;1A3biii;EM;PCDD/F;t;0,918182495070839
IT;1A3biii;EM;PM10;kt;1,4294344087834188
IT;1A3biii;EM;PM2.5;kt;1,4294344087834188
IT;1A3biii;EM;Pb;t;0,00020028347984504187
IT;1A3biii;EM;SO2;kt;0,10564715447629822
IT;1A3biii;EM;Se;t;0,028132184483305952
IT;1A3biii;EM;TSP;kt;1,4294344087834188
IT;1A3biii;EM;Zn;t;2,849815574652778
IT;1A3biv;EM;As;t;0,00024334523812382888
IT;1A3biv;EM;BC;kt;0,08594997128841599
IT;1A3biv;EM;BaP;t;0,007214607573829866
IT;1A3biv;EM;BbF;t;0,008540044421394756
IT;1A3biv;EM;BkF;t;0,005749736356456607
IT;1A3biv;EM;CO;kt;82,14470047219487
IT;1A3biv;EM;Cd;t;0,029581161511833796
IT;1A3biv;EM;Cr;t;0,12897943464516703
IT;1A3biv;EM;Cu;t;5,022932764690234
IT;1A3biv;EM;HCB;t;0,0003001767035450455
IT;1A3biv;EM;Hg;t;0,007057011905591049
IT;1A3biv;EM;IxP;t;0,009347234894934824
IT;1A3biv;EM;NH3;kt;0,04768362998411666
IT;1A3biv;EM;NMVOC;kt;25,154785666746328
IT;1A3biv;EM;NOx;kt;2,435838392635675
IT;1A3biv;EM;Ni;t;0,20760462069620086
IT;1A3biv;EM;PAH4;t;0,030851623246616063
IT;1A3biv;EM;PCB;t;9,143238394745354e-05
IT;1A3biv;EM;PCDD/F;t;0,30017670354504555
IT;1A3biv;EM;PM10;kt;0,5067369676661555
IT;1A3biv;EM;PM2.5;kt;0,5067369676661555
IT;1A3biv;EM;Pb;t;0,0002141904651145642
IT;1A3biv;EM;SO2;kt;0,007300357143714878
IT;1A3biv;EM;Se;t;0,029452131111162374
IT;1A3biv;EM;TSP;kt;0,5067369676661555
IT;1A3biv;EM;Zn;t;2,9312422953073654
IT;1A3bv;EM;As;t;NA
IT;1A3bv;EM;BC;kt;NA
IT;1A3bv;EM;BaP;t;NE
IT;1A3bv;EM;BbF;t;NE
IT;1A3bv;EM;BkF;t;NE
IT;1A3bv;EM;CO;kt;NA
IT;1A3bv;EM;Cd;t;NA
IT;1A3bv;EM;Cr;t;NA
IT;1A3bv;EM;Cu;t;NA
IT;1A3bv;EM;HCB;t;NA
IT;1A3bv;EM;Hg;t;NA
IT;1A3bv;EM;IxP;t;NE
IT;1A3bv;EM;NH3;kt;NA
IT;1A3bv;EM;NMVOC;kt;48,59481200676441
IT;1A3bv;EM;NOx;kt;NA
IT;1A3bv;EM;Ni;t;NA
IT;1A3bv;EM;PAH4;t;NE
IT;1A3bv;EM;PCB;t;NE
IT;1A3bv;EM;PCDD/F;t;NE
IT;1A3bv;EM;PM10;kt;NA
IT;1A3bv;EM;PM2.5;kt;NA
IT;1A3bv;EM;Pb;t;NA
IT;1A3bv;EM;SO2;kt;NA
IT;1A3bv;EM;Se;t;NA
IT;1A3bv;EM;TSP;kt;NA
IT;1A3bv;EM;Zn;t;NA
IT;1A3bvi;EM;As;t;0,4395525468968077
IT;1A3bvi;EM;BC;kt;1,2888182974798839
IT;1A3bvi;EM;BaP;t;0,03330765417684389
IT;1A3bvi;EM;BbF;t;0,0025604099852967973
IT;1A3bvi;EM;BkF;t;0,00377965283543813
IT;1A3bvi;EM;CO;kt;NA
IT;1A3bvi;EM;Cd;t;0,17125862010485698
IT;1A3bvi;EM;Cr;t;14,26408334979989
IT;1A3bvi;EM;Cu;t;312,87446772566983
IT;1A3bvi;EM;HCB;t;NA
IT;1A3bvi;EM;Hg;t;NA
IT;1A3bvi;EM;IxP;t;NE
IT;1A3bvi;EM;NH3;kt;NA
IT;1A3bvi;EM;NMVOC;kt;NA
IT;1A3bvi;EM;NOx;kt;NA
IT;1A3bvi;EM;Ni;t;2,214234886487873
IT;1A3bvi;EM;PAH4;t;0,03964771699757882
IT;1A3bvi;EM;PCB;t;NE
IT;1A3bvi;EM;PCDD/F;t;NE
IT;1A3bvi;EM;PM10;kt;10,404513908972675
IT;1A3bvi;EM;PM2.5;kt;5,478680318071705
IT;1A3bvi;EM;Pb;t;38,31574528698639
IT;1A3bvi;EM;SO2;kt;NA
IT;1A3bvi;EM;Se;t;0,26959841645680477
IT;1A3bvi;EM;TSP;kt;13,479920822840242
IT;1A3bvi;EM;Zn;t;107,78122949637208
IT;1A3bvii;EM;As;t;NE
IT;1A3bvii;EM;BC;kt;0,10210329408980996
IT;1A3bvii;EM;BaP;t;NE
IT;1A3bvii;EM;BbF;t;NE
IT;1A3bvii;EM;BkF;t;NE
IT;1A3bvii;EM;CO;kt;NA
IT;1A3bvii;EM;Cd;t;NE
IT;1A3bvii;EM;Cr;t;NE
IT;1A3bvii;EM;Cu;t;NE
IT;1A3bvii;EM;HCB;t;NA
IT;1A3bvii;EM;Hg;t;NE
IT;1A3bvii;EM;IxP;t;NE
IT;1A3bvii;EM;NH3;kt;NA
IT;1A3bvii;EM;NMVOC;kt;NA
IT;1A3bvii;EM;NOx;kt;NA
IT;1A3bvii;EM;Ni;t;NE
IT;1A3bvii;EM;PAH4;t;NE
IT;1A3bvii;EM;PCB;t;NE
IT;1A3bvii;EM;PCDD/F;t;NE
IT;1A3bvii;EM;PM10;kt;4,816193117443863
IT;1A3bvii;EM;PM2.5;kt;2,6007442834196857
IT;1A3bvii;EM;Pb;t;NE
IT;1A3bvii;EM;SO2;kt;NA
IT;1A3bvii;EM;Se;t;NE
IT;1A3bvii;EM;TSP;kt;9,632386234887726
IT;1A3bvii;EM;Zn;t;NE
IT;1A3c;EM;As;t;NA
IT;1A3c;EM;BC;kt;0,00715549046727273
IT;1A3c;EM;BaP;t;0,00033381000000000003
IT;1A3c;EM;BbF;t;0,0005563500000000002
IT;1A3c;EM;BkF;t;NE
IT;1A3c;EM;CO;kt;0,11905890000000001
IT;1A3c;EM;Cd;t;2,0604134482758572e-05
IT;1A3c;EM;Cr;t;6,053565835727972e-05
IT;1A3c;EM;Cu;t;0,0016073910724137914
IT;1A3c;EM;HCB;t;NA
IT;1A3c;EM;Hg;t;NA
IT;1A3c;EM;IxP;t;NE
IT;1A3c;EM;NH3;kt;7,788900000000001e-05
IT;1A3c;EM;NMVOC;kt;0,04285368410439562
IT;1A3c;EM;NOx;kt;0,44062284171428573
IT;1A3c;EM;Ni;t;0,00011127000000000002
IT;1A3c;EM;PAH4;t;0,0008901600000000001
IT;1A3c;EM;PCB;t;NA
IT;1A3c;EM;PCDD/F;t;NA
IT;1A3c;EM;PM10;kt;0,011008446872727274
IT;1A3c;EM;PM2.5;kt;0,010473314038636368
IT;1A3c;EM;Pb;t;NA
IT;1A3c;EM;SO2;kt;0,00015800339999999999
IT;1A3c;EM;Se;t;0,00022254000000000005
IT;1A3c;EM;TSP;kt;0,011233109053803342
IT;1A3c;EM;Zn;t;0,0003533909620689652
IT;1A3di(i);EM;As;t;0,1272154917776718
IT;1A3di(i);EM;BC;kt;1,2033031417431002
IT;1A3di(i);EM;BaP;t;NE
IT;1A3di(i);EM;BbF;t;NE
IT;1A3di(i);EM;BkF;t;NE
IT;1A3di(i);EM;CO;kt;9,766041362750322
IT;1A3di(i);EM;Cd;t;0,01616218668762741
IT;1A3di(i);EM;Cr;t;0,07525602688284704
IT;1A3di(i);EM;Cu;t;0,1272154917776718
IT;1A3di(i);EM;HCB;t;0,00010645020090047442
IT;1A3di(i);EM;Hg;t;NA
IT;1A3di(i);EM;IxP;t;NE
IT;1A3di(i);EM;NH3;kt;0,00909191165890952
IT;1A3di(i);EM;NMVOC;kt;3,17183485311999
IT;1A3di(i);EM;NOx;kt;80,43875716384069
IT;1A3di(i);EM;Ni;t;4,0627774120162
IT;1A3di(i);EM;PAH4;t;0,053225100450237206
IT;1A3di(i);EM;PCB;t;5,056384542772534e-05
IT;1A3di(i);EM;PCDD/F;t;0,00017298157646327092
IT;1A3di(i);EM;PM10;kt;9,996961328343266
IT;1A3di(i);EM;PM2.5;kt;9,996124473443313
IT;1A3di(i);EM;Pb;t;0,2625699265987967
IT;1A3di(i);EM;SO2;kt;78,8065337361629
IT;1A3di(i);EM;Se;t;0,2967297011297798
IT;1A3di(i);EM;TSP;kt;10,200980947289048
IT;1A3di(i);EM;Zn;t;0,7285657546613047
IT;1A3di(ii);EM;As;t;NO
IT;1A3di(ii);EM;BC;kt;NO
IT;1A3di(ii);EM;BaP;t;NO
IT;1A3di(ii);EM;BbF;t;NO
IT;1A3di(ii);EM;BkF;t;NO
IT;1A3di(ii);EM;CO;kt;NO
IT;1A3di(ii);EM;Cd;t;NO
IT;1A3di(ii);EM;Cr;t;NO
IT;1A3di(ii);EM;Cu;t;NO
IT;1A3di(ii);EM;HCB;t;NO
IT;1A3di(ii);EM;Hg;t;NO
IT;1A3di(ii);EM;IxP;t;NO
IT;1A3di(ii);EM;NH3;kt;NO
IT;1A3di(ii);EM;NMVOC;kt;NO
IT;1A3di(ii);EM;NOx;kt;NO
IT;1A3di(ii);EM;Ni;t;NO
IT;1A3di(ii);EM;PAH4;t;NO
IT;1A3di(ii);EM;PCB;t;NO
IT;1A3di(ii);EM;PCDD/F;t;NO
IT;1A3di(ii);EM;PM10;kt;NO
IT;1A3di(ii);EM;PM2.5;kt;NO
IT;1A3di(ii);EM;Pb;t;NO
IT;1A3di(ii);EM;SO2;kt;NO
IT;1A3di(ii);EM;Se;t;NO
IT;1A3di(ii);EM;TSP;kt;NO
IT;1A3di(ii);EM;Zn;t;NO
IT;1A3dii;EM;As;t;0,1657598585274768
IT;1A3dii;EM;BC;kt;1,8218023288968774
IT;1A3dii;EM;BaP;t;NE
IT;1A3dii;EM;BbF;t;NE
IT;1A3dii;EM;BkF;t;NE
IT;1A3dii;EM;CO;kt;43,60198951873222
IT;1A3dii;EM;Cd;t;0,021092322249987874
IT;1A3dii;EM;Cr;t;0,09808782238116606
IT;1A3dii;EM;Cu;t;0,16617424857203245
IT;1A3dii;EM;HCB;t;0,13705029165952554
IT;1A3dii;EM;Hg;t;NA
IT;1A3dii;EM;IxP;t;NE
IT;1A3dii;EM;NH3;kt;0,012161045914489611
IT;1A3dii;EM;NMVOC;kt;10,227152397407172
IT;1A3dii;EM;NOx;kt;101,6956653908738
IT;1A3dii;EM;Ni;t;5,293837132101736
IT;1A3dii;EM;PAH4;t;0,07466955491608665
IT;1A3dii;EM;PCB;t;0,06509888853827461
IT;1A3dii;EM;PCDD/F;t;0,22270672394672897
IT;1A3dii;EM;PM10;kt;7,8727231021151916
IT;1A3dii;EM;PM2.5;kt;7,870720317280927
IT;1A3dii;EM;Pb;t;0,18702027340120334
IT;1A3dii;EM;SO2;kt;10,90795986433558
IT;1A3dii;EM;Se;t;0,3876314406286352
IT;1A3dii;EM;TSP;kt;8,033390920525706
IT;1A3dii;EM;Zn;t;0,9513000907148565
IT;1A3ei;EM;As;t;NA
IT;1A3ei;EM;BC;kt;0,000685258282209229
IT;1A3ei;EM;BaP;t;NA
IT;1A3ei;EM;BbF;t;NA
IT;1A3ei;EM;BkF;t;NA
IT;1A3ei;EM;CO;kt;0,3047816218195131
IT;1A3ei;EM;Cd;t;NA
IT;1A3ei;EM;Cr;t;NA
IT;1A3ei;EM;Cu;t;NA
IT;1A3ei;EM;HCB;t;NA
IT;1A3ei;EM;Hg;t;NA
IT;1A3ei;EM;IxP;t;NA
IT;1A3ei;EM;NH3;kt;NE
IT;1A3ei;EM;NMVOC;kt;0,04165889224479834
IT;1A3ei;EM;NOx;kt;0,5609278784550613
IT;1A3ei;EM;Ni;t;NA
IT;1A3ei;EM;PAH4;t;NA
IT;1A3ei;EM;PCB;t;NA
IT;1A3ei;EM;PCDD/F;t;NA
IT;1A3ei;EM;PM10;kt;0,02741033128836916
IT;1A3ei;EM;PM2.5;kt;0,02741033128836916
IT;1A3ei;EM;Pb;t;NA
IT;1A3ei;EM;SO2;kt;0,0051418602353827695
IT;1A3ei;EM;Se;t;NA
IT;1A3ei;EM;TSP;kt;0,03426291411046145
IT;1A3ei;EM;Zn;t;NA
IT;1A3eii;EM;As;t;NO
IT;1A3eii;EM;BC;kt;NO
IT;1A3eii;EM;BaP;t;NO
IT;1A3eii;EM;BbF;t;NO
IT;1A3eii;EM;BkF;t;NO
IT;1A3eii;EM;CO;kt;NO
IT;1A3eii;EM;Cd;t;NO
IT;1A3eii;EM;Cr;t;NO
IT;1A3eii;EM;Cu;t;NO
IT;1A3eii;EM;HCB;t;NO
IT;1A3eii;EM;Hg;t;NO
IT;1A3eii;EM;IxP;t;NO
IT;1A3eii;EM;NH3;kt;NO
IT;1A3eii;EM;NMVOC;kt;NO
IT;1A3eii;EM;NOx;kt;NO
IT;1A3eii;EM;Ni;t;NO
IT;1A3eii;EM;PAH4;t;NO
IT;1A3eii;EM;PCB;t;NO
IT;1A3eii;EM;PCDD/F;t;NO
IT;1A3eii;EM;PM10;kt;NO
IT;1A3eii;EM;PM2.5;kt;NO
IT;1A3eii;EM;Pb;t;NO
IT;1A3eii;EM;SO2;kt;NO
IT;1A3eii;EM;Se;t;NO
IT;1A3eii;EM;TSP;kt;NO
IT;1A3eii;EM;Zn;t;NO
IT;1A4ai;EM;As;t;0,09838670734970285
IT;1A4ai;EM;BC;kt;0,13875609839243533
IT;1A4ai;EM;BaP;t;0,19575267202434074
IT;1A4ai;EM;BbF;t;0,22091400755162752
IT;1A4ai;EM;BkF;t;0,10168398968696517
IT;1A4ai;EM;CO;kt;26,794356263846545
IT;1A4ai;EM;Cd;t;0,07920585272569527
IT;1A4ai;EM;Cr;t;0,48956222592073567
IT;1A4ai;EM;Cu;t;0,41181554060102527
IT;1A4ai;EM;HCB;t;1,8842514825527166
IT;1A4ai;EM;Hg;t;0,20144258269437754
IT;1A4ai;EM;IxP;t;0,1268781643885445
IT;1A4ai;EM;NH3;kt;0,028575046721397285
IT;1A4ai;EM;NMVOC;kt;26,9799146634143
IT;1A4ai;EM;NOx;kt;27,695741526609922
IT;1A4ai;EM;Ni;t;0,057484745977026304
IT;1A4ai;EM;PAH4;t;0,6452288732342205
IT;1A4ai;EM;PCB;t;3,139072065369988
IT;1A4ai;EM;PCDD/F;t;3,0145000013859073
IT;1A4ai;EM;PM10;kt;1,4330935076303142
IT;1A4ai;EM;PM2.5;kt;1,4013210070695379
IT;1A4ai;EM;Pb;t;4,804631651867553
IT;1A4ai;EM;SO2;kt;4,113703629761777
IT;1A4ai;EM;Se;t;0,05950656206827107
IT;1A4ai;EM;TSP;kt;1,6859923619180168
IT;1A4ai;EM;Zn;t;4,067808986125685
IT;1A4aii;EM;As;t;IE
IT;1A4aii;EM;BC;kt;IE
IT;1A4aii;EM;BaP;t;IE
IT;1A4aii;EM;BbF;t;IE
IT;1A4aii;EM;BkF;t;IE
IT;1A4aii;EM;CO;kt;IE
IT;1A4aii;EM;Cd;t;IE
IT;1A4aii;EM;Cr;t;IE
IT;1A4aii;EM;Cu;t;IE
IT;1A4aii;EM;HCB;t;IE
IT;1A4aii;EM;Hg;t;IE
IT;1A4aii;EM;IxP;t;IE
IT;1A4aii;EM;NH3;kt;IE
IT;1A4aii;EM;NMVOC;kt;IE
IT;1A4aii;EM;NOx;kt;IE
IT;1A4aii;EM;Ni;t;IE
IT;1A4aii;EM;PAH4;t;IE
IT;1A4aii;EM;PCB;t;IE
IT;1A4aii;EM;PCDD/F;t;IE
IT;1A4aii;EM;PM10;kt;IE
IT;1A4aii;EM;PM2.5;kt;IE
IT;1A4aii;EM;Pb;t;IE
IT;1A4aii;EM;SO2;kt;IE
IT;1A4aii;EM;Se;t;IE
IT;1A4aii;EM;TSP;kt;IE
IT;1A4aii;EM;Zn;t;IE
IT;1A4bi;EM;As;t;0,1574956106017663
IT;1A4bi;EM;BC;kt;8,104548581944787
IT;1A4bi;EM;BaP;t;14,974983040291573
IT;1A4bi;EM;BbF;t;17,047484692742994
IT;1A4bi;EM;BkF;t;7,638275490832941
IT;1A4bi;EM;CO;kt;1206,5937859880958
IT;1A4bi;EM;Cd;t;0,3692398561377685
IT;1A4bi;EM;Cr;t;0,8714734833261437
IT;1A4bi;EM;Cu;t;1,3918667169558294
IT;1A4bi;EM;HCB;t;1,5234056041597428
IT;1A4bi;EM;Hg;t;0,22694567901064955
IT;1A4bi;EM;IxP;t;9,765017465573036
IT;1A4bi;EM;NH3;kt;1,2553110307402937
IT;1A4bi;EM;NMVOC;kt;138,90073421998812
IT;1A4bi;EM;NOx;kt;37,402148206802195
IT;1A4bi;EM;Ni;t;0,538347011641702
IT;1A4bi;EM;PAH4;t;49,425760689440544
IT;1A4bi;EM;PCB;t;15,234056041597428
IT;1A4bi;EM;PCDD/F;t;95,87294775957872
IT;1A4bi;EM;PM10;kt;91,20035937569418
IT;1A4bi;EM;PM2.5;kt;90,05526531448477
IT;1A4bi;EM;Pb;t;8,859006716131033
IT;1A4bi;EM;SO2;kt;5,0747746775334885
IT;1A4bi;EM;Se;t;0,12745955273978615
IT;1A4bi;EM;TSP;kt;107,29454044199315
IT;1A4bi;EM;Zn;t;23,335760982086608
IT;1A4bii;EM;As;t;NA
IT;1A4bii;EM;BC;kt;2,56075155e-05
IT;1A4bii;EM;BaP;t;2,0000000000000005e-05
IT;1A4bii;EM;BbF;t;2,0000000000000005e-05
IT;1A4bii;EM;BkF;t;NE
IT;1A4bii;EM;CO;kt;0,8091176470588236
IT;1A4bii;EM;Cd;t;2,5000000000000004e-07
IT;1A4bii;EM;Cr;t;2,2834999999999953e-07
IT;1A4bii;EM;Cu;t;3,1168539325842706e-06
IT;1A4bii;EM;HCB;t;NA
IT;1A4bii;EM;Hg;t;NA
IT;1A4bii;EM;IxP;t;NE
IT;1A4bii;EM;NH3;kt;2,058823529411765e-06
IT;1A4bii;EM;NMVOC;kt;0,41845588235294123
IT;1A4bii;EM;NOx;kt;0,0009110294117647059
IT;1A4bii;EM;Ni;t;7,500000000000001e-07
IT;1A4bii;EM;PAH4;t;4,000000000000001e-05
IT;1A4bii;EM;PCB;t;NA
IT;1A4bii;EM;PCDD/F;t;NA
IT;1A4bii;EM;PM10;kt;0,00051215031
IT;1A4bii;EM;PM2.5;kt;0,00051215031
IT;1A4bii;EM;Pb;t;NA
IT;1A4bii;EM;SO2;kt;4,499999999999999e-06
IT;1A4bii;EM;Se;t;7,499999999999999e-06
IT;1A4bii;EM;TSP;kt;0,0005226023571428572
IT;1A4bii;EM;Zn;t;1,4967500000000002e-05
IT;1A4ci;EM;As;t;NO
IT;1A4ci;EM;BC;kt;0,05224489511962277
IT;1A4ci;EM;BaP;t;0,08503989708839889
IT;1A4ci;EM;BbF;t;0,09680921440687609
IT;1A4ci;EM;BkF;t;0,043376220188402
IT;1A4ci;EM;CO;kt;10,892338579230296
IT;1A4ci;EM;Cd;t;0,014076383999999997
IT;1A4ci;EM;Cr;t;NO
IT;1A4ci;EM;Cu;t;0,014076383999999997
IT;1A4ci;EM;HCB;t;0,008651112021500644
IT;1A4ci;EM;Hg;t;0,01731126642
IT;1A4ci;EM;IxP;t;0,05545355731652169
IT;1A4ci;EM;NH3;kt;0,00712865721322433
IT;1A4ci;EM;NMVOC;kt;1,9198670533082536
IT;1A4ci;EM;NOx;kt;12,972182423602518
IT;1A4ci;EM;Ni;t;NO
IT;1A4ci;EM;PAH4;t;0,28067888900019866
IT;1A4ci;EM;PCB;t;0,08651112021500644
IT;1A4ci;EM;PCDD/F;t;0,5596043305536799
IT;1A4ci;EM;PM10;kt;0,5863248736263887
IT;1A4ci;EM;PM2.5;kt;0,5779157454546094
IT;1A4ci;EM;Pb;t;0,007038191999999999
IT;1A4ci;EM;SO2;kt;0,027707792105685566
IT;1A4ci;EM;Se;t;NO
IT;1A4ci;EM;TSP;kt;0,689793968972222
IT;1A4ci;EM;Zn;t;0,280354648
IT;1A4cii;EM;As;t;NA
IT;1A4cii;EM;BC;kt;0,13466823915196077
IT;1A4cii;EM;BaP;t;0,05545169
IT;1A4cii;EM;BbF;t;0,09239383
IT;1A4cii;EM;BkF;t;NE
IT;1A4cii;EM;CO;kt;33,52103692583541
IT;1A4cii;EM;Cd;t;0,0034208136172413704
IT;1A4cii;EM;Cr;t;0,010049494643444384
IT;1A4cii;EM;Cu;t;0,2668365263131729
IT;1A4cii;EM;HCB;t;NA
IT;1A4cii;EM;Hg;t;NA
IT;1A4cii;EM;IxP;t;NE
IT;1A4cii;EM;NH3;kt;0,01255227198396162
IT;1A4cii;EM;NMVOC;kt;4,842104371394758
IT;1A4cii;EM;NOx;kt;22,31392238339036
IT;1A4cii;EM;Ni;t;0,018472513
IT;1A4cii;EM;PAH4;t;0,14784551999999998
IT;1A4cii;EM;PCB;t;NA
IT;1A4cii;EM;PCDD/F;t;NA
IT;1A4cii;EM;PM10;kt;0,2371590092879115
IT;1A4cii;EM;PM2.5;kt;0,2371590092879115
IT;1A4cii;EM;Pb;t;NA
IT;1A4cii;EM;SO2;kt;0,026237577399999996
IT;1A4cii;EM;Se;t;0,03695657
IT;1A4cii;EM;TSP;kt;0,24199898906929745
IT;1A4cii;EM;Zn;t;0,058692491167701095
IT;1A4ciii;EM;As;t;0,013292051811822093
IT;1A4ciii;EM;BC;kt;0,34256992
IT;1A4ciii;EM;BaP;t;NE
IT;1A4ciii;EM;BbF;t;NE
IT;1A4ciii;EM;BkF;t;NE
IT;1A4ciii;EM;CO;kt;1,5154269999999999
IT;1A4ciii;EM;Cd;t;0,0016886985998507962
IT;1A4ciii;EM;Cr;t;0,007863091157379369
IT;1A4ciii;EM;Cu;t;0,013292051811822093
IT;1A4ciii;EM;HCB;t;0,474986096064
IT;1A4ciii;EM;Hg;t;NA
IT;1A4ciii;EM;IxP;t;NE
IT;1A4ciii;EM;NH3;kt;0,0009732100000000001
IT;1A4ciii;EM;NMVOC;kt;0,6562216
IT;1A4ciii;EM;NOx;kt;5,9087749999999994
IT;1A4ciii;EM;Ni;t;0,4244974185596637
IT;1A4ciii;EM;PAH4;t;0,0055612000000000005
IT;1A4ciii;EM;PCB;t;0,22561839563039998
IT;1A4ciii;EM;PCDD/F;t;0,7718524061040001
IT;1A4ciii;EM;PM10;kt;0,6228544
IT;1A4ciii;EM;PM2.5;kt;0,6228544
IT;1A4ciii;EM;Pb;t;NA
IT;1A4ciii;EM;SO2;kt;0,0019742259999999995
IT;1A4ciii;EM;Se;t;0,03100366556312581
IT;1A4ciii;EM;TSP;kt;0,6355657142857143
IT;1A4ciii;EM;Zn;t;0,07612385586027373
IT;1A5a;EM;As;t;IE
IT;1A5a;EM;BC;kt;IE
IT;1A5a;EM;BaP;t;IE
IT;1A5a;EM;BbF;t;IE
IT;1A5a;EM;BkF;t;IE
IT;1A5a;EM;CO;kt;IE
IT;1A5a;EM;Cd;t;IE
IT;1A5a;EM;Cr;t;IE
IT;1A5a;EM;Cu;t;IE
IT;1A5a;EM;HCB;t;IE
IT;1A5a;EM;Hg;t;IE
IT;1A5a;EM;IxP;t;IE
IT;1A5a;EM;NH3;kt;IE
IT;1A5a;EM;NMVOC;kt;IE
IT;1A5a;EM;NOx;kt;IE
IT;1A5a;EM;Ni;t;IE
IT;1A5a;EM;PAH4;t;IE
IT;1A5a;EM;PCB;t;IE
IT;1A5a;EM;PCDD/F;t;IE
IT;1A5a;EM;PM10;kt;IE
IT;1A5a;EM;PM2.5;kt;IE
IT;1A5a;EM;Pb;t;IE
IT;1A5a;EM;SO2;kt;IE
IT;1A5a;EM;Se;t;IE
IT;1A5a;EM;TSP;kt;IE
IT;1A5a;EM;Zn;t;IE
IT;1A5b;EM;As;t;NA
IT;1A5b;EM;BC;kt;0,21947491911306902
IT;1A5b;EM;BaP;t;0,00018120999999999998
IT;1A5b;EM;BbF;t;0,00029583
IT;1A5b;EM;BkF;t;NE
IT;1A5b;EM;CO;kt;20,34242176470588
IT;1A5b;EM;Cd;t;8,978173103448273e-05
IT;1A5b;EM;Cr;t;0,00010349252240951454
IT;1A5b;EM;Cu;t;0,0018149314248353341
IT;1A5b;EM;HCB;t;NA
IT;1A5b;EM;Hg;t;NA
IT;1A5b;EM;IxP;t;NE
IT;1A5b;EM;NH3;kt;4,217582352941177e-05
IT;1A5b;EM;NMVOC;kt;0,6212388876470588
IT;1A5b;EM;NOx;kt;2,794740794117647
IT;1A5b;EM;Ni;t;0,0002948185
IT;1A5b;EM;PAH4;t;0,0004910485804
IT;1A5b;EM;PCB;t;NA
IT;1A5b;EM;PCDD/F;t;NA
IT;1A5b;EM;PM10;kt;0,4475696070955605
IT;1A5b;EM;PM2.5;kt;0,4475696070955605
IT;1A5b;EM;Pb;t;0,09408
IT;1A5b;EM;SO2;kt;0,15802398019999997
IT;1A5b;EM;Se;t;0,0024897050000000005
IT;1A5b;EM;TSP;kt;0,4567036807097556
IT;1A5b;EM;Zn;t;0,004921893207528735
IT;1A5c;EM;As;t;NE
IT;1A5c;EM;BC;kt;NE
IT;1A5c;EM;BaP;t;NE
IT;1A5c;EM;BbF;t;NE
IT;1A5c;EM;BkF;t;NE
IT;1A5c;EM;CO;kt;NE
IT;1A5c;EM;Cd;t;NE
IT;1A5c;EM;Cr;t;NE
IT;1A5c;EM;Cu;t;NE
IT;1A5c;EM;HCB;t;NE
IT;1A5c;EM;Hg;t;NE
IT;1A5c;EM;IxP;t;NE
IT;1A5c;EM;NH3;kt;NE
IT;1A5c;EM;NMVOC;kt;NE
IT;1A5c;EM;NOx;kt;NE
IT;1A5c;EM;Ni;t;NE
IT;1A5c;EM;PAH4;t;NE
IT;1A5c;EM;PCB;t;NE
IT;1A5c;EM;PCDD/F;t;NE
IT;1A5c;EM;PM10;kt;NE
IT;1A5c;EM;PM2.5;kt;NE
IT;1A5c;EM;Pb;t;NE
IT;1A5c;EM;SO2;kt;NE
IT;1A5c;EM;Se;t;NE
IT;1A5c;EM;TSP;kt;NE
IT;1A5c;EM;Zn;t;NE
IT;1B1a;EM;As;t;NA
IT;1B1a;EM;BC;kt;0,030905589960000007
IT;1B1a;EM;BaP;t;NA
IT;1B1a;EM;BbF;t;NA
IT;1B1a;EM;BkF;t;NA
IT;1B1a;EM;CO;kt;NA
IT;1B1a;EM;Cd;t;NA
IT;1B1a;EM;Cr;t;NA
IT;1B1a;EM;Cu;t;NA
IT;1B1a;EM;HCB;t;NA
IT;1B1a;EM;Hg;t;NA
IT;1B1a;EM;IxP;t;NA
IT;1B1a;EM;NH3;kt;NA
IT;1B1a;EM;NMVOC;kt;NA
IT;1B1a;EM;NOx;kt;NA
IT;1B1a;EM;Ni;t;NA
IT;1B1a;EM;PAH4;t;NA
IT;1B1a;EM;PCB;t;NA
IT;1B1a;EM;PCDD/F;t;NA
IT;1B1a;EM;PM10;kt;0,3635951760000001
IT;1B1a;EM;PM2.5;kt;0,03635951760000001
IT;1B1a;EM;Pb;t;NA
IT;1B1a;EM;SO2;kt;NA
IT;1B1a;EM;Se;t;NA
IT;1B1a;EM;TSP;kt;0,7271903520000002
IT;1B1a;EM;Zn;t;NA
IT;1B1b;EM;As;t;0,03205598042
IT;1B1b;EM;BC;kt;0,01662474434149872
IT;1B1b;EM;BaP;t;NA
IT;1B1b;EM;BbF;t;NA
IT;1B1b;EM;BkF;t;NA
IT;1B1b;EM;CO;kt;NA
IT;1B1b;EM;Cd;t;0,08013995105
IT;1B1b;EM;Cr;t;0,27247583357000005
IT;1B1b;EM;Cu;t;0,14425191188999997
IT;1B1b;EM;HCB;t;NA
IT;1B1b;EM;Hg;t;0,04808397063
IT;1B1b;EM;IxP;t;NA
IT;1B1b;EM;NH3;kt;IE
IT;1B1b;EM;NMVOC;kt;0,8013995105
IT;1B1b;EM;NOx;kt;IE
IT;1B1b;EM;Ni;t;0,104181936365
IT;1B1b;EM;PAH4;t;8,494834811299998e-07
IT;1B1b;EM;PCB;t;NA
IT;1B1b;EM;PCDD/F;t;NA
IT;1B1b;EM;PM10;kt;0,0807810706584
IT;1B1b;EM;PM2.5;kt;0,033928049676528
IT;1B1b;EM;Pb;t;0,35261578462
IT;1B1b;EM;SO2;kt;IE
IT;1B1b;EM;Se;t;NA
IT;1B1b;EM;TSP;kt;0,10097633832299999
IT;1B1b;EM;Zn;t;0,35261578462
IT;1B1c;EM;As;t;NO
IT;1B1c;EM;BC;kt;NO
IT;1B1c;EM;BaP;t;NO
IT;1B1c;EM;BbF;t;NO
IT;1B1c;EM;BkF;t;NO
IT;1B1c;EM;CO;kt;NO
IT;1B1c;EM;Cd;t;NO
IT;1B1c;EM;Cr;t;NO
IT;1B1c;EM;Cu;t;NO
IT;1B1c;EM;HCB;t;NO
IT;1B1c;EM;Hg;t;NO
IT;1B1c;EM;IxP;t;NO
IT;1B1c;EM;NH3;kt;NO
IT;1B1c;EM;NMVOC;kt;NO
IT;1B1c;EM;NOx;kt;NO
IT;1B1c;EM;Ni;t;NO
IT;1B1c;EM;PAH4;t;NO
IT;1B1c;EM;PCB;t;NO
IT;1B1c;EM;PCDD/F;t;NO
IT;1B1c;EM;PM10;kt;NO
IT;1B1c;EM;PM2.5;kt;NO
IT;1B1c;EM;Pb;t;NO
IT;1B1c;EM;SO2;kt;NO
IT;1B1c;EM;Se;t;NO
IT;1B1c;EM;TSP;kt;NO
IT;1B1c;EM;Zn;t;NO
IT;1B2ai;EM;As;t;NA
IT;1B2ai;EM;BC;kt;NA
IT;1B2ai;EM;BaP;t;NA
IT;1B2ai;EM;BbF;t;NA
IT;1B2ai;EM;BkF;t;NA
IT;1B2ai;EM;CO;kt;NA
IT;1B2ai;EM;Cd;t;NA
IT;1B2ai;EM;Cr;t;NA
IT;1B2ai;EM;Cu;t;NA
IT;1B2ai;EM;HCB;t;NA
IT;1B2ai;EM;Hg;t;NA
IT;1B2ai;EM;IxP;t;NA
IT;1B2ai;EM;NH3;kt;NA
IT;1B2ai;EM;NMVOC;kt;1,5046108225341783
IT;1B2ai;EM;NOx;kt;NA
IT;1B2ai;EM;Ni;t;NA
IT;1B2ai;EM;PAH4;t;NA
IT;1B2ai;EM;PCB;t;NA
IT;1B2ai;EM;PCDD/F;t;NA
IT;1B2ai;EM;PM10;kt;NA
IT;1B2ai;EM;PM2.5;kt;NA
IT;1B2ai;EM;Pb;t;NA
IT;1B2ai;EM;SO2;kt;NA
IT;1B2ai;EM;Se;t;NA
IT;1B2ai;EM;TSP;kt;NA
IT;1B2ai;EM;Zn;t;NA
IT;1B2aiv;EM;As;t;NA
IT;1B2aiv;EM;BC;kt;0,0027285055830778004
IT;1B2aiv;EM;BaP;t;NE
IT;1B2aiv;EM;BbF;t;NE
IT;1B2aiv;EM;BkF;t;NE
IT;1B2aiv;EM;CO;kt;0,07750338550000001
IT;1B2aiv;EM;Cd;t;IE
IT;1B2aiv;EM;Cr;t;NA
IT;1B2aiv;EM;Cu;t;NA
IT;1B2aiv;EM;HCB;t;NA
IT;1B2aiv;EM;Hg;t;NA
IT;1B2aiv;EM;IxP;t;NE
IT;1B2aiv;EM;NH3;kt;0,07501999999999999
IT;1B2aiv;EM;NMVOC;kt;2,1808894790470577
IT;1B2aiv;EM;NOx;kt;5,452143653695855
IT;1B2aiv;EM;Ni;t;NA
IT;1B2aiv;EM;PAH4;t;IE
IT;1B2aiv;EM;PCB;t;NA
IT;1B2aiv;EM;PCDD/F;t;IE
IT;1B2aiv;EM;PM10;kt;0,0464833439556984
IT;1B2aiv;EM;PM2.5;kt;0,02098850448521385
IT;1B2aiv;EM;Pb;t;NA
IT;1B2aiv;EM;SO2;kt;14,144170953248024
IT;1B2aiv;EM;Se;t;NA
IT;1B2aiv;EM;TSP;kt;0,05916061957997978
IT;1B2aiv;EM;Zn;t;NA
IT;1B2av;EM;As;t;NA
IT;1B2av;EM;BC;kt;NA
IT;1B2av;EM;BaP;t;NA
IT;1B2av;EM;BbF;t;NA
IT;1B2av;EM;BkF;t;NA
IT;1B2av;EM;CO;kt;NA
IT;1B2av;EM;Cd;t;NA
IT;1B2av;EM;Cr;t;NA
IT;1B2av;EM;Cu;t;NA
IT;1B2av;EM;HCB;t;NA
IT;1B2av;EM;Hg;t;NA
IT;1B2av;EM;IxP;t;NA
IT;1B2av;EM;NH3;kt;NA
IT;1B2av;EM;NMVOC;kt;14,331190425085794
IT;1B2av;EM;NOx;kt;NA
IT;1B2av;EM;Ni;t;NA
IT;1B2av;EM;PAH4;t;NA
IT;1B2av;EM;PCB;t;NA
IT;1B2av;EM;PCDD/F;t;NA
IT;1B2av;EM;PM10;kt;NA
IT;1B2av;EM;PM2.5;kt;NA
IT;1B2av;EM;Pb;t;NA
IT;1B2av;EM;SO2;kt;NA
IT;1B2av;EM;Se;t;NA
IT;1B2av;EM;TSP;kt;NA
IT;1B2av;EM;Zn;t;NA
IT;1B2b;EM;As;t;NA
IT;1B2b;EM;BC;kt;NA
IT;1B2b;EM;BaP;t;NA
IT;1B2b;EM;BbF;t;NA
IT;1B2b;EM;BkF;t;NA
IT;1B2b;EM;CO;kt;NA
IT;1B2b;EM;Cd;t;NA
IT;1B2b;EM;Cr;t;NA
IT;1B2b;EM;Cu;t;NA
IT;1B2b;EM;HCB;t;NA
IT;1B2b;EM;Hg;t;NA
IT;1B2b;EM;IxP;t;NA
IT;1B2b;EM;NH3;kt;NA
IT;1B2b;EM;NMVOC;kt;14,458337849802783
IT;1B2b;EM;NOx;kt;NA
IT;1B2b;EM;Ni;t;NA
IT;1B2b;EM;PAH4;t;NA
IT;1B2b;EM;PCB;t;NA
IT;1B2b;EM;PCDD/F;t;NA
IT;1B2b;EM;PM10;kt;NA
IT;1B2b;EM;PM2.5;kt;NA
IT;1B2b;EM;Pb;t;NA
IT;1B2b;EM;SO2;kt;NA
IT;1B2b;EM;Se;t;NA
IT;1B2b;EM;TSP;kt;NA
IT;1B2b;EM;Zn;t;NA
IT;1B2c;EM;As;t;NA
IT;1B2c;EM;BC;kt;NA
IT;1B2c;EM;BaP;t;NA
IT;1B2c;EM;BbF;t;NA
IT;1B2c;EM;BkF;t;NA
IT;1B2c;EM;CO;kt;NA
IT;1B2c;EM;Cd;t;NA
IT;1B2c;EM;Cr;t;NA
IT;1B2c;EM;Cu;t;NA
IT;1B2c;EM;HCB;t;NA
IT;1B2c;EM;Hg;t;NA
IT;1B2c;EM;IxP;t;NA
IT;1B2c;EM;NH3;kt;NA
IT;1B2c;EM;NMVOC;kt;0,18960284280936454
IT;1B2c;EM;NOx;kt;0,20243311036789294
IT;1B2c;EM;Ni;t;NA
IT;1B2c;EM;PAH4;t;NA
IT;1B2c;EM;PCB;t;NA
IT;1B2c;EM;PCDD/F;t;NA
IT;1B2c;EM;PM10;kt;NA
IT;1B2c;EM;PM2.5;kt;NA
IT;1B2c;EM;Pb;t;NA
IT;1B2c;EM;SO2;kt;3,71973686534932
IT;1B2c;EM;Se;t;NA
IT;1B2c;EM;TSP;kt;NA
IT;1B2c;EM;Zn;t;NA
IT;1B2d;EM;As;t;0,0183143564955909
IT;1B2d;EM;BC;kt;NA
IT;1B2d;EM;BaP;t;NA
IT;1B2d;EM;BbF;t;NA
IT;1B2d;EM;BkF;t;NA
IT;1B2d;EM;CO;kt;NA
IT;1B2d;EM;Cd;t;0,00015106514317180618
IT;1B2d;EM;Cr;t;0,0004403388215859031
IT;1B2d;EM;Cu;t;0,0008903200991189428
IT;1B2d;EM;HCB;t;NA
IT;1B2d;EM;Hg;t;0,19347809469270663
IT;1B2d;EM;IxP;t;NA
IT;1B2d;EM;NH3;kt;0,9313155517282898
IT;1B2d;EM;NMVOC;kt;NA
IT;1B2d;EM;NOx;kt;NA
IT;1B2d;EM;Ni;t;0,003313790693832599
IT;1B2d;EM;PAH4;t;NA
IT;1B2d;EM;PCB;t;NA
IT;1B2d;EM;PCDD/F;t;NA
IT;1B2d;EM;PM10;kt;NA
IT;1B2d;EM;PM2.5;kt;NA
IT;1B2d;EM;Pb;t;0,0008292512114537445
IT;1B2d;EM;SO2;kt;NA
IT;1B2d;EM;Se;t;0,054943069486772696
IT;1B2d;EM;TSP;kt;NA
IT;1B2d;EM;Zn;t;NA
IT;2A1;EM;As;t;NA
IT;2A1;EM;BC;kt;0,061093652463362985
IT;2A1;EM;BaP;t;NA
IT;2A1;EM;BbF;t;NA
IT;2A1;EM;BkF;t;NA
IT;2A1;EM;CO;kt;NA
IT;2A1;EM;Cd;t;NA
IT;2A1;EM;Cr;t;NA
IT;2A1;EM;Cu;t;NA
IT;2A1;EM;HCB;t;NA
IT;2A1;EM;Hg;t;NA
IT;2A1;EM;IxP;t;NA
IT;2A1;EM;NH3;kt;NA
IT;2A1;EM;NMVOC;kt;NA
IT;2A1;EM;NOx;kt;NA
IT;2A1;EM;Ni;t;NA
IT;2A1;EM;PAH4;t;NA
IT;2A1;EM;PCB;t;NA
IT;2A1;EM;PCDD/F;t;NA
IT;2A1;EM;PM10;kt;3,6656191478017797
IT;2A1;EM;PM2.5;kt;2,0364550821121
IT;2A1;EM;Pb;t;NA
IT;2A1;EM;SO2;kt;NA
IT;2A1;EM;Se;t;NA
IT;2A1;EM;TSP;kt;4,0729101642242
IT;2A1;EM;Zn;t;NA
IT;2A2;EM;As;t;NA
IT;2A2;EM;BC;kt;0,0009607341574769533
IT;2A2;EM;BaP;t;NA
IT;2A2;EM;BbF;t;NA
IT;2A2;EM;BkF;t;NA
IT;2A2;EM;CO;kt;NA
IT;2A2;EM;Cd;t;NA
IT;2A2;EM;Cr;t;NA
IT;2A2;EM;Cu;t;NA
IT;2A2;EM;HCB;t;NA
IT;2A2;EM;Hg;t;NA
IT;2A2;EM;IxP;t;NA
IT;2A2;EM;NH3;kt;NA
IT;2A2;EM;NMVOC;kt;NA
IT;2A2;EM;NOx;kt;NA
IT;2A2;EM;Ni;t;NA
IT;2A2;EM;PAH4;t;NA
IT;2A2;EM;PCB;t;NA
IT;2A2;EM;PCDD/F;t;NA
IT;2A2;EM;PM10;kt;1,0469363956785647
IT;2A2;EM;PM2.5;kt;0,20885525162542462
IT;2A2;EM;Pb;t;NA
IT;2A2;EM;SO2;kt;NA
IT;2A2;EM;Se;t;NA
IT;2A2;EM;TSP;kt;2,6921221603163095
IT;2A2;EM;Zn;t;NA
IT;2A3;EM;As;t;NA
IT;2A3;EM;BC;kt;IE
IT;2A3;EM;BaP;t;NA
IT;2A3;EM;BbF;t;NA
IT;2A3;EM;BkF;t;NA
IT;2A3;EM;CO;kt;NA
IT;2A3;EM;Cd;t;IE
IT;2A3;EM;Cr;t;NA
IT;2A3;EM;Cu;t;NA
IT;2A3;EM;HCB;t;NA
IT;2A3;EM;Hg;t;IE
IT;2A3;EM;IxP;t;NA
IT;2A3;EM;NH3;kt;NA
IT;2A3;EM;NMVOC;kt;NA
IT;2A3;EM;NOx;kt;NA
IT;2A3;EM;Ni;t;NA
IT;2A3;EM;PAH4;t;NA
IT;2A3;EM;PCB;t;NA
IT;2A3;EM;PCDD/F;t;NA
IT;2A3;EM;PM10;kt;IE
IT;2A3;EM;PM2.5;kt;IE
IT;2A3;EM;Pb;t;IE
IT;2A3;EM;SO2;kt;NA
IT;2A3;EM;Se;t;NA
IT;2A3;EM;TSP;kt;IE
IT;2A3;EM;Zn;t;NA
IT;2A5a;EM;As;t;NA
IT;2A5a;EM;BC;kt;NE
IT;2A5a;EM;BaP;t;NA
IT;2A5a;EM;BbF;t;NA
IT;2A5a;EM;BkF;t;NA
IT;2A5a;EM;CO;kt;NA
IT;2A5a;EM;Cd;t;NA
IT;2A5a;EM;Cr;t;NA
IT;2A5a;EM;Cu;t;NA
IT;2A5a;EM;HCB;t;NA
IT;2A5a;EM;Hg;t;NA
IT;2A5a;EM;IxP;t;NA
IT;2A5a;EM;NH3;kt;NA
IT;2A5a;EM;NMVOC;kt;NA
IT;2A5a;EM;NOx;kt;NA
IT;2A5a;EM;Ni;t;NA
IT;2A5a;EM;PAH4;t;NA
IT;2A5a;EM;PCB;t;NA
IT;2A5a;EM;PCDD/F;t;NA
IT;2A5a;EM;PM10;kt;17,315677046397184
IT;2A5a;EM;PM2.5;kt;1,7315677046397184
IT;2A5a;EM;Pb;t;NA
IT;2A5a;EM;SO2;kt;NA
IT;2A5a;EM;Se;t;NA
IT;2A5a;EM;TSP;kt;35,32398117465025
IT;2A5a;EM;Zn;t;NA
IT;2A5b;EM;As;t;NA
IT;2A5b;EM;BC;kt;NE
IT;2A5b;EM;BaP;t;NA
IT;2A5b;EM;BbF;t;NA
IT;2A5b;EM;BkF;t;NA
IT;2A5b;EM;CO;kt;NA
IT;2A5b;EM;Cd;t;NA
IT;2A5b;EM;Cr;t;NA
IT;2A5b;EM;Cu;t;NA
IT;2A5b;EM;HCB;t;NA
IT;2A5b;EM;Hg;t;NA
IT;2A5b;EM;IxP;t;NA
IT;2A5b;EM;NH3;kt;NA
IT;2A5b;EM;NMVOC;kt;NA
IT;2A5b;EM;NOx;kt;NA
IT;2A5b;EM;Ni;t;NA
IT;2A5b;EM;PAH4;t;NA
IT;2A5b;EM;PCB;t;NA
IT;2A5b;EM;PCDD/F;t;NA
IT;2A5b;EM;PM10;kt;13,084838355357242
IT;2A5b;EM;PM2.5;kt;1,3084838355357242
IT;2A5b;EM;Pb;t;NA
IT;2A5b;EM;SO2;kt;NA
IT;2A5b;EM;Se;t;NA
IT;2A5b;EM;TSP;kt;43,452689933679515
IT;2A5b;EM;Zn;t;NA
IT;2A5c;EM;As;t;NA
IT;2A5c;EM;BC;kt;IE
IT;2A5c;EM;BaP;t;NA
IT;2A5c;EM;BbF;t;NA
IT;2A5c;EM;BkF;t;NA
IT;2A5c;EM;CO;kt;NA
IT;2A5c;EM;Cd;t;NA
IT;2A5c;EM;Cr;t;NA
IT;2A5c;EM;Cu;t;NA
IT;2A5c;EM;HCB;t;NA
IT;2A5c;EM;Hg;t;NA
IT;2A5c;EM;IxP;t;NA
IT;2A5c;EM;NH3;kt;NA
IT;2A5c;EM;NMVOC;kt;NA
IT;2A5c;EM;NOx;kt;NA
IT;2A5c;EM;Ni;t;NA
IT;2A5c;EM;PAH4;t;NA
IT;2A5c;EM;PCB;t;NA
IT;2A5c;EM;PCDD/F;t;NA
IT;2A5c;EM;PM10;kt;IE
IT;2A5c;EM;PM2.5;kt;IE
IT;2A5c;EM;Pb;t;NA
IT;2A5c;EM;SO2;kt;NA
IT;2A5c;EM;Se;t;NA
IT;2A5c;EM;TSP;kt;IE
IT;2A5c;EM;Zn;t;NA
IT;2A6;EM;As;t;NO
IT;2A6;EM;BC;kt;NO
IT;2A6;EM;BaP;t;NO
IT;2A6;EM;BbF;t;NO
IT;2A6;EM;BkF;t;NO
IT;2A6;EM;CO;kt;NO
IT;2A6;EM;Cd;t;NO
IT;2A6;EM;Cr;t;NO
IT;2A6;EM;Cu;t;NO
IT;2A6;EM;HCB;t;NO
IT;2A6;EM;Hg;t;NO
IT;2A6;EM;IxP;t;NO
IT;2A6;EM;NH3;kt;NO
IT;2A6;EM;NMVOC;kt;NO
IT;2A6;EM;NOx;kt;NO
IT;2A6;EM;Ni;t;NO
IT;2A6;EM;PAH4;t;NO
IT;2A6;EM;PCB;t;NO
IT;2A6;EM;PCDD/F;t;NO
IT;2A6;EM;PM10;kt;NO
IT;2A6;EM;PM2.5;kt;NO
IT;2A6;EM;Pb;t;NO
IT;2A6;EM;SO2;kt;NO
IT;2A6;EM;Se;t;NO
IT;2A6;EM;TSP;kt;NO
IT;2A6;EM;Zn;t;NO
IT;2B1;EM;As;t;NA
IT;2B1;EM;BC;kt;NA
IT;2B1;EM;BaP;t;NA
IT;2B1;EM;BbF;t;NA
IT;2B1;EM;BkF;t;NA
IT;2B1;EM;CO;kt;0,03007362298387097
IT;2B1;EM;Cd;t;NA
IT;2B1;EM;Cr;t;NA
IT;2B1;EM;Cu;t;NA
IT;2B1;EM;HCB;t;NA
IT;2B1;EM;Hg;t;NA
IT;2B1;EM;IxP;t;NA
IT;2B1;EM;NH3;kt;0,0036383903417499946
IT;2B1;EM;NMVOC;kt;0,036383903417499946
IT;2B1;EM;NOx;kt;0,087884
IT;2B1;EM;Ni;t;NA
IT;2B1;EM;PAH4;t;NA
IT;2B1;EM;PCB;t;NA
IT;2B1;EM;PCDD/F;t;NA
IT;2B1;EM;PM10;kt;NA
IT;2B1;EM;PM2.5;kt;NA
IT;2B1;EM;Pb;t;NA
IT;2B1;EM;SO2;kt;0,003905665322580645
IT;2B1;EM;Se;t;NA
IT;2B1;EM;TSP;kt;NA
IT;2B1;EM;Zn;t;NA
IT;2B10a;EM;As;t;NA
IT;2B10a;EM;BC;kt;0,0018957997451781012
IT;2B10a;EM;BaP;t;NA
IT;2B10a;EM;BbF;t;NA
IT;2B10a;EM;BkF;t;NA
IT;2B10a;EM;CO;kt;11,784399581781926
IT;2B10a;EM;Cd;t;0,0426385
IT;2B10a;EM;Cr;t;NA
IT;2B10a;EM;Cu;t;NA
IT;2B10a;EM;HCB;t;NA
IT;2B10a;EM;Hg;t;NA
IT;2B10a;EM;IxP;t;NA
IT;2B10a;EM;NH3;kt;0,04640413163999126
IT;2B10a;EM;NMVOC;kt;1,5383028046706908
IT;2B10a;EM;NOx;kt;2,1660437505871406
IT;2B10a;EM;Ni;t;NA
IT;2B10a;EM;PAH4;t;NA
IT;2B10a;EM;PCB;t;NA
IT;2B10a;EM;PCDD/F;t;NA
IT;2B10a;EM;PM10;kt;0,27827965391632115
IT;2B10a;EM;PM2.5;kt;0,10532220806545009
IT;2B10a;EM;Pb;t;NA
IT;2B10a;EM;SO2;kt;5,201435642098049
IT;2B10a;EM;Se;t;NA
IT;2B10a;EM;TSP;kt;0,3975423627376017
IT;2B10a;EM;Zn;t;NA
IT;2B10b;EM;As;t;NA
IT;2B10b;EM;BC;kt;NA
IT;2B10b;EM;BaP;t;NA
IT;2B10b;EM;BbF;t;NA
IT;2B10b;EM;BkF;t;NA
IT;2B10b;EM;CO;kt;NA
IT;2B10b;EM;Cd;t;NA
IT;2B10b;EM;Cr;t;NA
IT;2B10b;EM;Cu;t;NA
IT;2B10b;EM;HCB;t;NA
IT;2B10b;EM;Hg;t;NA
IT;2B10b;EM;IxP;t;NA
IT;2B10b;EM;NH3;kt;NA
IT;2B10b;EM;NMVOC;kt;NA
IT;2B10b;EM;NOx;kt;NA
IT;2B10b;EM;Ni;t;NA
IT;2B10b;EM;PAH4;t;NA
IT;2B10b;EM;PCB;t;NA
IT;2B10b;EM;PCDD/F;t;NA
IT;2B10b;EM;PM10;kt;NA
IT;2B10b;EM;PM2.5;kt;NA
IT;2B10b;EM;Pb;t;NA
IT;2B10b;EM;SO2;kt;NA
IT;2B10b;EM;Se;t;NA
IT;2B10b;EM;TSP;kt;NA
IT;2B10b;EM;Zn;t;NA
IT;2B2;EM;As;t;NA
IT;2B2;EM;BC;kt;NA
IT;2B2;EM;BaP;t;NA
IT;2B2;EM;BbF;t;NA
IT;2B2;EM;BkF;t;NA
IT;2B2;EM;CO;kt;NA
IT;2B2;EM;Cd;t;NA
IT;2B2;EM;Cr;t;NA
IT;2B2;EM;Cu;t;NA
IT;2B2;EM;HCB;t;NA
IT;2B2;EM;Hg;t;NA
IT;2B2;EM;IxP;t;NA
IT;2B2;EM;NH3;kt;0,002039257942996709
IT;2B2;EM;NMVOC;kt;NA
IT;2B2;EM;NOx;kt;0,26877437218568256
IT;2B2;EM;Ni;t;NA
IT;2B2;EM;PAH4;t;NA
IT;2B2;EM;PCB;t;NA
IT;2B2;EM;PCDD/F;t;NA
IT;2B2;EM;PM10;kt;NA
IT;2B2;EM;PM2.5;kt;NA
IT;2B2;EM;Pb;t;NA
IT;2B2;EM;SO2;kt;NA
IT;2B2;EM;Se;t;NA
IT;2B2;EM;TSP;kt;NA
IT;2B2;EM;Zn;t;NA
IT;2B3;EM;As;t;NA
IT;2B3;EM;BC;kt;NA
IT;2B3;EM;BaP;t;NA
IT;2B3;EM;BbF;t;NA
IT;2B3;EM;BkF;t;NA
IT;2B3;EM;CO;kt;NA
IT;2B3;EM;Cd;t;NA
IT;2B3;EM;Cr;t;NA
IT;2B3;EM;Cu;t;NA
IT;2B3;EM;HCB;t;NA
IT;2B3;EM;Hg;t;NA
IT;2B3;EM;IxP;t;NA
IT;2B3;EM;NH3;kt;NA
IT;2B3;EM;NMVOC;kt;NA
IT;2B3;EM;NOx;kt;0,02300010719501398
IT;2B3;EM;Ni;t;NA
IT;2B3;EM;PAH4;t;NA
IT;2B3;EM;PCB;t;NA
IT;2B3;EM;PCDD/F;t;NA
IT;2B3;EM;PM10;kt;NA
IT;2B3;EM;PM2.5;kt;NA
IT;2B3;EM;Pb;t;NA
IT;2B3;EM;SO2;kt;NA
IT;2B3;EM;Se;t;NA
IT;2B3;EM;TSP;kt;NA
IT;2B3;EM;Zn;t;NA
IT;2B5;EM;As;t;NO
IT;2B5;EM;BC;kt;NO
IT;2B5;EM;BaP;t;NO
IT;2B5;EM;BbF;t;NO
IT;2B5;EM;BkF;t;NO
IT;2B5;EM;CO;kt;NO
IT;2B5;EM;Cd;t;NO
IT;2B5;EM;Cr;t;NO
IT;2B5;EM;Cu;t;NO
IT;2B5;EM;HCB;t;NO
IT;2B5;EM;Hg;t;NO
IT;2B5;EM;IxP;t;NO
IT;2B5;EM;NH3;kt;NO
IT;2B5;EM;NMVOC;kt;NO
IT;2B5;EM;NOx;kt;NO
IT;2B5;EM;Ni;t;NO
IT;2B5;EM;PAH4;t;NO
IT;2B5;EM;PCB;t;NO
IT;2B5;EM;PCDD/F;t;NO
IT;2B5;EM;PM10;kt;NO
IT;2B5;EM;PM2.5;kt;NO
IT;2B5;EM;Pb;t;NO
IT;2B5;EM;SO2;kt;NO
IT;2B5;EM;Se;t;NO
IT;2B5;EM;TSP;kt;NO
IT;2B5;EM;Zn;t;NO
IT;2B6;EM;As;t;NA
IT;2B6;EM;BC;kt;3,391396717964491e-05
IT;2B6;EM;BaP;t;NA
IT;2B6;EM;BbF;t;NA
IT;2B6;EM;BkF;t;NA
IT;2B6;EM;CO;kt;NA
IT;2B6;EM;Cd;t;NA
IT;2B6;EM;Cr;t;NA
IT;2B6;EM;Cu;t;NA
IT;2B6;EM;HCB;t;NA
IT;2B6;EM;Hg;t;NA
IT;2B6;EM;IxP;t;NA
IT;2B6;EM;NH3;kt;NA
IT;2B6;EM;NMVOC;kt;NA
IT;2B6;EM;NOx;kt;0,020695
IT;2B6;EM;Ni;t;NA
IT;2B6;EM;PAH4;t;NA
IT;2B6;EM;PCB;t;NA
IT;2B6;EM;PCDD/F;t;NA
IT;2B6;EM;PM10;kt;0,0020934547641756115
IT;2B6;EM;PM2.5;kt;0,0018841092877580506
IT;2B6;EM;Pb;t;NA
IT;2B6;EM;SO2;kt;0,13744999999999996
IT;2B6;EM;Se;t;NA
IT;2B6;EM;TSP;kt;0,0029906496631080166
IT;2B6;EM;Zn;t;NA
IT;2B7;EM;As;t;NA
IT;2B7;EM;BC;kt;0,00037793213047885237
IT;2B7;EM;BaP;t;NA
IT;2B7;EM;BbF;t;NA
IT;2B7;EM;BkF;t;NA
IT;2B7;EM;CO;kt;10,9641526677106
IT;2B7;EM;Cd;t;NA
IT;2B7;EM;Cr;t;NA
IT;2B7;EM;Cu;t;NA
IT;2B7;EM;HCB;t;NA
IT;2B7;EM;Hg;t;NA
IT;2B7;EM;IxP;t;NA
IT;2B7;EM;NH3;kt;0,23883882781920499
IT;2B7;EM;NMVOC;kt;NA
IT;2B7;EM;NOx;kt;0,144173192974299
IT;2B7;EM;Ni;t;NA
IT;2B7;EM;PAH4;t;NA
IT;2B7;EM;PCB;t;NA
IT;2B7;EM;PCDD/F;t;NA
IT;2B7;EM;PM10;kt;0,024329143856719297
IT;2B7;EM;PM2.5;kt;0,021996229471047398
IT;2B7;EM;Pb;t;NA
IT;2B7;EM;SO2;kt;0,153762455530302
IT;2B7;EM;Se;t;NA
IT;2B7;EM;TSP;kt;0,034755919795313284
IT;2B7;EM;Zn;t;NA
IT;2C1;EM;As;t;0,054185959784999994
IT;2C1;EM;BC;kt;0,011217961684476696
IT;2C1;EM;BaP;t;NE
IT;2C1;EM;BbF;t;NE
IT;2C1;EM;BkF;t;NE
IT;2C1;EM;CO;kt;39,714309999870004
IT;2C1;EM;Cd;t;0,9184852782202473
IT;2C1;EM;Cr;t;8,479300573734001
IT;2C1;EM;Cu;t;5,614472448272317
IT;2C1;EM;HCB;t;IE
IT;2C1;EM;Hg;t;2,73539919539627
IT;2C1;EM;IxP;t;NE
IT;2C1;EM;NH3;kt;NA
IT;2C1;EM;NMVOC;kt;2,9869382348079987
IT;2C1;EM;NOx;kt;2,3075945083964267
IT;2C1;EM;Ni;t;3,659848993627357
IT;2C1;EM;PAH4;t;7,42198113674042
IT;2C1;EM;PCB;t;77,7564
IT;2C1;EM;PCDD/F;t;80,94551193045001
IT;2C1;EM;PM10;kt;3,6559441079007238
IT;2C1;EM;PM2.5;kt;3,0641756062726344
IT;2C1;EM;Pb;t;62,974852645093755
IT;2C1;EM;SO2;kt;1,2339743081538437
IT;2C1;EM;Se;t;0,9197271260070001
IT;2C1;EM;TSP;kt;4,5699301348759045
IT;2C1;EM;Zn;t;583,4181327115398
IT;2C2;EM;As;t;NA
IT;2C2;EM;BC;kt;NO
IT;2C2;EM;BaP;t;NA
IT;2C2;EM;BbF;t;NA
IT;2C2;EM;BkF;t;NA
IT;2C2;EM;CO;kt;NO
IT;2C2;EM;Cd;t;NA
IT;2C2;EM;Cr;t;NA
IT;2C2;EM;Cu;t;NA
IT;2C2;EM;HCB;t;NA
IT;2C2;EM;Hg;t;NO
IT;2C2;EM;IxP;t;NA
IT;2C2;EM;NH3;kt;NA
IT;2C2;EM;NMVOC;kt;NA
IT;2C2;EM;NOx;kt;NO
IT;2C2;EM;Ni;t;NA
IT;2C2;EM;PAH4;t;NA
IT;2C2;EM;PCB;t;NA
IT;2C2;EM;PCDD/F;t;NA
IT;2C2;EM;PM10;kt;NO
IT;2C2;EM;PM2.5;kt;NO
IT;2C2;EM;Pb;t;NA
IT;2C2;EM;SO2;kt;NO
IT;2C2;EM;Se;t;NA
IT;2C2;EM;TSP;kt;NO
IT;2C2;EM;Zn;t;NA
IT;2C3;EM;As;t;NO
IT;2C3;EM;BC;kt;IE
IT;2C3;EM;BaP;t;NO
IT;2C3;EM;BbF;t;NO
IT;2C3;EM;BkF;t;NO
IT;2C3;EM;CO;kt;NO
IT;2C3;EM;Cd;t;NO
IT;2C3;EM;Cr;t;NO
IT;2C3;EM;Cu;t;NO
IT;2C3;EM;HCB;t;IE
IT;2C3;EM;Hg;t;NA
IT;2C3;EM;IxP;t;NO
IT;2C3;EM;NH3;kt;NO
IT;2C3;EM;NMVOC;kt;NO
IT;2C3;EM;NOx;kt;NO
IT;2C3;EM;Ni;t;NO
IT;2C3;EM;PAH4;t;NO
IT;2C3;EM;PCB;t;IE
IT;2C3;EM;PCDD/F;t;IE
IT;2C3;EM;PM10;kt;IE
IT;2C3;EM;PM2.5;kt;IE
IT;2C3;EM;Pb;t;NO
IT;2C3;EM;SO2;kt;NO
IT;2C3;EM;Se;t;NO
IT;2C3;EM;TSP;kt;IE
IT;2C3;EM;Zn;t;NO
IT;2C4;EM;As;t;NA
IT;2C4;EM;BC;kt;NA
IT;2C4;EM;BaP;t;NA
IT;2C4;EM;BbF;t;NA
IT;2C4;EM;BkF;t;NA
IT;2C4;EM;CO;kt;NA
IT;2C4;EM;Cd;t;NA
IT;2C4;EM;Cr;t;NA
IT;2C4;EM;Cu;t;NA
IT;2C4;EM;HCB;t;NA
IT;2C4;EM;Hg;t;NO
IT;2C4;EM;IxP;t;NA
IT;2C4;EM;NH3;kt;NA
IT;2C4;EM;NMVOC;kt;NA
IT;2C4;EM;NOx;kt;NA
IT;2C4;EM;Ni;t;NA
IT;2C4;EM;PAH4;t;NA
IT;2C4;EM;PCB;t;NA
IT;2C4;EM;PCDD/F;t;NA
IT;2C4;EM;PM10;kt;NA
IT;2C4;EM;PM2.5;kt;NA
IT;2C4;EM;Pb;t;NA
IT;2C4;EM;SO2;kt;NA
IT;2C4;EM;Se;t;NA
IT;2C4;EM;TSP;kt;NA
IT;2C4;EM;Zn;t;NA
IT;2C5;EM;As;t;NA
IT;2C5;EM;BC;kt;IE
IT;2C5;EM;BaP;t;NA
IT;2C5;EM;BbF;t;NA
IT;2C5;EM;BkF;t;NA
IT;2C5;EM;CO;kt;NA
IT;2C5;EM;Cd;t;NA
IT;2C5;EM;Cr;t;NA
IT;2C5;EM;Cu;t;NA
IT;2C5;EM;HCB;t;IE
IT;2C5;EM;Hg;t;NA
IT;2C5;EM;IxP;t;NA
IT;2C5;EM;NH3;kt;NA
IT;2C5;EM;NMVOC;kt;NA
IT;2C5;EM;NOx;kt;NA
IT;2C5;EM;Ni;t;NA
IT;2C5;EM;PAH4;t;NA
IT;2C5;EM;PCB;t;IE
IT;2C5;EM;PCDD/F;t;IE
IT;2C5;EM;PM10;kt;IE
IT;2C5;EM;PM2.5;kt;IE
IT;2C5;EM;Pb;t;IE
IT;2C5;EM;SO2;kt;IE
IT;2C5;EM;Se;t;NA
IT;2C5;EM;TSP;kt;IE
IT;2C5;EM;Zn;t;NA
IT;2C6;EM;As;t;NA
IT;2C6;EM;BC;kt;IE
IT;2C6;EM;BaP;t;NA
IT;2C6;EM;BbF;t;NA
IT;2C6;EM;BkF;t;NA
IT;2C6;EM;CO;kt;NA
IT;2C6;EM;Cd;t;IE
IT;2C6;EM;Cr;t;NA
IT;2C6;EM;Cu;t;NA
IT;2C6;EM;HCB;t;IE
IT;2C6;EM;Hg;t;IE
IT;2C6;EM;IxP;t;NA
IT;2C6;EM;NH3;kt;NA
IT;2C6;EM;NMVOC;kt;NA
IT;2C6;EM;NOx;kt;NA
IT;2C6;EM;Ni;t;NA
IT;2C6;EM;PAH4;t;NA
IT;2C6;EM;PCB;t;IE
IT;2C6;EM;PCDD/F;t;IE
IT;2C6;EM;PM10;kt;IE
IT;2C6;EM;PM2.5;kt;IE
IT;2C6;EM;Pb;t;NA
IT;2C6;EM;SO2;kt;IE
IT;2C6;EM;Se;t;NA
IT;2C6;EM;TSP;kt;IE
IT;2C6;EM;Zn;t;NA
IT;2C7a;EM;As;t;NA
IT;2C7a;EM;BC;kt;IE
IT;2C7a;EM;BaP;t;NA
IT;2C7a;EM;BbF;t;NA
IT;2C7a;EM;BkF;t;NA
IT;2C7a;EM;CO;kt;NA
IT;2C7a;EM;Cd;t;IE
IT;2C7a;EM;Cr;t;NA
IT;2C7a;EM;Cu;t;NA
IT;2C7a;EM;HCB;t;IE
IT;2C7a;EM;Hg;t;NA
IT;2C7a;EM;IxP;t;NA
IT;2C7a;EM;NH3;kt;NA
IT;2C7a;EM;NMVOC;kt;NA
IT;2C7a;EM;NOx;kt;NA
IT;2C7a;EM;Ni;t;NA
IT;2C7a;EM;PAH4;t;NA
IT;2C7a;EM;PCB;t;IE
IT;2C7a;EM;PCDD/F;t;IE
IT;2C7a;EM;PM10;kt;IE
IT;2C7a;EM;PM2.5;kt;IE
IT;2C7a;EM;Pb;t;IE
IT;2C7a;EM;SO2;kt;IE
IT;2C7a;EM;Se;t;NA
IT;2C7a;EM;TSP;kt;IE
IT;2C7a;EM;Zn;t;NA
IT;2C7b;EM;As;t;NO
IT;2C7b;EM;BC;kt;NO
IT;2C7b;EM;BaP;t;NO
IT;2C7b;EM;BbF;t;NO
IT;2C7b;EM;BkF;t;NO
IT;2C7b;EM;CO;kt;NO
IT;2C7b;EM;Cd;t;NO
IT;2C7b;EM;Cr;t;NO
IT;2C7b;EM;Cu;t;NO
IT;2C7b;EM;HCB;t;NO
IT;2C7b;EM;Hg;t;NO
IT;2C7b;EM;IxP;t;NO
IT;2C7b;EM;NH3;kt;NO
IT;2C7b;EM;NMVOC;kt;NO
IT;2C7b;EM;NOx;kt;NO
IT;2C7b;EM;Ni;t;NO
IT;2C7b;EM;PAH4;t;NO
IT;2C7b;EM;PCB;t;NO
IT;2C7b;EM;PCDD/F;t;NO
IT;2C7b;EM;PM10;kt;NO
IT;2C7b;EM;PM2.5;kt;NO
IT;2C7b;EM;Pb;t;NO
IT;2C7b;EM;SO2;kt;NO
IT;2C7b;EM;Se;t;NO
IT;2C7b;EM;TSP;kt;NO
IT;2C7b;EM;Zn;t;NO
IT;2C7c;EM;As;t;NO
IT;2C7c;EM;BC;kt;NA
IT;2C7c;EM;BaP;t;NO
IT;2C7c;EM;BbF;t;NO
IT;2C7c;EM;BkF;t;NO
IT;2C7c;EM;CO;kt;NO
IT;2C7c;EM;Cd;t;NO
IT;2C7c;EM;Cr;t;NO
IT;2C7c;EM;Cu;t;NO
IT;2C7c;EM;HCB;t;NO
IT;2C7c;EM;Hg;t;NO
IT;2C7c;EM;IxP;t;NO
IT;2C7c;EM;NH3;kt;NO
IT;2C7c;EM;NMVOC;kt;NO
IT;2C7c;EM;NOx;kt;NO
IT;2C7c;EM;Ni;t;NO
IT;2C7c;EM;PAH4;t;NO
IT;2C7c;EM;PCB;t;NO
IT;2C7c;EM;PCDD/F;t;NO
IT;2C7c;EM;PM10;kt;NO
IT;2C7c;EM;PM2.5;kt;NO
IT;2C7c;EM;Pb;t;NO
IT;2C7c;EM;SO2;kt;NO
IT;2C7c;EM;Se;t;NO
IT;2C7c;EM;TSP;kt;NO
IT;2C7c;EM;Zn;t;NO
IT;2C7d;EM;As;t;NA
IT;2C7d;EM;BC;kt;NA
IT;2C7d;EM;BaP;t;NA
IT;2C7d;EM;BbF;t;NA
IT;2C7d;EM;BkF;t;NA
IT;2C7d;EM;CO;kt;NA
IT;2C7d;EM;Cd;t;NA
IT;2C7d;EM;Cr;t;NA
IT;2C7d;EM;Cu;t;NA
IT;2C7d;EM;HCB;t;NA
IT;2C7d;EM;Hg;t;NA
IT;2C7d;EM;IxP;t;NA
IT;2C7d;EM;NH3;kt;NA
IT;2C7d;EM;NMVOC;kt;NA
IT;2C7d;EM;NOx;kt;NA
IT;2C7d;EM;Ni;t;NA
IT;2C7d;EM;PAH4;t;NA
IT;2C7d;EM;PCB;t;NA
IT;2C7d;EM;PCDD/F;t;NA
IT;2C7d;EM;PM10;kt;NA
IT;2C7d;EM;PM2.5;kt;NA
IT;2C7d;EM;Pb;t;NA
IT;2C7d;EM;SO2;kt;NA
IT;2C7d;EM;Se;t;NA
IT;2C7d;EM;TSP;kt;NA
IT;2C7d;EM;Zn;t;NA
IT;2D3a;EM;As;t;NA
IT;2D3a;EM;BC;kt;NA
IT;2D3a;EM;BaP;t;NA
IT;2D3a;EM;BbF;t;NA
IT;2D3a;EM;BkF;t;NA
IT;2D3a;EM;CO;kt;NA
IT;2D3a;EM;Cd;t;NA
IT;2D3a;EM;Cr;t;NA
IT;2D3a;EM;Cu;t;NA
IT;2D3a;EM;HCB;t;NA
IT;2D3a;EM;Hg;t;NA
IT;2D3a;EM;IxP;t;NA
IT;2D3a;EM;NH3;kt;NA
IT;2D3a;EM;NMVOC;kt;97,6410407584948
IT;2D3a;EM;NOx;kt;NA
IT;2D3a;EM;Ni;t;NA
IT;2D3a;EM;PAH4;t;NA
IT;2D3a;EM;PCB;t;NA
IT;2D3a;EM;PCDD/F;t;NA
IT;2D3a;EM;PM10;kt;NA
IT;2D3a;EM;PM2.5;kt;NA
IT;2D3a;EM;Pb;t;NA
IT;2D3a;EM;SO2;kt;NA
IT;2D3a;EM;Se;t;NA
IT;2D3a;EM;TSP;kt;NA
IT;2D3a;EM;Zn;t;NA
IT;2D3b;EM;As;t;NA
IT;2D3b;EM;BC;kt;0,014223643200000002
IT;2D3b;EM;BaP;t;NA
IT;2D3b;EM;BbF;t;NA
IT;2D3b;EM;BkF;t;NA
IT;2D3b;EM;CO;kt;NA
IT;2D3b;EM;Cd;t;NA
IT;2D3b;EM;Cr;t;NA
IT;2D3b;EM;Cu;t;NA
IT;2D3b;EM;HCB;t;NA
IT;2D3b;EM;Hg;t;NA
IT;2D3b;EM;IxP;t;NA
IT;2D3b;EM;NH3;kt;NA
IT;2D3b;EM;NMVOC;kt;0,4992
IT;2D3b;EM;NOx;kt;NA
IT;2D3b;EM;Ni;t;NA
IT;2D3b;EM;PAH4;t;NA
IT;2D3b;EM;PCB;t;NA
IT;2D3b;EM;PCDD/F;t;NA
IT;2D3b;EM;PM10;kt;1,872
IT;2D3b;EM;PM2.5;kt;0,2495376
IT;2D3b;EM;Pb;t;NA
IT;2D3b;EM;SO2;kt;NA
IT;2D3b;EM;Se;t;NA
IT;2D3b;EM;TSP;kt;1,872
IT;2D3b;EM;Zn;t;NA
IT;2D3c;EM;As;t;NA
IT;2D3c;EM;BC;kt;1,3917696000000002e-06
IT;2D3c;EM;BaP;t;NA
IT;2D3c;EM;BbF;t;NA
IT;2D3c;EM;BkF;t;NA
IT;2D3c;EM;CO;kt;0,00496128
IT;2D3c;EM;Cd;t;NA
IT;2D3c;EM;Cr;t;NA
IT;2D3c;EM;Cu;t;NA
IT;2D3c;EM;HCB;t;NA
IT;2D3c;EM;Hg;t;NA
IT;2D3c;EM;IxP;t;NA
IT;2D3c;EM;NH3;kt;NA
IT;2D3c;EM;NMVOC;kt;0,011097599999999999
IT;2D3c;EM;NOx;kt;NA
IT;2D3c;EM;Ni;t;NA
IT;2D3c;EM;PAH4;t;NA
IT;2D3c;EM;PCB;t;NA
IT;2D3c;EM;PCDD/F;t;NA
IT;2D3c;EM;PM10;kt;0,053529600000000004
IT;2D3c;EM;PM2.5;kt;0,01070592
IT;2D3c;EM;Pb;t;NA
IT;2D3c;EM;SO2;kt;NA
IT;2D3c;EM;Se;t;NA
IT;2D3c;EM;TSP;kt;0,053529600000000004
IT;2D3c;EM;Zn;t;NA
IT;2D3d;EM;As;t;NA
IT;2D3d;EM;BC;kt;NA
IT;2D3d;EM;BaP;t;NA
IT;2D3d;EM;BbF;t;NA
IT;2D3d;EM;BkF;t;NA
IT;2D3d;EM;CO;kt;NA
IT;2D3d;EM;Cd;t;NA
IT;2D3d;EM;Cr;t;NA
IT;2D3d;EM;Cu;t;NA
IT;2D3d;EM;HCB;t;NA
IT;2D3d;EM;Hg;t;NA
IT;2D3d;EM;IxP;t;NA
IT;2D3d;EM;NH3;kt;NA
IT;2D3d;EM;NMVOC;kt;123,50222610415015
IT;2D3d;EM;NOx;kt;NA
IT;2D3d;EM;Ni;t;NA
IT;2D3d;EM;PAH4;t;NA
IT;2D3d;EM;PCB;t;NA
IT;2D3d;EM;PCDD/F;t;NA
IT;2D3d;EM;PM10;kt;NA
IT;2D3d;EM;PM2.5;kt;NA
IT;2D3d;EM;Pb;t;NA
IT;2D3d;EM;SO2;kt;NA
IT;2D3d;EM;Se;t;NA
IT;2D3d;EM;TSP;kt;NA
IT;2D3d;EM;Zn;t;NA
IT;2D3e;EM;As;t;NA
IT;2D3e;EM;BC;kt;NA
IT;2D3e;EM;BaP;t;NA
IT;2D3e;EM;BbF;t;NA
IT;2D3e;EM;BkF;t;NA
IT;2D3e;EM;CO;kt;NA
IT;2D3e;EM;Cd;t;NA
IT;2D3e;EM;Cr;t;NA
IT;2D3e;EM;Cu;t;NA
IT;2D3e;EM;HCB;t;NA
IT;2D3e;EM;Hg;t;NA
IT;2D3e;EM;IxP;t;NA
IT;2D3e;EM;NH3;kt;NA
IT;2D3e;EM;NMVOC;kt;9,274383488229798
IT;2D3e;EM;NOx;kt;NA
IT;2D3e;EM;Ni;t;NA
IT;2D3e;EM;PAH4;t;NA
IT;2D3e;EM;PCB;t;NA
IT;2D3e;EM;PCDD/F;t;NA
IT;2D3e;EM;PM10;kt;NA
IT;2D3e;EM;PM2.5;kt;NA
IT;2D3e;EM;Pb;t;NA
IT;2D3e;EM;SO2;kt;NA
IT;2D3e;EM;Se;t;NA
IT;2D3e;EM;TSP;kt;NA
IT;2D3e;EM;Zn;t;NA
IT;2D3f;EM;As;t;NA
IT;2D3f;EM;BC;kt;NA
IT;2D3f;EM;BaP;t;NA
IT;2D3f;EM;BbF;t;NA
IT;2D3f;EM;BkF;t;NA
IT;2D3f;EM;CO;kt;NA
IT;2D3f;EM;Cd;t;NA
IT;2D3f;EM;Cr;t;NA
IT;2D3f;EM;Cu;t;NA
IT;2D3f;EM;HCB;t;NA
IT;2D3f;EM;Hg;t;NA
IT;2D3f;EM;IxP;t;NA
IT;2D3f;EM;NH3;kt;NA
IT;2D3f;EM;NMVOC;kt;3,09
IT;2D3f;EM;NOx;kt;NA
IT;2D3f;EM;Ni;t;NA
IT;2D3f;EM;PAH4;t;NA
IT;2D3f;EM;PCB;t;NA
IT;2D3f;EM;PCDD/F;t;NA
IT;2D3f;EM;PM10;kt;NA
IT;2D3f;EM;PM2.5;kt;NA
IT;2D3f;EM;Pb;t;NA
IT;2D3f;EM;SO2;kt;NA
IT;2D3f;EM;Se;t;NA
IT;2D3f;EM;TSP;kt;NA
IT;2D3f;EM;Zn;t;NA
IT;2D3g;EM;As;t;NA
IT;2D3g;EM;BC;kt;NA
IT;2D3g;EM;BaP;t;NE
IT;2D3g;EM;BbF;t;NE
IT;2D3g;EM;BkF;t;NE
IT;2D3g;EM;CO;kt;NA
IT;2D3g;EM;Cd;t;NA
IT;2D3g;EM;Cr;t;NA
IT;2D3g;EM;Cu;t;NA
IT;2D3g;EM;HCB;t;NA
IT;2D3g;EM;Hg;t;NA
IT;2D3g;EM;IxP;t;NE
IT;2D3g;EM;NH3;kt;NA
IT;2D3g;EM;NMVOC;kt;52,093479117161436
IT;2D3g;EM;NOx;kt;NA
IT;2D3g;EM;Ni;t;NA
IT;2D3g;EM;PAH4;t;NE
IT;2D3g;EM;PCB;t;NA
IT;2D3g;EM;PCDD/F;t;NA
IT;2D3g;EM;PM10;kt;0,009253332235825425
IT;2D3g;EM;PM2.5;kt;0,006939999176869069
IT;2D3g;EM;Pb;t;NA
IT;2D3g;EM;SO2;kt;NA
IT;2D3g;EM;Se;t;NA
IT;2D3g;EM;TSP;kt;0,01156666529478178
IT;2D3g;EM;Zn;t;NA
IT;2D3h;EM;As;t;NA
IT;2D3h;EM;BC;kt;NA
IT;2D3h;EM;BaP;t;NA
IT;2D3h;EM;BbF;t;NA
IT;2D3h;EM;BkF;t;NA
IT;2D3h;EM;CO;kt;NA
IT;2D3h;EM;Cd;t;NA
IT;2D3h;EM;Cr;t;NA
IT;2D3h;EM;Cu;t;NA
IT;2D3h;EM;HCB;t;NA
IT;2D3h;EM;Hg;t;NA
IT;2D3h;EM;IxP;t;NA
IT;2D3h;EM;NH3;kt;NA
IT;2D3h;EM;NMVOC;kt;18,413624082881388
IT;2D3h;EM;NOx;kt;NA
IT;2D3h;EM;Ni;t;NA
IT;2D3h;EM;PAH4;t;NA
IT;2D3h;EM;PCB;t;NA
IT;2D3h;EM;PCDD/F;t;NA
IT;2D3h;EM;PM10;kt;NA
IT;2D3h;EM;PM2.5;kt;NA
IT;2D3h;EM;Pb;t;NA
IT;2D3h;EM;SO2;kt;NA
IT;2D3h;EM;Se;t;NA
IT;2D3h;EM;TSP;kt;NA
IT;2D3h;EM;Zn;t;NA
IT;2D3i;EM;As;t;NA
IT;2D3i;EM;BC;kt;NA
IT;2D3i;EM;BaP;t;0,0045
IT;2D3i;EM;BbF;t;0,00225
IT;2D3i;EM;BkF;t;0,00225
IT;2D3i;EM;CO;kt;NA
IT;2D3i;EM;Cd;t;NA
IT;2D3i;EM;Cr;t;NA
IT;2D3i;EM;Cu;t;NA
IT;2D3i;EM;HCB;t;NA
IT;2D3i;EM;Hg;t;NA
IT;2D3i;EM;IxP;t;0,00225
IT;2D3i;EM;NH3;kt;NA
IT;2D3i;EM;NMVOC;kt;26,943627307120025
IT;2D3i;EM;NOx;kt;NA
IT;2D3i;EM;Ni;t;NA
IT;2D3i;EM;PAH4;t;0,01125
IT;2D3i;EM;PCB;t;NA
IT;2D3i;EM;PCDD/F;t;NA
IT;2D3i;EM;PM10;kt;3,4815819375
IT;2D3i;EM;PM2.5;kt;2,3210546250000004
IT;2D3i;EM;Pb;t;NA
IT;2D3i;EM;SO2;kt;NA
IT;2D3i;EM;Se;t;NA
IT;2D3i;EM;TSP;kt;4,2552668125
IT;2D3i;EM;Zn;t;NA
IT;2G ;EM;As;t;NA
IT;2G ;EM;BC;kt;NA
IT;2G ;EM;BaP;t;0,007775276939999999
IT;2G ;EM;BbF;t;NE
IT;2G ;EM;BkF;t;NE
IT;2G ;EM;CO;kt;3,91497038535
IT;2G ;EM;Cd;t;0,34473483372
IT;2G ;EM;Cr;t;NA
IT;2G ;EM;Cu;t;NA
IT;2G ;EM;HCB;t;NA
IT;2G ;EM;Hg;t;NA
IT;2G ;EM;IxP;t;NE
IT;2G ;EM;NH3;kt;0,290697291
IT;2G ;EM;NMVOC;kt;9,498621114981994
IT;2G ;EM;NOx;kt;0,12809833314
IT;2G ;EM;Ni;t;NA
IT;2G ;EM;PAH4;t;0,007775276939999999
IT;2G ;EM;PCB;t;NA
IT;2G ;EM;PCDD/F;t;0,007004754
IT;2G ;EM;PM10;kt;2,43990747888
IT;2G ;EM;PM2.5;kt;2,06847563466
IT;2G ;EM;Pb;t;6,069248976
IT;2G ;EM;SO2;kt;0,023378994780000002
IT;2G ;EM;Se;t;NA
IT;2G ;EM;TSP;kt;2,51662464387
IT;2G ;EM;Zn;t;NA
IT;2H1;EM;As;t;NA
IT;2H1;EM;BC;kt;NO
IT;2H1;EM;BaP;t;NA
IT;2H1;EM;BbF;t;NA
IT;2H1;EM;BkF;t;NA
IT;2H1;EM;CO;kt;NA
IT;2H1;EM;Cd;t;NA
IT;2H1;EM;Cr;t;NA
IT;2H1;EM;Cu;t;NA
IT;2H1;EM;HCB;t;NA
IT;2H1;EM;Hg;t;NA
IT;2H1;EM;IxP;t;NA
IT;2H1;EM;NH3;kt;NA
IT;2H1;EM;NMVOC;kt;1,335
IT;2H1;EM;NOx;kt;NO
IT;2H1;EM;Ni;t;NA
IT;2H1;EM;PAH4;t;NA
IT;2H1;EM;PCB;t;NA
IT;2H1;EM;PCDD/F;t;NA
IT;2H1;EM;PM10;kt;NO
IT;2H1;EM;PM2.5;kt;NO
IT;2H1;EM;Pb;t;NA
IT;2H1;EM;SO2;kt;NO
IT;2H1;EM;Se;t;NA
IT;2H1;EM;TSP;kt;NO
IT;2H1;EM;Zn;t;NA
IT;2H2;EM;As;t;NA
IT;2H2;EM;BC;kt;NA
IT;2H2;EM;BaP;t;NA
IT;2H2;EM;BbF;t;NA
IT;2H2;EM;BkF;t;NA
IT;2H2;EM;CO;kt;NA
IT;2H2;EM;Cd;t;NA
IT;2H2;EM;Cr;t;NA
IT;2H2;EM;Cu;t;NA
IT;2H2;EM;HCB;t;NA
IT;2H2;EM;Hg;t;NA
IT;2H2;EM;IxP;t;NA
IT;2H2;EM;NH3;kt;NA
IT;2H2;EM;NMVOC;kt;27,277726467499996
IT;2H2;EM;NOx;kt;NA
IT;2H2;EM;Ni;t;NA
IT;2H2;EM;PAH4;t;NA
IT;2H2;EM;PCB;t;NA
IT;2H2;EM;PCDD/F;t;NA
IT;2H2;EM;PM10;kt;0,018874079999999998
IT;2H2;EM;PM2.5;kt;NA
IT;2H2;EM;Pb;t;NA
IT;2H2;EM;SO2;kt;NA
IT;2H2;EM;Se;t;NA
IT;2H2;EM;TSP;kt;0,018874079999999998
IT;2H2;EM;Zn;t;NA
IT;2H3 ;EM;As;t;NO
IT;2H3 ;EM;BC;kt;NO
IT;2H3 ;EM;BaP;t;NO
IT;2H3 ;EM;BbF;t;NO
IT;2H3 ;EM;BkF;t;NO
IT;2H3 ;EM;CO;kt;NO
IT;2H3 ;EM;Cd;t;NO
IT;2H3 ;EM;Cr;t;NO
IT;2H3 ;EM;Cu;t;NO
IT;2H3 ;EM;HCB;t;NO
IT;2H3 ;EM;Hg;t;NO
IT;2H3 ;EM;IxP;t;NO
IT;2H3 ;EM;NH3;kt;NO
IT;2H3 ;EM;NMVOC;kt;NO
IT;2H3 ;EM;NOx;kt;NO
IT;2H3 ;EM;Ni;t;NO
IT;2H3 ;EM;PAH4;t;NO
IT;2H3 ;EM;PCB;t;NO
IT;2H3 ;EM;PCDD/F;t;NO
IT;2H3 ;EM;PM10;kt;NO
IT;2H3 ;EM;PM2.5;kt;NO
IT;2H3 ;EM;Pb;t;NO
IT;2H3 ;EM;SO2;kt;NO
IT;2H3 ;EM;Se;t;NO
IT;2H3 ;EM;TSP;kt;NO
IT;2H3 ;EM;Zn;t;NO
IT;2I;EM;As;t;NA
IT;2I;EM;BC;kt;NA
IT;2I;EM;BaP;t;NA
IT;2I;EM;BbF;t;NA
IT;2I;EM;BkF;t;NA
IT;2I;EM;CO;kt;NA
IT;2I;EM;Cd;t;NA
IT;2I;EM;Cr;t;NA
IT;2I;EM;Cu;t;NA
IT;2I;EM;HCB;t;NA
IT;2I;EM;Hg;t;NA
IT;2I;EM;IxP;t;NA
IT;2I;EM;NH3;kt;NA
IT;2I;EM;NMVOC;kt;NA
IT;2I;EM;NOx;kt;NA
IT;2I;EM;Ni;t;NA
IT;2I;EM;PAH4;t;NA
IT;2I;EM;PCB;t;NA
IT;2I;EM;PCDD/F;t;NA
IT;2I;EM;PM10;kt;NA
IT;2I;EM;PM2.5;kt;NA
IT;2I;EM;Pb;t;NA
IT;2I;EM;SO2;kt;NA
IT;2I;EM;Se;t;NA
IT;2I;EM;TSP;kt;5,487059742
IT;2I;EM;Zn;t;NA
IT;2J;EM;As;t;NA
IT;2J;EM;BC;kt;NA
IT;2J;EM;BaP;t;NA
IT;2J;EM;BbF;t;NA
IT;2J;EM;BkF;t;NA
IT;2J;EM;CO;kt;NA
IT;2J;EM;Cd;t;NA
IT;2J;EM;Cr;t;NA
IT;2J;EM;Cu;t;NA
IT;2J;EM;HCB;t;NA
IT;2J;EM;Hg;t;NA
IT;2J;EM;IxP;t;NA
IT;2J;EM;NH3;kt;NA
IT;2J;EM;NMVOC;kt;NA
IT;2J;EM;NOx;kt;NA
IT;2J;EM;Ni;t;NA
IT;2J;EM;PAH4;t;NA
IT;2J;EM;PCB;t;NA
IT;2J;EM;PCDD/F;t;NA
IT;2J;EM;PM10;kt;NA
IT;2J;EM;PM2.5;kt;NA
IT;2J;EM;Pb;t;NA
IT;2J;EM;SO2;kt;NA
IT;2J;EM;Se;t;NA
IT;2J;EM;TSP;kt;NA
IT;2J;EM;Zn;t;NA
IT;2K;EM;As;t;NA
IT;2K;EM;BC;kt;NA
IT;2K;EM;BaP;t;NA
IT;2K;EM;BbF;t;NA
IT;2K;EM;BkF;t;NA
IT;2K;EM;CO;kt;NA
IT;2K;EM;Cd;t;NA
IT;2K;EM;Cr;t;NA
IT;2K;EM;Cu;t;NA
IT;2K;EM;HCB;t;NA
IT;2K;EM;Hg;t;NA
IT;2K;EM;IxP;t;NA
IT;2K;EM;NH3;kt;NA
IT;2K;EM;NMVOC;kt;NA
IT;2K;EM;NOx;kt;NA
IT;2K;EM;Ni;t;NA
IT;2K;EM;PAH4;t;NA
IT;2K;EM;PCB;t;NA
IT;2K;EM;PCDD/F;t;NA
IT;2K;EM;PM10;kt;NA
IT;2K;EM;PM2.5;kt;NA
IT;2K;EM;Pb;t;NA
IT;2K;EM;SO2;kt;NA
IT;2K;EM;Se;t;NA
IT;2K;EM;TSP;kt;NA
IT;2K;EM;Zn;t;NA
IT;2L;EM;As;t;NA
IT;2L;EM;BC;kt;NA
IT;2L;EM;BaP;t;NA
IT;2L;EM;BbF;t;NA
IT;2L;EM;BkF;t;NA
IT;2L;EM;CO;kt;NA
IT;2L;EM;Cd;t;NA
IT;2L;EM;Cr;t;NA
IT;2L;EM;Cu;t;NA
IT;2L;EM;HCB;t;NA
IT;2L;EM;Hg;t;NA
IT;2L;EM;IxP;t;NA
IT;2L;EM;NH3;kt;NA
IT;2L;EM;NMVOC;kt;NA
IT;2L;EM;NOx;kt;NA
IT;2L;EM;Ni;t;NA
IT;2L;EM;PAH4;t;NA
IT;2L;EM;PCB;t;NA
IT;2L;EM;PCDD/F;t;NA
IT;2L;EM;PM10;kt;NA
IT;2L;EM;PM2.5;kt;NA
IT;2L;EM;Pb;t;1,9872000000000003
IT;2L;EM;SO2;kt;NA
IT;2L;EM;Se;t;NA
IT;2L;EM;TSP;kt;NA
IT;2L;EM;Zn;t;NA
IT;3B1a;EM;As;t;NA
IT;3B1a;EM;BC;kt;NA
IT;3B1a;EM;BaP;t;NA
IT;3B1a;EM;BbF;t;NA
IT;3B1a;EM;BkF;t;NA
IT;3B1a;EM;CO;kt;NA
IT;3B1a;EM;Cd;t;NA
IT;3B1a;EM;Cr;t;NA
IT;3B1a;EM;Cu;t;NA
IT;3B1a;EM;HCB;t;NA
IT;3B1a;EM;Hg;t;NA
IT;3B1a;EM;IxP;t;NA
IT;3B1a;EM;NH3;kt;48,86964474382374
IT;3B1a;EM;NMVOC;kt;37,8744953893078
IT;3B1a;EM;NOx;kt;0,36874084859699646
IT;3B1a;EM;Ni;t;NA
IT;3B1a;EM;PAH4;t;NA
IT;3B1a;EM;PCB;t;NA
IT;3B1a;EM;PCDD/F;t;NA
IT;3B1a;EM;PM10;kt;1,0721904200913852
IT;3B1a;EM;PM2.5;kt;0,6977430070974004
IT;3B1a;EM;Pb;t;NA
IT;3B1a;EM;SO2;kt;NA
IT;3B1a;EM;Se;t;NA
IT;3B1a;EM;TSP;kt;1,6495237232175157
IT;3B1a;EM;Zn;t;NA
IT;3B1b;EM;As;t;NA
IT;3B1b;EM;BC;kt;NA
IT;3B1b;EM;BaP;t;NA
IT;3B1b;EM;BbF;t;NA
IT;3B1b;EM;BkF;t;NA
IT;3B1b;EM;CO;kt;NA
IT;3B1b;EM;Cd;t;NA
IT;3B1b;EM;Cr;t;NA
IT;3B1b;EM;Cu;t;NA
IT;3B1b;EM;HCB;t;NA
IT;3B1b;EM;Hg;t;NA
IT;3B1b;EM;IxP;t;NA
IT;3B1b;EM;NH3;kt;57,20958509201983
IT;3B1b;EM;NMVOC;kt;35,64070854786787
IT;3B1b;EM;NOx;kt;0,47198029245606204
IT;3B1b;EM;Ni;t;NA
IT;3B1b;EM;PAH4;t;NA
IT;3B1b;EM;PCB;t;NA
IT;3B1b;EM;PCDD/F;t;NA
IT;3B1b;EM;PM10;kt;1,2961915792736445
IT;3B1b;EM;PM2.5;kt;0,8564493483695571
IT;3B1b;EM;Pb;t;NA
IT;3B1b;EM;SO2;kt;NA
IT;3B1b;EM;Se;t;NA
IT;3B1b;EM;TSP;kt;1,9941408911902223
IT;3B1b;EM;Zn;t;NA
IT;3B2;EM;As;t;NA
IT;3B2;EM;BC;kt;NA
IT;3B2;EM;BaP;t;NA
IT;3B2;EM;BbF;t;NA
IT;3B2;EM;BkF;t;NA
IT;3B2;EM;CO;kt;NA
IT;3B2;EM;Cd;t;NA
IT;3B2;EM;Cr;t;NA
IT;3B2;EM;Cu;t;NA
IT;3B2;EM;HCB;t;NA
IT;3B2;EM;Hg;t;NA
IT;3B2;EM;IxP;t;NA
IT;3B2;EM;NH3;kt;3,260831623601143
IT;3B2;EM;NMVOC;kt;0,7995947849724
IT;3B2;EM;NOx;kt;0,12445086852822862
IT;3B2;EM;Ni;t;NA
IT;3B2;EM;PAH4;t;NA
IT;3B2;EM;PCB;t;NA
IT;3B2;EM;PCDD/F;t;NA
IT;3B2;EM;PM10;kt;0,35433172844988464
IT;3B2;EM;PM2.5;kt;0,107564988993715
IT;3B2;EM;Pb;t;NA
IT;3B2;EM;SO2;kt;NA
IT;3B2;EM;Se;t;NA
IT;3B2;EM;TSP;kt;0,5451257360767456
IT;3B2;EM;Zn;t;NA
IT;3B3;EM;As;t;NA
IT;3B3;EM;BC;kt;NA
IT;3B3;EM;BaP;t;NA
IT;3B3;EM;BbF;t;NA
IT;3B3;EM;BkF;t;NA
IT;3B3;EM;CO;kt;NA
IT;3B3;EM;Cd;t;NA
IT;3B3;EM;Cr;t;NA
IT;3B3;EM;Cu;t;NA
IT;3B3;EM;HCB;t;NA
IT;3B3;EM;Hg;t;NA
IT;3B3;EM;IxP;t;NA
IT;3B3;EM;NH3;kt;31,269928500916805
IT;3B3;EM;NMVOC;kt;3,1821257392358753
IT;3B3;EM;NOx;kt;0,017502257871555876
IT;3B3;EM;Ni;t;NA
IT;3B3;EM;PAH4;t;NA
IT;3B3;EM;PCB;t;NA
IT;3B3;EM;PCDD/F;t;NA
IT;3B3;EM;PM10;kt;1,363912775717607
IT;3B3;EM;PM2.5;kt;0,05969868758700856
IT;3B3;EM;Pb;t;NA
IT;3B3;EM;SO2;kt;NA
IT;3B3;EM;Se;t;NA
IT;3B3;EM;TSP;kt;2,098327347257857
IT;3B3;EM;Zn;t;NA
IT;3B4a;EM;As;t;NA
IT;3B4a;EM;BC;kt;NA
IT;3B4a;EM;BaP;t;NA
IT;3B4a;EM;BbF;t;NA
IT;3B4a;EM;BkF;t;NA
IT;3B4a;EM;CO;kt;NA
IT;3B4a;EM;Cd;t;NA
IT;3B4a;EM;Cr;t;NA
IT;3B4a;EM;Cu;t;NA
IT;3B4a;EM;HCB;t;NA
IT;3B4a;EM;Hg;t;NA
IT;3B4a;EM;IxP;t;NA
IT;3B4a;EM;NH3;kt;7,666114409343912
IT;3B4a;EM;NMVOC;kt;5,095029337369406
IT;3B4a;EM;NOx;kt;0,06354366666340501
IT;3B4a;EM;Ni;t;NA
IT;3B4a;EM;PAH4;t;NA
IT;3B4a;EM;PCB;t;NA
IT;3B4a;EM;PCDD/F;t;NA
IT;3B4a;EM;PM10;kt;0,20757782051834311
IT;3B4a;EM;PM2.5;kt;0,1356819893838968
IT;3B4a;EM;Pb;t;NA
IT;3B4a;EM;SO2;kt;NA
IT;3B4a;EM;Se;t;NA
IT;3B4a;EM;TSP;kt;0,31935049310514324
IT;3B4a;EM;Zn;t;NA
IT;3B4d;EM;As;t;NA
IT;3B4d;EM;BC;kt;NA
IT;3B4d;EM;BaP;t;NA
IT;3B4d;EM;BbF;t;NA
IT;3B4d;EM;BkF;t;NA
IT;3B4d;EM;CO;kt;NA
IT;3B4d;EM;Cd;t;NA
IT;3B4d;EM;Cr;t;NA
IT;3B4d;EM;Cu;t;NA
IT;3B4d;EM;HCB;t;NA
IT;3B4d;EM;Hg;t;NA
IT;3B4d;EM;IxP;t;NA
IT;3B4d;EM;NH3;kt;0,46617262474371435
IT;3B4d;EM;NMVOC;kt;0,09223822812315001
IT;3B4d;EM;NOx;kt;0,019141574902971435
IT;3B4d;EM;Ni;t;NA
IT;3B4d;EM;PAH4;t;NA
IT;3B4d;EM;PCB;t;NA
IT;3B4d;EM;PCDD/F;t;NA
IT;3B4d;EM;PM10;kt;0,0555541270065506
IT;3B4d;EM;PM2.5;kt;0,016864645698417148
IT;3B4d;EM;Pb;t;NA
IT;3B4d;EM;SO2;kt;NA
IT;3B4d;EM;Se;t;NA
IT;3B4d;EM;TSP;kt;0,08546788770238554
IT;3B4d;EM;Zn;t;NA
IT;3B4e;EM;As;t;NA
IT;3B4e;EM;BC;kt;NA
IT;3B4e;EM;BaP;t;NA
IT;3B4e;EM;BbF;t;NA
IT;3B4e;EM;BkF;t;NA
IT;3B4e;EM;CO;kt;NA
IT;3B4e;EM;Cd;t;NA
IT;3B4e;EM;Cr;t;NA
IT;3B4e;EM;Cu;t;NA
IT;3B4e;EM;HCB;t;NA
IT;3B4e;EM;Hg;t;NA
IT;3B4e;EM;IxP;t;NA
IT;3B4e;EM;NH3;kt;2,7890275751999996
IT;3B4e;EM;NMVOC;kt;0,94761432085908
IT;3B4e;EM;NOx;kt;0,04168642912
IT;3B4e;EM;Ni;t;NA
IT;3B4e;EM;PAH4;t;NA
IT;3B4e;EM;PCB;t;NA
IT;3B4e;EM;PCDD/F;t;NA
IT;3B4e;EM;PM10;kt;0,08843018800000002
IT;3B4e;EM;PM2.5;kt;0,05627375600000001
IT;3B4e;EM;Pb;t;NA
IT;3B4e;EM;SO2;kt;NA
IT;3B4e;EM;Se;t;NA
IT;3B4e;EM;TSP;kt;0,1360464430769231
IT;3B4e;EM;Zn;t;NA
IT;3B4f;EM;As;t;NA
IT;3B4f;EM;BC;kt;NA
IT;3B4f;EM;BaP;t;NA
IT;3B4f;EM;BbF;t;NA
IT;3B4f;EM;BkF;t;NA
IT;3B4f;EM;CO;kt;NA
IT;3B4f;EM;Cd;t;NA
IT;3B4f;EM;Cr;t;NA
IT;3B4f;EM;Cu;t;NA
IT;3B4f;EM;HCB;t;NA
IT;3B4f;EM;Hg;t;NA
IT;3B4f;EM;IxP;t;NA
IT;3B4f;EM;NH3;kt;0,5799031704000001
IT;3B4f;EM;NMVOC;kt;0,08695259358407997
IT;3B4f;EM;NOx;kt;0,00866757024
IT;3B4f;EM;Ni;t;NA
IT;3B4f;EM;PAH4;t;NA
IT;3B4f;EM;PCB;t;NA
IT;3B4f;EM;PCDD/F;t;NA
IT;3B4f;EM;PM10;kt;0,010419840000000001
IT;3B4f;EM;PM2.5;kt;0,0065124
IT;3B4f;EM;Pb;t;NA
IT;3B4f;EM;SO2;kt;NA
IT;3B4f;EM;Se;t;NA
IT;3B4f;EM;TSP;kt;0,016030523076923077
IT;3B4f;EM;Zn;t;NA
IT;3B4gi;EM;As;t;NA
IT;3B4gi;EM;BC;kt;NA
IT;3B4gi;EM;BaP;t;NA
IT;3B4gi;EM;BbF;t;NA
IT;3B4gi;EM;BkF;t;NA
IT;3B4gi;EM;CO;kt;NA
IT;3B4gi;EM;Cd;t;NA
IT;3B4gi;EM;Cr;t;NA
IT;3B4gi;EM;Cu;t;NA
IT;3B4gi;EM;HCB;t;NA
IT;3B4gi;EM;Hg;t;NA
IT;3B4gi;EM;IxP;t;NA
IT;3B4gi;EM;NH3;kt;6,440171967872164
IT;3B4gi;EM;NMVOC;kt;2,1132595056113024
IT;3B4gi;EM;NOx;kt;0,13954363281978274
IT;3B4gi;EM;Ni;t;NA
IT;3B4gi;EM;PAH4;t;NA
IT;3B4gi;EM;PCB;t;NA
IT;3B4gi;EM;PCDD/F;t;NA
IT;3B4gi;EM;PM10;kt;1,2628048700446304
IT;3B4gi;EM;PM2.5;kt;0,0947103652533473
IT;3B4gi;EM;Pb;t;NA
IT;3B4gi;EM;SO2;kt;NA
IT;3B4gi;EM;Se;t;NA
IT;3B4gi;EM;TSP;kt;1,9427767231455852
IT;3B4gi;EM;Zn;t;NA
IT;3B4gii;EM;As;t;NA
IT;3B4gii;EM;BC;kt;NA
IT;3B4gii;EM;BaP;t;NA
IT;3B4gii;EM;BbF;t;NA
IT;3B4gii;EM;BkF;t;NA
IT;3B4gii;EM;CO;kt;NA
IT;3B4gii;EM;Cd;t;NA
IT;3B4gii;EM;Cr;t;NA
IT;3B4gii;EM;Cu;t;NA
IT;3B4gii;EM;HCB;t;NA
IT;3B4gii;EM;Hg;t;NA
IT;3B4gii;EM;IxP;t;NA
IT;3B4gii;EM;NH3;kt;11,909613371768371
IT;3B4gii;EM;NMVOC;kt;4,970261278965166
IT;3B4gii;EM;NOx;kt;0,1555049442867984
IT;3B4gii;EM;Ni;t;NA
IT;3B4gii;EM;PAH4;t;NA
IT;3B4gii;EM;PCB;t;NA
IT;3B4gii;EM;PCDD/F;t;NA
IT;3B4gii;EM;PM10;kt;2,4598289719362856
IT;3B4gii;EM;PM2.5;kt;0,2459828971936285
IT;3B4gii;EM;Pb;t;NA
IT;3B4gii;EM;SO2;kt;NA
IT;3B4gii;EM;Se;t;NA
IT;3B4gii;EM;TSP;kt;3,7843522645173624
IT;3B4gii;EM;Zn;t;NA
IT;3B4giii;EM;As;t;NA
IT;3B4giii;EM;BC;kt;NA
IT;3B4giii;EM;BaP;t;NA
IT;3B4giii;EM;BbF;t;NA
IT;3B4giii;EM;BkF;t;NA
IT;3B4giii;EM;CO;kt;NA
IT;3B4giii;EM;Cd;t;NA
IT;3B4giii;EM;Cr;t;NA
IT;3B4giii;EM;Cu;t;NA
IT;3B4giii;EM;HCB;t;NA
IT;3B4giii;EM;Hg;t;NA
IT;3B4giii;EM;IxP;t;NA
IT;3B4giii;EM;NH3;kt;3,610140694183857
IT;3B4giii;EM;NMVOC;kt;2,0786709825264986
IT;3B4giii;EM;NOx;kt;0,04332408789198373
IT;3B4giii;EM;Ni;t;NA
IT;3B4giii;EM;PAH4;t;NA
IT;3B4giii;EM;PCB;t;NA
IT;3B4giii;EM;PCDD/F;t;NA
IT;3B4giii;EM;PM10;kt;0,9889471457708247
IT;3B4giii;EM;PM2.5;kt;0,17980857195833178
IT;3B4giii;EM;Pb;t;NA
IT;3B4giii;EM;SO2;kt;NA
IT;3B4giii;EM;Se;t;NA
IT;3B4giii;EM;TSP;kt;1,5214571473397303
IT;3B4giii;EM;Zn;t;NA
IT;3B4giv;EM;As;t;NA
IT;3B4giv;EM;BC;kt;NA
IT;3B4giv;EM;BaP;t;NA
IT;3B4giv;EM;BbF;t;NA
IT;3B4giv;EM;BkF;t;NA
IT;3B4giv;EM;CO;kt;NA
IT;3B4giv;EM;Cd;t;NA
IT;3B4giv;EM;Cr;t;NA
IT;3B4giv;EM;Cu;t;NA
IT;3B4giv;EM;HCB;t;NA
IT;3B4giv;EM;Hg;t;NA
IT;3B4giv;EM;IxP;t;NA
IT;3B4giv;EM;NH3;kt;1,6801192203258126
IT;3B4giv;EM;NMVOC;kt;3,025939002654734
IT;3B4giv;EM;NOx;kt;0,025751334423456042
IT;3B4giv;EM;Ni;t;NA
IT;3B4giv;EM;PAH4;t;NA
IT;3B4giv;EM;PCB;t;NA
IT;3B4giv;EM;PCDD/F;t;NA
IT;3B4giv;EM;PM10;kt;0,7728524484009461
IT;3B4giv;EM;PM2.5;kt;0,12516842484630464
IT;3B4giv;EM;Pb;t;NA
IT;3B4giv;EM;SO2;kt;NA
IT;3B4giv;EM;Se;t;NA
IT;3B4giv;EM;TSP;kt;1,1890037667706863
IT;3B4giv;EM;Zn;t;NA
IT;3B4h;EM;As;t;NA
IT;3B4h;EM;BC;kt;NA
IT;3B4h;EM;BaP;t;NA
IT;3B4h;EM;BbF;t;NA
IT;3B4h;EM;BkF;t;NA
IT;3B4h;EM;CO;kt;NA
IT;3B4h;EM;Cd;t;NA
IT;3B4h;EM;Cr;t;NA
IT;3B4h;EM;Cu;t;NA
IT;3B4h;EM;HCB;t;NA
IT;3B4h;EM;Hg;t;NA
IT;3B4h;EM;IxP;t;NA
IT;3B4h;EM;NH3;kt;6,0374315324560115
IT;3B4h;EM;NMVOC;kt;1,0484512233525833
IT;3B4h;EM;NOx;kt;0,07743456336658958
IT;3B4h;EM;Ni;t;NA
IT;3B4h;EM;PAH4;t;NA
IT;3B4h;EM;PCB;t;NA
IT;3B4h;EM;PCDD/F;t;NA
IT;3B4h;EM;PM10;kt;6,281632653061224e-05
IT;3B4h;EM;PM2.5;kt;3,2571428571428566e-05
IT;3B4h;EM;Pb;t;NA
IT;3B4h;EM;SO2;kt;NA
IT;3B4h;EM;Se;t;NA
IT;3B4h;EM;TSP;kt;9,664050235478807e-05
IT;3B4h;EM;Zn;t;NA
IT;3D1a;EM;As;t;NA
IT;3D1a;EM;BC;kt;NA
IT;3D1a;EM;BaP;t;NA
IT;3D1a;EM;BbF;t;NA
IT;3D1a;EM;BkF;t;NA
IT;3D1a;EM;CO;kt;NA
IT;3D1a;EM;Cd;t;NA
IT;3D1a;EM;Cr;t;NA
IT;3D1a;EM;Cu;t;NA
IT;3D1a;EM;HCB;t;NA
IT;3D1a;EM;Hg;t;NA
IT;3D1a;EM;IxP;t;NA
IT;3D1a;EM;NH3;kt;43,942831751071296
IT;3D1a;EM;NMVOC;kt;NA
IT;3D1a;EM;NOx;kt;11,991520000000003
IT;3D1a;EM;Ni;t;NA
IT;3D1a;EM;PAH4;t;NA
IT;3D1a;EM;PCB;t;NA
IT;3D1a;EM;PCDD/F;t;NA
IT;3D1a;EM;PM10;kt;NA
IT;3D1a;EM;PM2.5;kt;NA
IT;3D1a;EM;Pb;t;NA
IT;3D1a;EM;SO2;kt;NA
IT;3D1a;EM;Se;t;NA
IT;3D1a;EM;TSP;kt;NA
IT;3D1a;EM;Zn;t;NA
IT;3D1bi;EM;As;t;NA
IT;3D1bi;EM;BC;kt;NA
IT;3D1bi;EM;BaP;t;NA
IT;3D1bi;EM;BbF;t;NA
IT;3D1bi;EM;BkF;t;NA
IT;3D1bi;EM;CO;kt;NA
IT;3D1bi;EM;Cd;t;NA
IT;3D1bi;EM;Cr;t;NA
IT;3D1bi;EM;Cu;t;NA
IT;3D1bi;EM;HCB;t;NA
IT;3D1bi;EM;Hg;t;NA
IT;3D1bi;EM;IxP;t;NA
IT;3D1bi;EM;NH3;kt;65,26958097197475
IT;3D1bi;EM;NMVOC;kt;15,810185924419425
IT;3D1bi;EM;NOx;kt;18,34808696763744
IT;3D1bi;EM;Ni;t;NA
IT;3D1bi;EM;PAH4;t;NA
IT;3D1bi;EM;PCB;t;NA
IT;3D1bi;EM;PCDD/F;t;NA
IT;3D1bi;EM;PM10;kt;NA
IT;3D1bi;EM;PM2.5;kt;NA
IT;3D1bi;EM;Pb;t;NA
IT;3D1bi;EM;SO2;kt;NA
IT;3D1bi;EM;Se;t;NA
IT;3D1bi;EM;TSP;kt;NA
IT;3D1bi;EM;Zn;t;NA
IT;3D1bii;EM;As;t;NA
IT;3D1bii;EM;BC;kt;NA
IT;3D1bii;EM;BaP;t;NA
IT;3D1bii;EM;BbF;t;NA
IT;3D1bii;EM;BkF;t;NA
IT;3D1bii;EM;CO;kt;NA
IT;3D1bii;EM;Cd;t;NA
IT;3D1bii;EM;Cr;t;NA
IT;3D1bii;EM;Cu;t;NA
IT;3D1bii;EM;HCB;t;NA
IT;3D1bii;EM;Hg;t;NA
IT;3D1bii;EM;IxP;t;NA
IT;3D1bii;EM;NH3;kt;0,9035311130304963
IT;3D1bii;EM;NMVOC;kt;NA
IT;3D1bii;EM;NOx;kt;0,27800957324015274
IT;3D1bii;EM;Ni;t;NA
IT;3D1bii;EM;PAH4;t;NA
IT;3D1bii;EM;PCB;t;NA
IT;3D1bii;EM;PCDD/F;t;NA
IT;3D1bii;EM;PM10;kt;NA
IT;3D1bii;EM;PM2.5;kt;NA
IT;3D1bii;EM;Pb;t;NA
IT;3D1bii;EM;SO2;kt;NA
IT;3D1bii;EM;Se;t;NA
IT;3D1bii;EM;TSP;kt;NA
IT;3D1bii;EM;Zn;t;NA
IT;3D1biii;EM;As;t;NA
IT;3D1biii;EM;BC;kt;NA
IT;3D1biii;EM;BaP;t;NA
IT;3D1biii;EM;BbF;t;NA
IT;3D1biii;EM;BkF;t;NA
IT;3D1biii;EM;CO;kt;NA
IT;3D1biii;EM;Cd;t;NA
IT;3D1biii;EM;Cr;t;NA
IT;3D1biii;EM;Cu;t;NA
IT;3D1biii;EM;HCB;t;NA
IT;3D1biii;EM;Hg;t;NA
IT;3D1biii;EM;IxP;t;NA
IT;3D1biii;EM;NH3;kt;12,161280000000001
IT;3D1biii;EM;NMVOC;kt;NA
IT;3D1biii;EM;NOx;kt;6,080640000000001
IT;3D1biii;EM;Ni;t;NA
IT;3D1biii;EM;PAH4;t;NA
IT;3D1biii;EM;PCB;t;NA
IT;3D1biii;EM;PCDD/F;t;NA
IT;3D1biii;EM;PM10;kt;NA
IT;3D1biii;EM;PM2.5;kt;NA
IT;3D1biii;EM;Pb;t;NA
IT;3D1biii;EM;SO2;kt;NA
IT;3D1biii;EM;Se;t;NA
IT;3D1biii;EM;TSP;kt;NA
IT;3D1biii;EM;Zn;t;NA
IT;3D1c;EM;As;t;NA
IT;3D1c;EM;BC;kt;NA
IT;3D1c;EM;BaP;t;NA
IT;3D1c;EM;BbF;t;NA
IT;3D1c;EM;BkF;t;NA
IT;3D1c;EM;CO;kt;NA
IT;3D1c;EM;Cd;t;NA
IT;3D1c;EM;Cr;t;NA
IT;3D1c;EM;Cu;t;NA
IT;3D1c;EM;HCB;t;NA
IT;3D1c;EM;Hg;t;NA
IT;3D1c;EM;IxP;t;NA
IT;3D1c;EM;NH3;kt;8,146329083501596
IT;3D1c;EM;NMVOC;kt;0,1344433385301736
IT;3D1c;EM;NOx;kt;5,564024911488894
IT;3D1c;EM;Ni;t;NA
IT;3D1c;EM;PAH4;t;NA
IT;3D1c;EM;PCB;t;NA
IT;3D1c;EM;PCDD/F;t;NA
IT;3D1c;EM;PM10;kt;NA
IT;3D1c;EM;PM2.5;kt;NA
IT;3D1c;EM;Pb;t;NA
IT;3D1c;EM;SO2;kt;NA
IT;3D1c;EM;Se;t;NA
IT;3D1c;EM;TSP;kt;NA
IT;3D1c;EM;Zn;t;NA
IT;3D1d;EM;As;t;NA
IT;3D1d;EM;BC;kt;NA
IT;3D1d;EM;BaP;t;NA
IT;3D1d;EM;BbF;t;NA
IT;3D1d;EM;BkF;t;NA
IT;3D1d;EM;CO;kt;NA
IT;3D1d;EM;Cd;t;NA
IT;3D1d;EM;Cr;t;NA
IT;3D1d;EM;Cu;t;NA
IT;3D1d;EM;HCB;t;NA
IT;3D1d;EM;Hg;t;NA
IT;3D1d;EM;IxP;t;NA
IT;3D1d;EM;NH3;kt;3,18098315413635
IT;3D1d;EM;NMVOC;kt;NA
IT;3D1d;EM;NOx;kt;NE
IT;3D1d;EM;Ni;t;NA
IT;3D1d;EM;PAH4;t;NA
IT;3D1d;EM;PCB;t;NA
IT;3D1d;EM;PCDD/F;t;NA
IT;3D1d;EM;PM10;kt;NA
IT;3D1d;EM;PM2.5;kt;NA
IT;3D1d;EM;Pb;t;NA
IT;3D1d;EM;SO2;kt;NA
IT;3D1d;EM;Se;t;NA
IT;3D1d;EM;TSP;kt;NA
IT;3D1d;EM;Zn;t;NA
IT;3D2;EM;As;t;NA
IT;3D2;EM;BC;kt;NA
IT;3D2;EM;BaP;t;NA
IT;3D2;EM;BbF;t;NA
IT;3D2;EM;BkF;t;NA
IT;3D2;EM;CO;kt;NA
IT;3D2;EM;Cd;t;NA
IT;3D2;EM;Cr;t;NA
IT;3D2;EM;Cu;t;NA
IT;3D2;EM;HCB;t;NA
IT;3D2;EM;Hg;t;NA
IT;3D2;EM;IxP;t;NA
IT;3D2;EM;NH3;kt;NE
IT;3D2;EM;NMVOC;kt;NA
IT;3D2;EM;NOx;kt;NE
IT;3D2;EM;Ni;t;NA
IT;3D2;EM;PAH4;t;NA
IT;3D2;EM;PCB;t;NA
IT;3D2;EM;PCDD/F;t;NA
IT;3D2;EM;PM10;kt;NA
IT;3D2;EM;PM2.5;kt;NA
IT;3D2;EM;Pb;t;NA
IT;3D2;EM;SO2;kt;NA
IT;3D2;EM;Se;t;NA
IT;3D2;EM;TSP;kt;NA
IT;3D2;EM;Zn;t;NA
IT;3D3;EM;As;t;NA
IT;3D3;EM;BC;kt;NA
IT;3D3;EM;BaP;t;NA
IT;3D3;EM;BbF;t;NA
IT;3D3;EM;BkF;t;NA
IT;3D3;EM;CO;kt;NA
IT;3D3;EM;Cd;t;NA
IT;3D3;EM;Cr;t;NA
IT;3D3;EM;Cu;t;NA
IT;3D3;EM;HCB;t;NA
IT;3D3;EM;Hg;t;NA
IT;3D3;EM;IxP;t;NA
IT;3D3;EM;NH3;kt;NA
IT;3D3;EM;NMVOC;kt;NA
IT;3D3;EM;NOx;kt;NA
IT;3D3;EM;Ni;t;NA
IT;3D3;EM;PAH4;t;NA
IT;3D3;EM;PCB;t;NA
IT;3D3;EM;PCDD/F;t;NA
IT;3D3;EM;PM10;kt;10,3785995196
IT;3D3;EM;PM2.5;kt;0,3991769046
IT;3D3;EM;Pb;t;NA
IT;3D3;EM;SO2;kt;NA
IT;3D3;EM;Se;t;NA
IT;3D3;EM;TSP;kt;10,3785995196
IT;3D3;EM;Zn;t;NA
IT;3D4;EM;As;t;NA
IT;3D4;EM;BC;kt;NA
IT;3D4;EM;BaP;t;NA
IT;3D4;EM;BbF;t;NA
IT;3D4;EM;BkF;t;NA
IT;3D4;EM;CO;kt;NA
IT;3D4;EM;Cd;t;NA
IT;3D4;EM;Cr;t;NA
IT;3D4;EM;Cu;t;NA
IT;3D4;EM;HCB;t;NA
IT;3D4;EM;Hg;t;NA
IT;3D4;EM;IxP;t;NA
IT;3D4;EM;NH3;kt;NA
IT;3D4;EM;NMVOC;kt;NA
IT;3D4;EM;NOx;kt;NA
IT;3D4;EM;Ni;t;NA
IT;3D4;EM;PAH4;t;NA
IT;3D4;EM;PCB;t;NA
IT;3D4;EM;PCDD/F;t;NA
IT;3D4;EM;PM10;kt;NA
IT;3D4;EM;PM2.5;kt;NA
IT;3D4;EM;Pb;t;NA
IT;3D4;EM;SO2;kt;NA
IT;3D4;EM;Se;t;NA
IT;3D4;EM;TSP;kt;NA
IT;3D4;EM;Zn;t;NA
IT;3D5;EM;As;t;NA
IT;3D5;EM;BC;kt;NA
IT;3D5;EM;BaP;t;NA
IT;3D5;EM;BbF;t;NA
IT;3D5;EM;BkF;t;NA
IT;3D5;EM;CO;kt;NA
IT;3D5;EM;Cd;t;NA
IT;3D5;EM;Cr;t;NA
IT;3D5;EM;Cu;t;NA
IT;3D5;EM;HCB;t;NA
IT;3D5;EM;Hg;t;NA
IT;3D5;EM;IxP;t;NA
IT;3D5;EM;NH3;kt;1,599210145
IT;3D5;EM;NMVOC;kt;6,81361918
IT;3D5;EM;NOx;kt;NA
IT;3D5;EM;Ni;t;NA
IT;3D5;EM;PAH4;t;NA
IT;3D5;EM;PCB;t;NA
IT;3D5;EM;PCDD/F;t;NA
IT;3D5;EM;PM10;kt;NA
IT;3D5;EM;PM2.5;kt;NA
IT;3D5;EM;Pb;t;NA
IT;3D5;EM;SO2;kt;NA
IT;3D5;EM;Se;t;NA
IT;3D5;EM;TSP;kt;NA
IT;3D5;EM;Zn;t;NA
IT;3D6;EM;As;t;NA
IT;3D6;EM;BC;kt;NA
IT;3D6;EM;BaP;t;NA
IT;3D6;EM;BbF;t;NA
IT;3D6;EM;BkF;t;NA
IT;3D6;EM;CO;kt;NA
IT;3D6;EM;Cd;t;NA
IT;3D6;EM;Cr;t;NA
IT;3D6;EM;Cu;t;NA
IT;3D6;EM;HCB;t;NO
IT;3D6;EM;Hg;t;NA
IT;3D6;EM;IxP;t;NA
IT;3D6;EM;NH3;kt;NA
IT;3D6;EM;NMVOC;kt;NA
IT;3D6;EM;NOx;kt;NA
IT;3D6;EM;Ni;t;NA
IT;3D6;EM;PAH4;t;NA
IT;3D6;EM;PCB;t;NA
IT;3D6;EM;PCDD/F;t;NA
IT;3D6;EM;PM10;kt;NA
IT;3D6;EM;PM2.5;kt;NA
IT;3D6;EM;Pb;t;NA
IT;3D6;EM;SO2;kt;NA
IT;3D6;EM;Se;t;NA
IT;3D6;EM;TSP;kt;NA
IT;3D6;EM;Zn;t;NA
IT;3F;EM;As;t;0,0008814839254736114
IT;3F;EM;BC;kt;0,06604310888709171
IT;3F;EM;BaP;t;0,05354527317147934
IT;3F;EM;BbF;t;0,15405844538534239
IT;3F;EM;BkF;t;0,057703686908742585
IT;3F;EM;CO;kt;9,918128624093821
IT;3F;EM;Cd;t;0,09133983603873265
IT;3F;EM;Cr;t;0,010819605741167925
IT;3F;EM;Cu;t;0,007471418721616171
IT;3F;EM;HCB;t;NA
IT;3F;EM;Hg;t;0,015666573834102613
IT;3F;EM;IxP;t;0,038816738291608005
IT;3F;EM;NH3;kt;0,2587337901937521
IT;3F;EM;NMVOC;kt;0,2611018567029995
IT;3F;EM;NOx;kt;0,2695143647851589
IT;3F;EM;Ni;t;0,005435285053277566
IT;3F;EM;PAH4;t;0,30412414375717234
IT;3F;EM;PCB;t;NA
IT;3F;EM;PCDD/F;t;0,06004719611203962
IT;3F;EM;PM10;kt;0,6494025057518478
IT;3F;EM;PM2.5;kt;0,6170607819776288
IT;3F;EM;Pb;t;0,011053933494280901
IT;3F;EM;SO2;kt;0,04651886394253901
IT;3F;EM;Se;t;0,002846199928489804
IT;3F;EM;TSP;kt;0,7215583397242754
IT;3F;EM;Zn;t;0,06690909005753291
IT;3I;EM;As;t;NO
IT;3I;EM;BC;kt;NO
IT;3I;EM;BaP;t;NO
IT;3I;EM;BbF;t;NO
IT;3I;EM;BkF;t;NO
IT;3I;EM;CO;kt;NO
IT;3I;EM;Cd;t;NO
IT;3I;EM;Cr;t;NO
IT;3I;EM;Cu;t;NO
IT;3I;EM;HCB;t;NO
IT;3I;EM;Hg;t;NO
IT;3I;EM;IxP;t;NO
IT;3I;EM;NH3;kt;NO
IT;3I;EM;NMVOC;kt;NO
IT;3I;EM;NOx;kt;NO
IT;3I;EM;Ni;t;NO
IT;3I;EM;PAH4;t;NO
IT;3I;EM;PCB;t;NO
IT;3I;EM;PCDD/F;t;NO
IT;3I;EM;PM10;kt;NO
IT;3I;EM;PM2.5;kt;NO
IT;3I;EM;Pb;t;NO
IT;3I;EM;SO2;kt;NO
IT;3I;EM;Se;t;NO
IT;3I;EM;TSP;kt;NO
IT;3I;EM;Zn;t;NO
IT;5A;EM;As;t;NA
IT;5A;EM;BC;kt;NA
IT;5A;EM;BaP;t;NA
IT;5A;EM;BbF;t;NA
IT;5A;EM;BkF;t;NA
IT;5A;EM;CO;kt;NA
IT;5A;EM;Cd;t;NA
IT;5A;EM;Cr;t;NA
IT;5A;EM;Cu;t;NA
IT;5A;EM;HCB;t;NA
IT;5A;EM;Hg;t;NA
IT;5A;EM;IxP;t;NA
IT;5A;EM;NH3;kt;5,9361245822844415
IT;5A;EM;NMVOC;kt;7,3215957846013024
IT;5A;EM;NOx;kt;NA
IT;5A;EM;Ni;t;NA
IT;5A;EM;PAH4;t;NA
IT;5A;EM;PCB;t;NA
IT;5A;EM;PCDD/F;t;NA
IT;5A;EM;PM10;kt;0,0022377454900576253
IT;5A;EM;PM2.5;kt;0,00033719452589909426
IT;5A;EM;Pb;t;NA
IT;5A;EM;SO2;kt;NA
IT;5A;EM;Se;t;NA
IT;5A;EM;TSP;kt;0,0022377454900576253
IT;5A;EM;Zn;t;NA
IT;5B1;EM;As;t;NA
IT;5B1;EM;BC;kt;NA
IT;5B1;EM;BaP;t;NA
IT;5B1;EM;BbF;t;NA
IT;5B1;EM;BkF;t;NA
IT;5B1;EM;CO;kt;NA
IT;5B1;EM;Cd;t;NA
IT;5B1;EM;Cr;t;NA
IT;5B1;EM;Cu;t;NA
IT;5B1;EM;HCB;t;NA
IT;5B1;EM;Hg;t;NA
IT;5B1;EM;IxP;t;NA
IT;5B1;EM;NH3;kt;0,15444017760000003
IT;5B1;EM;NMVOC;kt;0,3269189679436801
IT;5B1;EM;NOx;kt;NA
IT;5B1;EM;Ni;t;NA
IT;5B1;EM;PAH4;t;NA
IT;5B1;EM;PCB;t;NA
IT;5B1;EM;PCDD/F;t;NA
IT;5B1;EM;PM10;kt;NA
IT;5B1;EM;PM2.5;kt;NA
IT;5B1;EM;Pb;t;NA
IT;5B1;EM;SO2;kt;NA
IT;5B1;EM;Se;t;NA
IT;5B1;EM;TSP;kt;NA
IT;5B1;EM;Zn;t;NA
IT;5B2;EM;As;t;NA
IT;5B2;EM;BC;kt;NA
IT;5B2;EM;BaP;t;NA
IT;5B2;EM;BbF;t;NA
IT;5B2;EM;BkF;t;NA
IT;5B2;EM;CO;kt;NA
IT;5B2;EM;Cd;t;NA
IT;5B2;EM;Cr;t;NA
IT;5B2;EM;Cu;t;NA
IT;5B2;EM;HCB;t;NA
IT;5B2;EM;Hg;t;NA
IT;5B2;EM;IxP;t;NA
IT;5B2;EM;NH3;kt;3,3514924395035472
IT;5B2;EM;NMVOC;kt;NA
IT;5B2;EM;NOx;kt;NA
IT;5B2;EM;Ni;t;NA
IT;5B2;EM;PAH4;t;NA
IT;5B2;EM;PCB;t;NA
IT;5B2;EM;PCDD/F;t;NA
IT;5B2;EM;PM10;kt;NA
IT;5B2;EM;PM2.5;kt;NA
IT;5B2;EM;Pb;t;NA
IT;5B2;EM;SO2;kt;NA
IT;5B2;EM;Se;t;NA
IT;5B2;EM;TSP;kt;NA
IT;5B2;EM;Zn;t;NA
IT;5C1bi;EM;As;t;NO
IT;5C1bi;EM;BC;kt;NO
IT;5C1bi;EM;BaP;t;NO
IT;5C1bi;EM;BbF;t;NO
IT;5C1bi;EM;BkF;t;NO
IT;5C1bi;EM;CO;kt;NO
IT;5C1bi;EM;Cd;t;NO
IT;5C1bi;EM;Cr;t;NO
IT;5C1bi;EM;Cu;t;NO
IT;5C1bi;EM;HCB;t;NO
IT;5C1bi;EM;Hg;t;NO
IT;5C1bi;EM;IxP;t;NO
IT;5C1bi;EM;NH3;kt;NO
IT;5C1bi;EM;NMVOC;kt;NO
IT;5C1bi;EM;NOx;kt;NO
IT;5C1bi;EM;Ni;t;NO
IT;5C1bi;EM;PAH4;t;NO
IT;5C1bi;EM;PCB;t;NO
IT;5C1bi;EM;PCDD/F;t;NO
IT;5C1bi;EM;PM10;kt;NO
IT;5C1bi;EM;PM2.5;kt;NO
IT;5C1bi;EM;Pb;t;NO
IT;5C1bi;EM;SO2;kt;NO
IT;5C1bi;EM;Se;t;NO
IT;5C1bi;EM;TSP;kt;NO
IT;5C1bi;EM;Zn;t;NO
IT;5C1bii1;EM;As;t;6,405296617415665e-05
IT;5C1bii1;EM;BC;kt;5,604634540238707e-06
IT;5C1bii1;EM;BaP;t;3,1654082120949505e-05
IT;5C1bii1;EM;BbF;t;4,34467793816954e-06
IT;5C1bii1;EM;BkF;t;3,786076488976313e-05
IT;5C1bii1;EM;CO;kt;0,022418538160954828
IT;5C1bii1;EM;Cd;t;0,000400331038588479
IT;5C1bii1;EM;Cr;t;0,006405296617415664
IT;5C1bii1;EM;Cu;t;0,004803972463061748
IT;5C1bii1;EM;HCB;t;0,008006620771769581
IT;5C1bii1;EM;Hg;t;0,00022418538160954822
IT;5C1bii1;EM;IxP;t;6,206682768813628e-06
IT;5C1bii1;EM;NH3;kt;NA
IT;5C1bii1;EM;NMVOC;kt;0,2962449685554745
IT;5C1bii1;EM;NOx;kt;0,0800662077176958
IT;5C1bii1;EM;Ni;t;0,0005604634540238707
IT;5C1bii1;EM;PAH4;t;8,00662077176958e-05
IT;5C1bii1;EM;PCB;t;0,02001655192942395
IT;5C1bii1;EM;PCDD/F;t;0,020016551929423972
IT;5C1bii1;EM;PM10;kt;0,00028023172701193533
IT;5C1bii1;EM;PM2.5;kt;0,0001601324154353916
IT;5C1bii1;EM;Pb;t;0,005204303501650228
IT;5C1bii1;EM;SO2;kt;0,05124237293932531
IT;5C1bii1;EM;Se;t;2,401986231530874e-05
IT;5C1bii1;EM;TSP;kt;0,0002859507418489136
IT;5C1bii1;EM;Zn;t;0,05044171086214835
IT;5C1bii2;EM;As;t;NO
IT;5C1bii2;EM;BC;kt;NO
IT;5C1bii2;EM;BaP;t;NO
IT;5C1bii2;EM;BbF;t;NO
IT;5C1bii2;EM;BkF;t;NO
IT;5C1bii2;EM;CO;kt;NO
IT;5C1bii2;EM;Cd;t;NO
IT;5C1bii2;EM;Cr;t;NO
IT;5C1bii2;EM;Cu;t;NO
IT;5C1bii2;EM;HCB;t;NO
IT;5C1bii2;EM;Hg;t;NO
IT;5C1bii2;EM;IxP;t;NO
IT;5C1bii2;EM;NH3;kt;NA
IT;5C1bii2;EM;NMVOC;kt;NO
IT;5C1bii2;EM;NOx;kt;NO
IT;5C1bii2;EM;Ni;t;NO
IT;5C1bii2;EM;PAH4;t;NO
IT;5C1bii2;EM;PCB;t;NO
IT;5C1bii2;EM;PCDD/F;t;NO
IT;5C1bii2;EM;PM10;kt;NO
IT;5C1bii2;EM;PM2.5;kt;NO
IT;5C1bii2;EM;Pb;t;NO
IT;5C1bii2;EM;SO2;kt;NO
IT;5C1bii2;EM;Se;t;NO
IT;5C1bii2;EM;TSP;kt;NA
IT;5C1bii2;EM;Zn;t;NO
IT;5C1bii3;EM;As;t;0,00021227642105651264
IT;5C1bii3;EM;BC;kt;4,542007822539183e-05
IT;5C1bii3;EM;BaP;t;2,8226181785909782e-06
IT;5C1bii3;EM;BbF;t;3,874181813752324e-07
IT;5C1bii3;EM;BkF;t;3,376072723412739e-06
IT;5C1bii3;EM;CO;kt;0,003811878018114805
IT;5C1bii3;EM;Cd;t;5,701138165517769e-05
IT;5C1bii3;EM;Cr;t;0,000590330618557159
IT;5C1bii3;EM;Cu;t;0,028505690827588838
IT;5C1bii3;EM;HCB;t;0,9602980952556525
IT;5C1bii3;EM;Hg;t;0,0018619674646956966
IT;5C1bii3;EM;IxP;t;5,534545448217605e-07
IT;5C1bii3;EM;NH3;kt;NO
IT;5C1bii3;EM;NMVOC;kt;0,035379403509418775
IT;5C1bii3;EM;NOx;kt;0,030508367234242002
IT;5C1bii3;EM;Ni;t;0,001265571805536923
IT;5C1bii3;EM;PAH4;t;7,13956362820071e-06
IT;5C1bii3;EM;PCB;t;1,0108401002691079
IT;5C1bii3;EM;PCDD/F;t;0,025271002506727716
IT;5C1bii3;EM;PM10;kt;0,0012977165207254807
IT;5C1bii3;EM;PM2.5;kt;0,0012977165207254807
IT;5C1bii3;EM;Pb;t;0,0012433333233310027
IT;5C1bii3;EM;SO2;kt;0,0013110596100490333
IT;5C1bii3;EM;Se;t;0,001888249307302693
IT;5C1bii3;EM;TSP;kt;0,0013242005313525316
IT;5C1bii3;EM;Zn;t;NA
IT;5C1bii4;EM;As;t;0,0045742384731627264
IT;5C1bii4;EM;BC;kt;7,493965158160211e-06
IT;5C1bii4;EM;BaP;t;9,927070728991449e-06
IT;5C1bii4;EM;BbF;t;1,362539119665493e-06
IT;5C1bii4;EM;BkF;t;1,1873555185656437e-05
IT;5C1bii4;EM;CO;kt;0,011678906739989938
IT;5C1bii4;EM;Cd;t;0,01557187565331992
IT;5C1bii4;EM;Cr;t;0,013625391196654927
IT;5C1bii4;EM;Cu;t;0,0389296891332998
IT;5C1bii4;EM;HCB;t;0,09148476946325453
IT;5C1bii4;EM;Hg;t;0,02238457125164738
IT;5C1bii4;EM;IxP;t;1,9464844566649898e-06
IT;5C1bii4;EM;NH3;kt;NA
IT;5C1bii4;EM;NMVOC;kt;0,004888790361359788
IT;5C1bii4;EM;NOx;kt;0,05839453369994969
IT;5C1bii4;EM;Ni;t;0,00778593782665996
IT;5C1bii4;EM;PAH4;t;2,510964949097837e-05
IT;5C1bii4;EM;PCB;t;0,08759180054992453
IT;5C1bii4;EM;PCDD/F;t;0,009732422283324948
IT;5C1bii4;EM;PM10;kt;0,0007980586272326457
IT;5C1bii4;EM;PM2.5;kt;0,0002141132902331489
IT;5C1bii4;EM;Pb;t;0,00778593782665996
IT;5C1bii4;EM;SO2;kt;0,035036720219969814
IT;5C1bii4;EM;Se;t;0,00014598633424987422
IT;5C1bii4;EM;TSP;kt;0,0008143455379924957
IT;5C1bii4;EM;Zn;t;0,06423398706994467
IT;5C1aii5;EM;As;t;0,004059001033333333
IT;5C1aii5;EM;BC;kt;NA
IT;5C1aii5;EM;BaP;t;1,1601406333333333e-05
IT;5C1aii5;EM;BbF;t;2,0414299833333334e-05
IT;5C1aii5;EM;BkF;t;9,507784933333333e-06
IT;5C1aii5;EM;CO;kt;0,0014017123333333334
IT;5C1aii5;EM;Cd;t;0,0015001304333333335
IT;5C1aii5;EM;Cr;t;0,0040440892
IT;5C1aii5;EM;Cu;t;0,0037070817666666664
IT;5C1aii5;EM;HCB;t;0,008648863333333335
IT;5C1aii5;EM;Hg;t;0,0020876566666666665
IT;5C1aii5;EM;IxP;t;1,1025809566666666e-05
IT;5C1aii5;EM;NH3;kt;NA
IT;5C1aii5;EM;NMVOC;kt;0,0027139536666666666
IT;5C1aii5;EM;NOx;kt;0,14133435633333333
IT;5C1aii5;EM;Ni;t;0,005168441433333334
IT;5C1aii5;EM;PAH4;t;5,254930066666666e-05
IT;5C1aii5;EM;PCB;t;0,017446845000000002
IT;5C1aii5;EM;PCDD/F;t;0,005666496666666667
IT;5C1aii5;EM;PM10;kt;0,000640701831
IT;5C1aii5;EM;PM2.5;kt;0,000640701831
IT;5C1aii5;EM;Pb;t;0,008956047100000001
IT;5C1aii5;EM;SO2;kt;0,002773601
IT;5C1aii5;EM;Se;t;0,005899121266666667
IT;5C1aii5;EM;TSP;kt;0,0006537773785714286
IT;5C1aii5;EM;Zn;t;0,1378300755
IT;5C1bii6;EM;As;t;NO
IT;5C1bii6;EM;BC;kt;NO
IT;5C1bii6;EM;BaP;t;NO
IT;5C1bii6;EM;BbF;t;NO
IT;5C1bii6;EM;BkF;t;NO
IT;5C1bii6;EM;CO;kt;NO
IT;5C1bii6;EM;Cd;t;NO
IT;5C1bii6;EM;Cr;t;NO
IT;5C1bii6;EM;Cu;t;NO
IT;5C1bii6;EM;HCB;t;NO
IT;5C1bii6;EM;Hg;t;NO
IT;5C1bii6;EM;IxP;t;NO
IT;5C1bii6;EM;NH3;kt;NO
IT;5C1bii6;EM;NMVOC;kt;NO
IT;5C1bii6;EM;NOx;kt;NO
IT;5C1bii6;EM;Ni;t;NO
IT;5C1bii6;EM;PAH4;t;NO
IT;5C1bii6;EM;PCB;t;NO
IT;5C1bii6;EM;PCDD/F;t;NO
IT;5C1bii6;EM;PM10;kt;NO
IT;5C1bii6;EM;PM2.5;kt;NO
IT;5C1bii6;EM;Pb;t;NO
IT;5C1bii6;EM;SO2;kt;NO
IT;5C1bii6;EM;Se;t;NO
IT;5C1bii6;EM;TSP;kt;NO
IT;5C1bii6;EM;Zn;t;NO
IT;5C2;EM;As;t;0,035557234042129515
IT;5C2;EM;BC;kt;0,7824964710536723
IT;5C2;EM;BaP;t;0,17494506362770496
IT;5C2;EM;BbF;t;0,4809758665473964
IT;5C2;EM;BkF;t;0,18806350669377803
IT;5C2;EM;CO;kt;60,59736981223717
IT;5C2;EM;Cd;t;0,28432458159305607
IT;5C2;EM;Cr;t;0,06204061355691659
IT;5C2;EM;Cu;t;0,06493581970888888
IT;5C2;EM;HCB;t;NA
IT;5C2;EM;Hg;t;0,050426637341428
IT;5C2;EM;IxP;t;0,11869941916530626
IT;5C2;EM;NH3;kt;NA
IT;5C2;EM;NMVOC;kt;0,17765951553425893
IT;5C2;EM;NOx;kt;1,646667657941232
IT;5C2;EM;Ni;t;0,027005344619804004
IT;5C2;EM;PAH4;t;0,9626838560341856
IT;5C2;EM;PCB;t;NA
IT;5C2;EM;PCDD/F;t;6,586670631764918
IT;5C2;EM;PM10;kt;1,3557074089734138
IT;5C2;EM;PM2.5;kt;1,2829228686548109
IT;5C2;EM;Pb;t;0,14517659087314347
IT;5C2;EM;SO2;kt;0,0724533769494141
IT;5C2;EM;Se;t;0,02693863333810174
IT;5C2;EM;TSP;kt;1,5063415655260153
IT;5C2;EM;Zn;t;3,0618943232264217
IT;5D1;EM;As;t;NA
IT;5D1;EM;BC;kt;NA
IT;5D1;EM;BaP;t;NA
IT;5D1;EM;BbF;t;NA
IT;5D1;EM;BkF;t;NA
IT;5D1;EM;CO;kt;NA
IT;5D1;EM;Cd;t;NA
IT;5D1;EM;Cr;t;NA
IT;5D1;EM;Cu;t;NA
IT;5D1;EM;HCB;t;NA
IT;5D1;EM;Hg;t;NA
IT;5D1;EM;IxP;t;NA
IT;5D1;EM;NH3;kt;NA
IT;5D1;EM;NMVOC;kt;0,12858072454448227
IT;5D1;EM;NOx;kt;NA
IT;5D1;EM;Ni;t;NA
IT;5D1;EM;PAH4;t;NA
IT;5D1;EM;PCB;t;NA
IT;5D1;EM;PCDD/F;t;NA
IT;5D1;EM;PM10;kt;NA
IT;5D1;EM;PM2.5;kt;NA
IT;5D1;EM;Pb;t;NA
IT;5D1;EM;SO2;kt;NA
IT;5D1;EM;Se;t;NA
IT;5D1;EM;TSP;kt;NA
IT;5D1;EM;Zn;t;NA
IT;5D2;EM;As;t;NA
IT;5D2;EM;BC;kt;NA
IT;5D2;EM;BaP;t;NA
IT;5D2;EM;BbF;t;NA
IT;5D2;EM;BkF;t;NA
IT;5D2;EM;CO;kt;NA
IT;5D2;EM;Cd;t;NA
IT;5D2;EM;Cr;t;NA
IT;5D2;EM;Cu;t;NA
IT;5D2;EM;HCB;t;NA
IT;5D2;EM;Hg;t;NA
IT;5D2;EM;IxP;t;NA
IT;5D2;EM;NH3;kt;NA
IT;5D2;EM;NMVOC;kt;0,010138751357508866
IT;5D2;EM;NOx;kt;NA
IT;5D2;EM;Ni;t;NA
IT;5D2;EM;PAH4;t;NA
IT;5D2;EM;PCB;t;NA
IT;5D2;EM;PCDD/F;t;NA
IT;5D2;EM;PM10;kt;NA
IT;5D2;EM;PM2.5;kt;NA
IT;5D2;EM;Pb;t;NA
IT;5D2;EM;SO2;kt;NA
IT;5D2;EM;Se;t;NA
IT;5D2;EM;TSP;kt;NA
IT;5D2;EM;Zn;t;NA
IT;5D3;EM;As;t;NO
IT;5D3;EM;BC;kt;NO
IT;5D3;EM;BaP;t;NO
IT;5D3;EM;BbF;t;NO
IT;5D3;EM;BkF;t;NO
IT;5D3;EM;CO;kt;NO
IT;5D3;EM;Cd;t;NO
IT;5D3;EM;Cr;t;NO
IT;5D3;EM;Cu;t;NO
IT;5D3;EM;HCB;t;NO
IT;5D3;EM;Hg;t;NO
IT;5D3;EM;IxP;t;NO
IT;5D3;EM;NH3;kt;NO
IT;5D3;EM;NMVOC;kt;NO
IT;5D3;EM;NOx;kt;NO
IT;5D3;EM;Ni;t;NO
IT;5D3;EM;PAH4;t;NO
IT;5D3;EM;PCB;t;NO
IT;5D3;EM;PCDD/F;t;NO
IT;5D3;EM;PM10;kt;NO
IT;5D3;EM;PM2.5;kt;NO
IT;5D3;EM;Pb;t;NO
IT;5D3;EM;SO2;kt;NO
IT;5D3;EM;Se;t;NO
IT;5D3;EM;TSP;kt;NO
IT;5D3;EM;Zn;t;NO
IT;5E;EM;As;t;NO
IT;5E;EM;BC;kt;0,7954959218674
IT;5E;EM;BaP;t;NO
IT;5E;EM;BbF;t;NO
IT;5E;EM;BkF;t;NO
IT;5E;EM;CO;kt;NO
IT;5E;EM;Cd;t;0,012499235409999998
IT;5E;EM;Cr;t;NO
IT;5E;EM;Cu;t;NO
IT;5E;EM;HCB;t;NO
IT;5E;EM;Hg;t;0,02512998571
IT;5E;EM;IxP;t;NO
IT;5E;EM;NH3;kt;NO
IT;5E;EM;NMVOC;kt;NO
IT;5E;EM;NOx;kt;NO
IT;5E;EM;Ni;t;NO
IT;5E;EM;PAH4;t;NO
IT;5E;EM;PCB;t;NO
IT;5E;EM;PCDD/F;t;43,63327396
IT;5E;EM;PM10;kt;4,29997795604
IT;5E;EM;PM2.5;kt;4,29997795604
IT;5E;EM;Pb;t;0,02512998571
IT;5E;EM;SO2;kt;NO
IT;5E;EM;Se;t;NO
IT;5E;EM;TSP;kt;4,29997795604
IT;5E;EM;Zn;t;NO
IT;6A;EM;As;t;NA
IT;6A;EM;BC;kt;NA
IT;6A;EM;BaP;t;NA
IT;6A;EM;BbF;t;NA
IT;6A;EM;BkF;t;NA
IT;6A;EM;CO;kt;NA
IT;6A;EM;Cd;t;NA
IT;6A;EM;Cr;t;NA
IT;6A;EM;Cu;t;NA
IT;6A;EM;HCB;t;NA
IT;6A;EM;Hg;t;NA
IT;6A;EM;IxP;t;NA
IT;6A;EM;NH3;kt;11,859177699999998
IT;6A;EM;NMVOC;kt;NA
IT;6A;EM;NOx;kt;NA
IT;6A;EM;Ni;t;NA
IT;6A;EM;PAH4;t;NA
IT;6A;EM;PCB;t;NA
IT;6A;EM;PCDD/F;t;NA
IT;6A;EM;PM10;kt;NA
IT;6A;EM;PM2.5;kt;NA
IT;6A;EM;Pb;t;NA
IT;6A;EM;SO2;kt;NA
IT;6A;EM;Se;t;NA
IT;6A;EM;TSP;kt;NA
IT;6A;EM;Zn;t;NA
IT;6B;EM;As;t;NA
IT;6B;EM;BC;kt;NA
IT;6B;EM;BaP;t;NA
IT;6B;EM;BbF;t;NA
IT;6B;EM;BkF;t;NA
IT;6B;EM;CO;kt;NA
IT;6B;EM;Cd;t;NA
IT;6B;EM;Cr;t;NA
IT;6B;EM;Cu;t;NA
IT;6B;EM;HCB;t;NA
IT;6B;EM;Hg;t;NA
IT;6B;EM;IxP;t;NA
IT;6B;EM;NH3;kt;NA
IT;6B;EM;NMVOC;kt;NA
IT;6B;EM;NOx;kt;NA
IT;6B;EM;Ni;t;NA
IT;6B;EM;PAH4;t;NA
IT;6B;EM;PCB;t;NA
IT;6B;EM;PCDD/F;t;NA
IT;6B;EM;PM10;kt;NA
IT;6B;EM;PM2.5;kt;NA
IT;6B;EM;Pb;t;NA
IT;6B;EM;SO2;kt;NA
IT;6B;EM;Se;t;NA
IT;6B;EM;TSP;kt;NA
IT;6B;EM;Zn;t;NA
