"DATE","VERSION","REGION","CATEGORY","TYPE","SUBSTANCE","TS:ID","UNIT","1990","1991","1992","1993","1994","1995","1996","1997","1998","1999","2000","2001","2002","2003","2004","2005","2006","2007","2008","2009","2010","2011","2012","2013","2014","2015","2016","2017","2018","2019","2020","2021"
"14.04.2023","v2","DK","1A1a","EM","CO2","DK_EM_1A1a_CO2","kt","24996.608539853452","33760.0444482901","28605.977001428495","30127.87321580512","33991.75862233209","30242.036821800473","42390.45919835654","33302.155499178814","29672.600893042163","26444.20091571057","23355.32078421593","24683.92587851066","24820.70178802263","29524.3053952128","23615.68597142949","20438.42453178799","28258.636636708","23648.16724967707","21636.28135278564","21633.24652243806","21537.43458894633","17638.946380074063","14455.307719838158","16743.574462935336","13306.474793645677","10503.39793503701","11882.299036061839","9306.052148730161","9365.136346014891","6575.554986240559","5649.907997740906","6566.953791896369"
"14.04.2023","v2","DK","1A1b","EM","CO2","DK_EM_1A1b_CO2","kt","908.17324968","993.495456449","1134.785214152","1157.922793322","1208.77504869","1387.140420957","1410.33670697928","1103.75012938257","962.38166365","991.32798471","1000.0284438","1020.9268722","982.450704","1025.0651088168","1000.2293527632","938.4506863836","981.06783611273","993.258381123","884.52046180864","907.38704581264","853.813299458172","835.250752873146","926.432404011045","910.659016679707","920.2677483935894","978.09888541691","867.541162996916","939.517086397954","889.318481326967","955.8398739328525","910.2406631909462","938.1431222353056"
"14.04.2023","v2","DK","1A1c","EM","CO2","DK_EM_1A1c_CO2","kt","530.1281557224237","542.7474940639518","624.7480203897074","631.7914703213686","696.4218589651731","753.9453478373784","892.5301617017336","1161.7839219867028","1289.593861957603","1404.5488877340701","1493.89550395264","1473.2094650693969","1560.8706374193862","1564.799488697244","1608.7395070994037","1652.8357559697872","1710.5881145408373","1675.971682064711","1694.5920222334614","1600.8150351296024","1709.100383722149","1668.783315800429","1531.789078574264","1471.917414762161","1418.1004333493809","1462.6918686168842","1358.245363269877","1385.1906568651816","1294.6179836729627","1250.1468646260853","904.2826764999877","896.236002706815"
"14.04.2023","v2","DK","1A2a","EM","CO2","DK_EM_1A2a_CO2","kt","136.0585193325973","136.81705039251804","130.91011308618025","131.11153527168543","136.94250508698426","140.06520449750238","132.5813171037416","132.0675134221342","132.9252720301614","139.46503720561947","141.17010330741198","149.37812802367492","96.01622385337693","121.42463441743315","119.23768698271323","112.2858205584282","122.9230495480341","132.6272084556113","124.39886547294319","62.98300892910113","75.30965782404166","80.23086103034998","89.63683611209142","93.97324749130944","100.60303467147097","98.07018615725772","105.35009175784059","108.14886427272072","110.93396579065121","101.21577244802609","91.77636359516876","96.74576206090244"
"14.04.2023","v2","DK","1A2b","EM","CO2","DK_EM_1A2b_CO2","kt","NO,IE","NO,IE","NO,IE","NO,IE","NO,IE","NO,IE","NO,IE","NO,IE","NO,IE","NO,IE","NO,IE","NO,IE","NO,IE","NO,IE","NO,IE","NO,IE","NO,IE","NO,IE","NO,IE","NO,IE","NO,IE","NO,IE","NO,IE","NO,IE","NO,IE","NO,IE","NO,IE","NO,IE","NO,IE","","",""
"14.04.2023","v2","DK","1A2c","EM","CO2","DK_EM_1A2c_CO2","kt","336.9359952904347","367.98228300151334","386.98197328887545","380.3964515959787","395.9379017379096","395.6050732609879","434.6904726317344","422.2129987034659","453.9892291056647","483.6027766672355","473.8439398806002","492.670921344552","465.5883979066023","453.753459086081","416.4981816863689","371.4364652137923","340.458038564589","292.8898414427696","335.4375518660899","342.7276095877871","367.9129944476239","376.8523718034958","331.6028306727331","349.6269119311684","379.9986868220111","367.4778782679521","327.39755611581006","268.67184549008454","260.79034475316547","236.68138876384302","209.24820419649015","221.6955489049651"
"14.04.2023","v2","DK","1A2d","EM","CO2","DK_EM_1A2d_CO2","kt","342.9268790696199","339.8184195701833","280.4313600973832","225.5250864290466","261.5638317354151","229.29471274505494","276.8764628193664","270.4827903974197","271.8936270887028","272.3222354744169","231.2307981960503","235.0961093628038","229.1962066529572","231.3087252546968","228.5236405035689","231.4724571961405","221.0340955529201","186.4119061724168","168.5210581206832","149.572169997676","156.1630684139704","146.82502793965196","130.17530168685386","123.12394637958612","112.34238828546059","99.41384205045432","73.31898385370528","81.22806909044724","85.72756143659812","67.1445065145757","55.81766515098585","58.71585477342106"
"14.04.2023","v2","DK","1A2e","EM","CO2","DK_EM_1A2e_CO2","kt","1713.092924680091","1796.347245375782","1646.730931720694","1744.185772586511","1924.865578469637","1949.80658447157","1831.042592403677","1874.344279670134","1846.415338941768","1850.723950058896","1817.048700808538","1881.272095883961","1782.528292279045","1694.9726539568376","1730.160380324798","1656.1960377765538","1681.4416928169132","1428.2181844683041","1332.722455788734","1256.840889242828","1437.991020721575","1319.779849929948","1223.372868238623","1153.728055563569","1169.376578222247","1138.345274177397","1118.594561092148","1155.059222283593","1175.575818392239","1032.971027269976","987.486813774622","978.62487276341"
"14.04.2023","v2","DK","1A2f","EM","CO2","DK_EM_1A2f_CO2","kt","1346.048671143926","1637.123707771048","1657.609707447346","1601.395947089782","1735.775282025128","1818.07521692555","1939.158477058893","1981.680094730836","1923.947337590666","1888.769944228561","1790.086935227506","1763.377044823523","1696.015211317481","1735.935033380919","1860.229247215626","1786.267786538571","1906.443564490553","1997.751665249186","1535.158522105228","1118.3889460559708","1145.6468085827132","1281.3083492415637","1259.5102916896408","1215.460495083772","1237.7185324679704","1261.536597859205","1442.93426466515","1551.962071234971","1533.268664602418","1502.31699560472","1541.925906152213","1467.052157067186"
"14.04.2023","v2","DK","1A2g","EM","CO2","DK_EM_1A2g_CO2","kt","1879.7413174237336","1918.3704895117826","1882.7490812948656","1811.112592667372","1545.2735079173056","1612.591121022215","1643.9728398654806","1592.761301602832","1592.3188298979144","1660.5466059615082","1611.5165613116658","1660.8538144513466","1559.2367291086268","1582.0489260509837","1553.2063703760386","1457.6268803939574","1469.5157594987156","1449.4125633069054","1462.5286052092902","1186.5497964897843","1365.046871331882","1238.270681104494","1104.461260117576","1027.6939533783154","951.9936135490965","945.1173021811597","933.4476247062661","929.894409647838","930.9104632164601","925.0588716978671","875.9266170754238","1018.5951142098004"
"14.04.2023","v2","DK","1A3a","EM","CO2","DK_EM_1A3a_CO2","kt","268.7447917005825","257.22746719303814","252.75789166506337","246.31644106483418","252.0770038185325","264.9792758471935","286.3716906632812","292.26034559294175","277.9534972836652","256.1602998885563","234.93959033477594","239.16767670308047","208.90071030386875","211.45718707858072","198.29111467972888","217.49059344164078","227.52775110233293","246.1706780692061","251.0161662302136","232.67375746273436","241.05464018115975","236.76325552323155","205.83662619923794","194.4097926482911","186.53845060976028","177.725401424799","186.56419307889388","194.2744973900823","194.05063939003946","198.5270307581257","105.85375432903976","119.80490715257504"
"14.04.2023","v2","DK","1A3b","EM","CO2","DK_EM_1A3b_CO2","kt","9431.434113269628","9844.500155600428","10015.45673457911","10126.845632647199","10613.263488795777","10705.697964301797","10882.119410024792","11096.003843927603","11277.67931242516","11429.728498362576","11320.784880527117","11352.862951132043","11494.925888142841","11962.073707701105","12287.364698392694","12392.30631643885","12779.25986551824","13373.813442046046","13062.287772547537","12352.648970219996","12280.260959016778","11989.283262507292","11449.934207876588","11255.615687755017","11472.243697301717","11694.192258973268","11901.57530411187","12082.26997238119","12377.210847841932","12187.155309123518","11212.982853941707","11417.549419132867"
"14.04.2023","v2","DK","1A3c","EM","CO2","DK_EM_1A3c_CO2","kt","297.146495073","302.264142636","319.677117606","331.797532428","300.70584135","303.340348656","301.044145728","293.10099057","247.3126971588","232.3279147644","228.133876698","211.469352822","210.7836355716","218.5976228436","216.4979459916","232.4342275164","227.070749178","227.8973308248","237.0136493088","230.512624524","242.512676406","249.7180231728","249.662208978","248.1259897116","252.467804695666","248.64280722495","253.82853613859","244.283445804878","224.34368278356","223.933396078568","196.674237474435","184.7585376039"
"14.04.2023","v2","DK","1A3d","EM","CO2","DK_EM_1A3d_CO2","kt","780.1602024831823","871.0984576834633","888.2794009799504","796.2740135200262","740.4791174552299","779.1739643752205","843.8108004056386","842.6900541606263","725.4772885284518","644.7226480756492","649.2322615174336","689.3665128095071","741.6297038346883","735.1466042658259","672.0393622412882","756.4179592794443","698.8352521667899","645.8548555695056","784.0256069778903","738.0764273528006","665.4842314566272","654.3452717561951","644.3553631726875","640.3217379852736","531.7838277497457","499.9204486634049","572.9338310705975","588.0379100783039","563.3832087460218","571.5466425822592","558.8532828533608","626.4410931346462"
"14.04.2023","v2","DK","1A4a","EM","CO2","DK_EM_1A4a_CO2","kt","1654.978505396763","1556.794033413103","1447.108060711379","1513.793811310694","1353.9092321049102","1376.0554052295406","1543.7054789638753","1396.877651656079","1287.3304446203124","1281.3169022228658","1159.794556938792","1133.061129999895","1140.298028737349","1279.2985040086976","1269.990003680806","1273.6929101248973","1321.931297106006","1236.1640532664956","1256.3444101003413","1191.978013410133","1177.121816407989","1000.282875756613","1064.2088808544931","1056.682035053999","888.856729388048","936.083035905766","941.204098808404","942.289674130631","920.315860726392","808.416255555902","778.6154362485","852.510868881794"
"14.04.2023","v2","DK","1A4b","EM","CO2","DK_EM_1A4b_CO2","kt","5297.2415202814855","5524.313486773841","4931.176147847118","5625.378221689935","5162.186208334121","5217.406609956239","5579.728439945532","5022.132100008913","4933.730624295286","4779.708915590767","4282.738291488945","4474.21329947813","4210.056973168728","4188.100192223421","4066.6462724969856","3934.22264290051","3694.3913376966666","3394.831464143125","3296.0843150481737","3192.165769327382","3393.602496345411","2900.6379144577195","2715.768870269207","2626.5716725129687","2120.009053423484","2219.616812853374","2247.9260206965996","2140.1636548000233","2079.271074632981","1989.937702817842","1776.6455877374149","1635.5453661989468"
"14.04.2023","v2","DK","1A4c","EM","CO2","DK_EM_1A4c_CO2","kt","2526.5264588850714","2611.2564894437164","2510.5957556918033","2394.3308297132494","2428.5897089015484","2528.5691136692294","2680.55553255551","2579.479192395469","2571.2897729377296","2591.017962934268","2765.1639266610773","2843.498814538089","2730.087766238625","2702.368918316071","2551.1372451802663","2544.922514385066","2481.1914912986767","2370.845863093007","2225.7891397066137","2203.70874358052","2293.668060654545","2132.2363657594988","2033.4016942006222","2058.8747018076674","1915.0598979735023","1921.433573441098","1897.4732803223237","1942.772966616063","2015.4648728188552","1952.5034293975298","1936.6730863311232","2051.30943275996"
"14.04.2023","v2","DK","1A5b","EM","CO2","DK_EM_1A5b_CO2","kt","175.213148879519","346.1096634166306","203.4311486775452","302.6169232278748","320.5011488541767","324.6525225770407","252.5423434800796","251.6118260110698","288.9479450951668","271.4381299389075","203.7064749302637","194.4121621512833","190.5454196388395","198.1510327736585","350.404616757658","381.209294298487","238.230709377702","283.838519821629","218.269357495952","275.9288616903042","230.5701330602134","310.1874028220356","224.6372019627004","238.4485779111659","226.9380490478488","200.6686921952753","206.5903254855665","301.9289797866159","215.5715954767133","197.1753278807427","242.1230507266515","223.5383869495232"
"14.04.2023","v2","DK","1B1a","EM","CO2","DK_EM_1B1a_CO2","kt","NO,NE","NO,NE","NO,NE","NO,NE","NO,NE","NO,NE","NO,NE","NO,NE","NO,NE","NO,NE","NO,NE","NO,NE","NO,NE","NO,NE","NO,NE","NO,NE","NO,NE","NO,NE","NO,NE","NO,NE","NO,NE","NO,NE","NO,NE","NO,NE","NO,NE","NO,NE","NO,NE","NO,NE","NO,NE","NO,NE","NO,NE","NO,NE"
"14.04.2023","v2","DK","1B2a","EM","CO2","DK_EM_1B2a_CO2","kt","4.70329710648","0.74677896199","7.589440545","0.1326074356","0.0832030701","3.4897477896","3.48322937975","0.12818686625","7.46664888642","7.60658896855","2.676610252","0.062972901","1.36508291204","0.067139061","0.044693976","4.66238384584","0.097532761","0.049485152","0.082398456","0.90674540036","0.090315149","0.04036642284","0.0730605009","3.07421907212","0.0712012734","0.79470438732","0.09341329844","1.1584707787","0.12130809435","0.04675688589","0.14506390004","0.060244709"
"14.04.2023","v2","DK","1B2b","EM","CO2","DK_EM_1B2b_CO2","kt","8.3219097632","0.0972051414","0.1183233403","0.0990337741","0.097998739","0.1073997675","0.118614434","0.150777603","0.1636940672","0.167093512","0.3346635058","0.1704441096","26.3419856552","0.1541646604","0.1635328748","2.234265945","0.1627683876","0.1497239472","0.1435720793","0.1416439022","0.1190785107","0.1012421886","0.0880345661","0.0760515575","0.0760505906","0.1561768368","0.0722119016","0.0744732619","0.0645976395","0.0499251879","0.0242379655","0.023602738"
"14.04.2023","v2","DK","1B2c","EM","CO2","DK_EM_1B2c_CO2","kt","327.70583072233","648.70297150026","669.11783082869","581.78552731013","574.727523813142","450.216250845156","494.34985134122405","697.506017524897","515.4965165473354","1098.9009155819078","720.4222583853685","770.6152698383042","646.8049295294777","669.6447472245816","752.026473411919","541.1003074993666","543.4309928755462","543.3311299666226","387.1502286935237","260.5861081173012","352.9177020707962","251.98186517337479","217.35379769784436","240.6458688337621","250.471552348485","246.4901601376093","273.1505906179362","240.429206387098","232.6098498045805","194.827685937223","126.1878743972163","111.158974023372"
"14.04.2023","v2","DK","2A1","EM","CO2","DK_EM_2A1_CO2","kt","774.722","992.554","1129.344","1142.756","1167.538","1242.614","1312.744","1311.56","1389.83","1354.876","1385.26","1387.852","1416.3","1329.911","1458.926","1363.377","1395.466","1407.086","1154.749","764.407","672.224","861.805","871.083","867.063","887.302","931.502","1095.455","1193.741","1159.742","1129.199","1226.954","1214.60885"
"14.04.2023","v2","DK","2A2","EM","CO2","DK_EM_2A2_CO2","kt","105.431248","72.563768","86.63272","88.380504","93.130568","83.447624","79.127808","85.290756","74.410052","79.376816","77.102648","80.382304","101.220176","72.674876","65.273192","59.831264","64.304732","61.223508","61.570012","38.321612","41.314516","48.846688","56.71240632","54.2742758","58.48355744","50.597352","55.416832","50.5998","36.78722","33.690352","43.198952","48.418792"
"14.04.2023","v2","DK","2A3","EM","CO2","DK_EM_2A3_CO2","kt","16.476","16.044","14.837","14.448","15.285","14.405","14.393","14.4583","18.3887","18.0371","16.0209","16.1616","15.3153","13.6812","13.5102","12.8393","12.968","14.3152","15.1307","9.2032","9.3318","9.4788","9.6909","7.0043","8.0045","8.8769","9.0012","8.66062","10.3522","9.763","9.7564","11.18997"
"14.04.2023","v2","DK","2A4","EM","CO2","DK_EM_2A4_CO2","kt","76.843797769","83.031506067","87.559087166","91.572521519","122.167041446","118.547825755","154.495114164","159.713630386","153.959623914","160.432987032","153.96894408694","144.507523602","136.701856932","126.246176369","123.075463567","130.8528671725","148.39857003641","138.69254506204","104.7235281473","75.66934302654","83.99777626782","76.59003943555","60.3459887031","65.44393885681","69.75087363945","57.64208805855","70.95285423854","82.32136969524","89.47754421186","77.93529201211","73.175889977","84.58445201841"
"14.04.2023","v2","DK","2B10","EM","CO2","DK_EM_2B10_CO2","kt","0.5702542","0.6031266","0.6360231","0.6688955","0.701792","0.7346885","0.7783336","0.8588276","0.7233856","0.844946","0.876999","0.9612526","0.9880759","0.8395717","1.1851898","1.1195896","1.089079","1.1500038","1.4334921","1.0739683","1.11824","1.1456899","1.3451656","1.3757003","1.4759322","1.5029483","1.3907387","1.3684221","1.4401196","1.4913562","1.4330824","1.2346671"
"14.04.2023","v2","DK","2C1","EM","CO2","DK_EM_2C1_CO2","kt","30.309","30.309","30.309","35.952","33.472","38.549","35.217","34.998","42.343","43.035","40.726","46.932","","","","16.176","","","","","","","","","","","","","","","",""
"14.04.2023","v2","DK","2C4","EM","CO2","DK_EM_2C4_CO2","kt","NA,NO","NA,NO","NA,NO","NA,NO","NA,NO","NA,NO","NA,NO","NA,NO","NA,NO","NA,NO","NA,NO","","","","","","","","","","","","","","","","","","","","",""
"14.04.2023","v2","DK","2C5","EM","CO2","DK_EM_2C5_CO2","kt","0.158","0.158","0.158","0.2","0.2","0.2","0.158","0.158","0.158","0.158","0.158","0.266","0.1338","0.0628","0.154","0.1882","0.15","0.184","0.1664","0.206","0.177","0.2376","0.1324","0.1566","0.175","0.199","0.145","0.171","0.1196","0.1144","0.0888","0.0694"
"14.04.2023","v2","DK","2D1","EM","CO2","DK_EM_2D1_CO2","kt","50.6339171378","49.7358040934","49.1503751652","48.400430598","47.8709858278","49.78355104744","49.891428230384","48.133116709144","45.872774428232","43.889790205152","40.968916930184","39.653846848136","40.987584578968","38.213440148584","38.873641331672","38.745923550424","38.475055544944","39.11446506628","34.897990478384","31.915554687088","32.572983731224","32.503725406176","32.521801846448","32.570956922264","32.59222368224","32.720138734736","32.61047357104","32.664536223728","32.782137244232","32.761924689056","32.779455920312","32.813628411104"
"14.04.2023","v2","DK","2D2","EM","CO2","DK_EM_2D2_CO2","kt","21.913220509088","25.36249665504","28.2063141","27.34214817","32.6402757148","26.7207345032","25.05541043496","25.57433047656","40.40942456024","47.78977261608","49.5705786384","47.890025419424","71.314470527808","72.066235993152","75.037592170272","101.15396505072","85.804613870984","94.20874191408","78.923612132968","75.6839755416","103.009123674216","92.02376527308","82.808376790512","86.391270372376","83.160924299928","70.550907659608","65.800465619632","75.38543103304","58.8463556184","60.711565331704","56.919591096","65.932114155264"
"14.04.2023","v2","DK","2D3","EM","CO2","DK_EM_2D3_CO2","kt","94.59832861811954","107.08017850807812","113.9640986594976","98.9025000124949","114.366284707724","110.992755262099","123.634239975633","110.732427483435","103.455557102261","101.858710376333","101.489920334566","90.44380252857407","86.2028611902894","82.59820559408612","79.43291949111713","77.65402793804049","71.94398968018099","67.63832866180213","72.09992149690751","67.26148673556283","65.65372667369903","69.17246508733291","70.01331073784628","77.75899586941475","68.03188559537092","71.54035543122598","66.44110603093016","64.51977067049172","70.36494719930471","67.6668137566743","79.2656883176004","81.07016621029638"
"14.04.2023","v2","DK","2G4","EM","CO2","DK_EM_2G4_CO2","kt","0.055319345","0.0732123025","0.079136255","0.069922275","0.0848880725","0.129659175","0.11894442","0.0936150575","0.15241127","0.28862455","0.20997183","0.165696805","0.204922825","0.2617857625","0.373765635","0.15932608","0.1820708225","0.1934715225","0.1889397875","0.232505945","0.2345226925","0.20464689","0.15068646","0.1920996325","0.1617087225","0.2504914575","0.1944186975","0.17851005","0.269849725","0.184214725","0.183600575","0.2158521"
"14.04.2023","v2","DK","2H","EM","CO2","DK_EM_2H_CO2","kt","NA","NA","NA","NA","NA","NA","NA","NA","NA","NA","NA","NA","NA","NA","NA","NA","NA","NA","NA","NA","NA","NA","NA","NA","NA","NA","NA","NA","NA","NA","NA","NA"
"14.04.2023","v2","DK","3G","EM","CO2","DK_EM_3G_CO2","kt","565.5028235134978","462.5496813414528","357.3966857041938","306.8000560042568","367.0760409511378","495.98745401271583","393.0343118406708","469.5892124301398","252.24369006693382","265.00284016517884","260.60313323474884","200.76711898091082","233.32495026608782","226.28541917740083","157.64999106270383","219.68585878175682","193.72758789222382","191.9677051200528","228.92524333565783","181.4041626143109","152.8060675665209","161.60548142737892","188.4436937029979","243.88000102640692","237.7204113238059","165.5652176647659","211.7621404342729","214.4019645925309","239.9202647890209","181.4041626143109","249.5996200359649","271.02619278715594"
"14.04.2023","v2","DK","3H","EM","CO2","DK_EM_3H_CO2","kt","14.6666666666667","11.7333333333333","12.6133333333333","13.4933333333333","18.1866666666667","15.18","8.65333333333333","4.03333333333333","4.25333333333333","2.93333333333333","2.34666666666667","1.68666666666667","0.73333333333333","0.80666666666667","0.58666666666667","0.44","0.95333333333333","0.80666666666667","0.22","1.83333333333333","0.88","0.58666666666667","1.32","0.66","0.51333333333333","1.39333333333333","1.61333333333333","1.54","1.39333333333333","0.71866666666667","0.92986666666667","1.1858"
"14.04.2023","v2","DK","3I","EM","CO2","DK_EM_3I_CO2","kt","33.2904","32.3752","29.0004","25.7209333333333","23.3566666666667","22.4605333333333","13.9568","8.3226","6.44453333333333","5.0622","4.6904","3.718","2.19266666666667","1.35373333333333","1.27746666666667","1.44906666666667","1.16306666666667","1.07726666666667","1.82086666666667","3.09833333333333","2.1736","2.47866666666667","1.9734","1.66833333333333","1.7446","9.0948","2.79326666666667","2.75513333333333","2.4882","2.590016","3.82668","3.45411733333333"
"14.04.2023","v2","DK","3J","EM","CO2","DK_EM_3J_CO2","kt","NA","NA","NA","NA","NA","NA","NA","NA","NA","NA","NA","NA","NA","NA","NA","NA","NA","NA","NA","NA","NA","NA","NA","NA","NA","NA","NA","NA","NA","NA","NA","NA"
"14.04.2023","v2","DK","4A","EM","CO2","DK_EM_4A_CO2","kt","-1260.7637853489944","-1257.0996271912043","-1254.8139024388192","-1253.9199978161028","-1254.4178830855117","-1264.061478009414","-1273.808132036137","-1283.658112308346","-1293.611656776293","-1303.668978178877","-1360.0455871401343","-1267.1296360620775","-1227.651494622436","-1188.293775863934","-1149.0565796526685","-926.1798023201445","-1118.2065983723128","-1346.9689582469116","-2065.845322772241","-2101.5636677680895","-2297.0515825921666","-3223.9741785326446","-3616.4685946620966","-3420.1739146020673","-3985.178546440581","-4035.8549597479446","-3149.0027131589313","-2598.254034654896","-2153.1012150732495","-2518.594519734442","-2200.853924189137","-2966.9668520257883"
"14.04.2023","v2","DK","4B","EM","CO2","DK_EM_4B_CO2","kt","5161.130340286363","4379.7273282585","5506.692747984306","4413.314349823777","3883.7299369672096","4014.338880793346","3370.8922498811485","3737.6679965022486","3584.3071836563886","3830.503821695525","3906.925871041295","3231.8283716093124","4180.429871421038","3950.203086761059","3672.719726166743","3478.6456556335324","3885.37209727499","4522.5900984231475","3926.8505417342335","3229.9051461360627","2451.3383291296623","2933.2690090558394","2811.659301127956","2344.636627643669","3467.5136478383797","2470.6901426942686","2563.394840124969","2141.2079962313187","3267.6284549696697","2947.8331828683026","2723.2931077573026","2654.0026030642357"
"14.04.2023","v2","DK","4C","EM","CO2","DK_EM_4C_CO2","kt","2144.7517150245","2127.12344929837","2103.226268908415","2090.0744751804164","2061.739051457125","2008.126067696181","2028.0073473015377","2020.7712069226016","1978.892216520665","1936.2409161306884","1909.8403190334852","1886.350209595585","1868.3705286166476","1852.1224401386207","1836.8777358712236","1841.5594286530384","1828.4571900649082","1791.4674910369783","1789.6533500663481","1755.8562349040515","1815.8557415792116","1789.887612626995","1778.7764314582316","1784.5994377493848","1970.1184711614417","2045.1540090387384","2076.8299801418184","1983.2737222545118","2159.7786613123585","2077.6646784138284","2101.8110004020787","2222.996671753402"
"14.04.2023","v2","DK","4D","EM","CO2","DK_EM_4D_CO2","kt","102.77632452758743","94.44291935996655","94.02922085901236","81.52754902476147","77.7792371904743","73.6140986895201","87.99774685523258","109.25903502094506","89.67130985336085","72.37613135240665","71.1287795181191","79.46722750839078","89.68139549866282","85.09821682230448","91.56094481257615","96.70118191702475","99.36203210089576","79.75106759976408","59.70858006044073","73.43050771145474","65.17226621049839","71.2932905317014","63.73491113412502","36.95714665935035","45.08329961795518","46.87928571729851","41.82072493646414","21.82113113253336","49.62806535753884","44.01403125581004","78.02121783536674","54.40895677085005"
"14.04.2023","v2","DK","4E","EM","CO2","DK_EM_4E_CO2","kt","428.46107435149554","425.4064797531806","422.34520833842265","419.2839369199834","416.2226655052107","399.5214856177715","382.58040092453217","365.76906610685955","348.947778703687","332.131467587581","315.3170522063417","298.4856981356791","281.6427327077498","264.82678144575385","247.99732310632794","253.0201261693935","246.78445927732014","240.6442452673501","234.78397762287003","228.58331712397663","222.4423816896399","216.59221017853318","281.08002818684514","229.47187415327673","241.96641378750692","205.78503101108095","282.77206114157786","205.84090297745755","215.14835063413759","196.6080942224952","224.58354381778057","216.6168877076898"
"14.04.2023","v2","DK","4F","EM","CO2","DK_EM_4F_CO2","kt","NA","NA","NA","NA","NA","NA","NA","NA","NA","NA","NA","NA","NA","NA","NA","NA","NA","NA","NA","NA","NA","NA","NA","NA","NA","NA","NA","NA","NA","NA","NA","NA"
"14.04.2023","v2","DK","4G","EM","CO2","DK_EM_4G_CO2","kt","-2.36607441","123.0954597002","-51.2975411143","-265.5872390527","-152.6791767853","-116.1082405478","-134.7621442346","-26.4252900635","105.8972412634","244.9062486077","25.8367310066","152.674235304","207.63642481","178.54915133","188.117113986","113.4259450873","79.9768306586","27.0147260101","-65.6120928522","-22.0295411464","-25.0514269381","-103.39501115747","-74.25152771399","-93.65641585818","-146.53049377062","-171.56224971093","-174.00425764303","-162.22723920666","-46.193442263757","-84.558988780482","-117.577735203027","-55.869114678191"
"14.04.2023","v2","DK","4H","EM","CO2","DK_EM_4H_CO2","kt","NA","NA","NA","NA","NA","NA","NA","NA","NA","NA","NA","NA","NA","NA","NA","NA","NA","NA","NA","NA","NA","NA","NA","NA","NA","NA","NA","NA","NA","NA","NA","NA"
"14.04.2023","v2","DK","5A1","EM","CO2","DK_EM_5A1_CO2","kt","NO,NA","NO,NA","NO,NA","NO,NA","NO,NA","NO,NA","NO,NA","NO,NA","NO,NA","NO,NA","NO,NA","NO,NA","NO,NA","NO,NA","NO,NA","NO,NA","NO,NA","NO,NA","NO,NA","NO,NA","NO,NA","NO,NA","NO,NA","NO,NA","NO,NA","NO,NA","NO,NA","NO,NA","NO,NA","NO,NA","NO,NA","NO,NA"
"14.04.2023","v2","DK","5A2","EM","CO2","DK_EM_5A2_CO2","kt","NA,NO","NA,NO","NA,NO","NA,NO","NA,NO","NA,NO","NA,NO","NA,NO","NA,NO","NA,NO","NA,NO","NA,NO","NA,NO","NA,NO","NA,NO","NA,NO","NA,NO","NA,NO","NA,NO","NA,NO","NA,NO","NA,NO","NA,NO","NA,NO","NA,NO","NA,NO","NA,NO","NA,NO","NA,NO","NA,NO","NA,NO","NA,NO"
"14.04.2023","v2","DK","5C1","EM","CO2","DK_EM_5C1_CO2","kt","","","","","0.01933184280958","0.08309410191093","0.30904529740892","0.48191912035828","1.03572690331923","1.12634196284804","1.22301190896212","1.28436006121365","1.3171837828149","1.326813673185","1.33517795775","1.34451269589","1.35408093152378","1.34749706845108","1.33788694548371","1.34652831225326","1.35417668521593","1.373331790658","1.47043102347862","1.57218257713427","1.58431581700679","1.58316926381211","1.58721802529507","1.60309020554802","1.61375305584347","1.61881139435631","1.63011877061255","1.64149041325448"
"14.04.2023","v2","DK","5C2","EM","CO2","DK_EM_5C2_CO2","kt","2.5506033340781","2.57319825796428","2.58775210005398","2.61041497480222","2.63882909929324","2.65353402591219","2.62240645971114","2.60528942252299","2.47888130025565","2.30032665916796","1.98973381905863","1.997756232542","1.92154215121756","1.81708780744903","1.73343462203092","1.74410281256487","1.7475386276601","1.74823490573407","1.74560610691761","1.75117852617351","1.76592593503605","1.77685024087537","1.774481568004","1.77016834729834","1.77040213871703","1.7691223927442","1.77348325127401","1.78167516583851","1.79477109402443","1.80861185537035","1.81974523323032","1.83251203944528"
"14.04.2023","v2","DK","5E","EM","CO2","DK_EM_5E_CO2","kt","21.7835949571209","22.3442473889411","23.7774635674429","21.822213104783","21.8202959915028","24.2687063807571","24.5270526707475","23.0821122194633","21.3661397945633","22.4721548342566","22.1602045756268","21.8867194930501","21.3802791220302","23.2629360094537","20.8996782463684","21.5549400830065","21.9961855523031","22.5591142488538","25.3176863578281","25.8892447540323","23.0731932966007","22.1246933429551","20.9511968986445","21.3433422755449","19.9378886177705","21.5827790849614","24.3707798539922","23.7595868499367","24.4923864053331","23.0405299182805","22.9638178199028","21.6085173444581"
"14.04.2023","v2","DK","1A1a","EM","CH4","DK_EM_1A1a_CH4","kt","0.59499575046756","0.93065007107558","1.32120525799305","2.94031651499674","6.02775418781485","11.36260663711918","14.53096080116976","13.85295790128244","15.24629185196158","15.33717914702118","14.63053475184744","15.51285210079667","15.07617178190347","14.33412627394045","14.01313371680083","12.37011474143673","11.45337948660089","9.53135720306249","10.04641342621892","8.76997261713688","10.93292261191144","9.15160440240314","6.31615270247233","5.61283235890089","4.07173657806152","3.44504732377317","4.01455597515888","4.17438645054816","4.67973412408582","4.87611347495192","3.6147485841244","4.63835424552229"
"14.04.2023","v2","DK","1A1b","EM","CH4","DK_EM_1A1b_CH4","kt","0.0179057152","0.02064644487","0.02560680856","0.02730162319102","0.028174609","0.02955702011","0.03005812865165","0.02355556443385","0.0202556715","0.0208494159","0.0212054161","0.0217974699","0.0210035691","0.021154184144","0.020843428456","0.018823003388","0.019575699192","0.02002393894","0.018041970572","0.018523840872","0.016746322834","0.016309499293","0.018492270798","0.0179777253","0.01808090085258","0.01947505729384","0.01739972204682","0.01853512420932","0.0180069557059","0.0186447960656","0.017629918137","0.01836778690769"
"14.04.2023","v2","DK","1A1c","EM","CH4","DK_EM_1A1c_CH4","kt","0.01558954593079","0.01596404136571","0.01837845364392","0.01858101798564","0.02047752773404","0.01964035661006","0.02321745461468","0.03021224287743","0.03350913187561","0.03643582224735","0.03862133985741","0.03874810762235","0.0430429936784","0.04334244616839","0.04696276671428","0.04825216498692","0.04991348918914","0.04891504003856","0.0502190876928","0.0469287657414","0.05202788163044","0.0505709571684","0.04532923218433","0.04293552799752","0.04135801296618","0.04269587716578","0.03947953477692","0.04047343778657","0.0375610558721","0.03623294121485","0.02630073709956","0.02626642476242"
"14.04.2023","v2","DK","1A2a","EM","CH4","DK_EM_1A2a_CH4","kt","0.00251141575446","0.00253852201889","0.00205186747536","0.00212034068553","0.0022309040891","0.00227432878223","0.00216461699025","0.00219329759561","0.00221114461796","0.00251345469417","0.00249201629063","0.00260324828368","0.0016873334945","0.00190484010458","0.00188413072986","0.00189399069716","0.00209693107144","0.00226724514539","0.00215729401364","0.00109046523869","0.00130396500727","0.00138574204017","0.00155636814193","0.00164059978649","0.00175764958698","0.00171366533271","0.00187028623121","0.00198428753537","0.0020803711319","0.00200675294648","0.00195266054302","0.00212931690982"
"14.04.2023","v2","DK","1A2b","EM","CH4","DK_EM_1A2b_CH4","kt","NO,IE","NO,IE","NO,IE","NO,IE","NO,IE","NO,IE","NO,IE","NO,IE","NO,IE","NO,IE","NO,IE","NO,IE","NO,IE","NO,IE","NO,IE","NO,IE","NO,IE","NO,IE","NO,IE","NO,IE","NO,IE","NO,IE","NO,IE","NO,IE","NO,IE","NO,IE","NO,IE","NO,IE","NO,IE","","",""
"14.04.2023","v2","DK","1A2c","EM","CH4","DK_EM_1A2c_CH4","kt","0.00610545986615","0.00663382634803","0.00701642599541","0.01222279433582","0.01274035144141","0.01225343903622","0.01269015135999","0.01365133373131","0.05853326162385","0.07129146387666","0.07863234787793","0.06805985621872","0.05229885106185","0.04877991257003","0.04647935103803","0.01322534164933","0.00840597324129","0.0057544445011","0.00649807765589","0.00665173161095","0.00698434278215","0.00917282796539","0.00691902342069","0.05741160821198","0.04094918433267","0.05263847340315","0.04512770803012","0.01766329607601","0.06271803126424","0.05142942677059","0.05221941678464","0.04618848672693"
"14.04.2023","v2","DK","1A2d","EM","CH4","DK_EM_1A2d_CH4","kt","0.01743574161145","0.02035018820741","0.01467146155557","0.0100695300354","0.01039819967362","0.00485966119506","0.00569198437234","0.00540479425017","0.00542582791128","0.00517819457448","0.00441833960752","0.00429750868214","0.00443180587688","0.00445557520752","0.0045119667643","0.00468451578922","0.00447222605921","0.01550654973252","0.02237788877056","0.02660964005832","0.02797893212793","0.03179782800145","0.02370380688686","0.00786190659919","0.00481861472363","0.00348047165086","0.00497161991559","0.00333493791294","0.00406778545103","0.00391931167779","0.0045298497198","0.00468518639921"
"14.04.2023","v2","DK","1A2e","EM","CH4","DK_EM_1A2e_CH4","kt","0.0620878000722","0.06304766992913","0.05306654317349","0.05807077832199","0.06358817681691","0.11733903725742","0.4060797747932","0.40501892613824","0.38029395770084","0.34810980783809","0.56056275740406","0.63337526670051","0.55837441432901","0.54813190164834","0.58065595845877","0.49391065081052","0.35474133292311","0.11282231320678","0.16692130976427","0.17042161072334","0.23474212497695","0.19162538672455","0.12661937726406","0.11267602399751","0.12791988512353","0.15586404471296","0.2217471867637","0.38397697982315","0.54155638946896","0.62309611313004","0.63618268377955","0.5110468327965"
"14.04.2023","v2","DK","1A2f","EM","CH4","DK_EM_1A2f_CH4","kt","0.07570046851755","0.08984410019178","0.09411192511729","0.09470993125498","0.1021622912992","0.10783353052969","0.11752287790781","0.13044537378743","0.12879185954049","0.13048244151671","0.14081244708938","0.15293305577382","0.15631192473901","0.15176673079272","0.17392284464828","0.17042592119457","0.1529918831594","0.15559713323251","0.13921838015591","0.08979619447379","0.08926145074619","0.10205464495593","0.09331588617699","0.1027010299477","0.10447583595787","0.1230737915166","0.13869236526752","0.15614584075985","0.17548476641361","0.16598030529658","0.17604937002017","0.16616184418863"
"14.04.2023","v2","DK","1A2g","EM","CH4","DK_EM_1A2g_CH4","kt","0.15984743700536","0.15638267328229","0.1481661553179","0.14889956751361","0.13553255210628","0.14521143321847","0.21389156065858","0.20591801657088","0.28826075970763","0.290068419667","0.27414558615384","0.25628686231777","0.24470812699695","0.2331935759345","0.18962386881068","0.17127060262187","0.1740705406493","0.19490137734864","0.20013285284949","0.19732625745991","0.2120354725672","0.18093667847621","0.11248448877379","0.09843784832584","0.10074724776056","0.16231428242164","0.12718360108897","0.12222019289473","0.09573741425556","0.12940227826042","0.09461925165864","0.07070147203469"
"14.04.2023","v2","DK","1A3a","EM","CH4","DK_EM_1A3a_CH4","kt","0.03110643844382","0.02950123220296","0.02824343663143","0.02952410376343","0.03147403939587","0.03591518511977","0.03789853285704","0.03949929237236","0.04166285739575","0.04100771828888","0.03958832962347","0.00259084619846","0.00227305460778","0.00227547550834","0.00280272843706","0.00407937751716","0.00364971387634","0.00337070392736","0.00300386146704","0.00278907355218","0.00222339979529","0.00173328174546","0.0017290173008","0.00183384293232","0.0015737594665","0.00146986365106","0.00160149287611","0.00153274589762","0.00166512964636","0.00152742465836","0.00095227083552","0.00088379754076"
"14.04.2023","v2","DK","1A3b","EM","CH4","DK_EM_1A3b_CH4","kt","3.1627520195549","3.28177383054301","3.29297140291641","3.23827535282374","3.17065188783819","3.00436631766158","2.83858567515032","2.70443740168173","2.55542244183184","2.36969166629108","2.18156567348195","2.02168454382156","1.88563994577872","1.77665210584615","1.63489363813097","1.47310815585209","1.34052528252935","1.21170923291877","1.02452793080698","0.87140767472469","0.77622138737487","0.68650922188331","0.5974516615402","0.53557238348669","0.49094291273087","0.45602966415348","0.42383741249206","0.40092905063156","0.3792426374674","0.36010037602573","0.32441428495099","0.32739095541641"
"14.04.2023","v2","DK","1A3c","EM","CH4","DK_EM_1A3c_CH4","kt","0.01194580465926","0.01216644310423","0.01288425458372","0.01338591685309","0.01209528718746","0.01220392195898","0.01210861031596","0.01176942159766","0.00987092416466","0.01013130254617","0.00931924546152","0.00909008432535","0.0089101206871","0.00823351487178","0.00803197605072","0.00873792642434","0.00852602556589","0.00841432173883","0.00752408230997","0.00642170679444","0.00698791848018","0.00646711984223","0.0069708545339","0.00609198670473","0.00597115165292","0.00518390973484","0.00495025789559","0.00414502387207","0.00350691637156","0.00321994034116","0.00277723099066","0.00232342022236"
"14.04.2023","v2","DK","1A3d","EM","CH4","DK_EM_1A3d_CH4","kt","0.0123139530509","0.01357510733459","0.01389120021239","0.0124404581177","0.01150553654347","0.01239834382632","0.01368937285622","0.01351154343358","0.01180081046209","0.01069534202266","0.01114303846673","0.01180216823408","0.01276830547491","0.01284414802983","0.01236760413147","0.01357227594467","0.01267416216057","0.01167627386722","0.01398604031161","0.0133381634752","0.01226773420788","0.01213187882463","0.01240243371976","0.01265440747675","0.01077888575447","0.0287571363583","0.02355461498389","0.02994516880441","0.02324487264947","0.03203740088768","0.03126031928845","0.03445287502395"
"14.04.2023","v2","DK","1A4a","EM","CH4","DK_EM_1A4a_CH4","kt","0.17097016146124","0.19125545703827","0.2925359756828","0.40221803638591","0.56844700067252","0.71172930398622","0.74604223114877","0.86592455181553","0.9297618090848","0.95873269706851","0.94745855608575","0.95840829750622","0.98758401099746","0.99622842166041","0.92589478345932","0.88699568629419","0.87201721297789","0.80469505881498","0.76852723535571","0.76125507095334","0.7222994393023","0.60806759828161","0.52684178958423","0.45049066666098","0.43922396151295","0.42141156141092","0.37821997511863","0.40104037314539","0.39644290880103","0.40904437026666","0.42098490663725","0.42400575842903"
"14.04.2023","v2","DK","1A4b","EM","CH4","DK_EM_1A4b_CH4","kt","5.45273455260665","6.10763921290204","6.23944719384636","6.78361083456656","6.63622166750245","6.5622828381479","6.81915713369626","6.59810788839963","6.11473265271116","5.86977345173029","6.13832048469014","6.3086643841078","6.11979451085106","6.62306516152854","6.68282878287184","6.99231021743921","7.12758108687044","8.01147836791168","7.51412455664383","7.01776775765512","7.20316282512154","6.22082677911357","5.80355803715051","5.52995971993289","4.85388167090797","5.19589349811056","5.13674363928953","4.64529965674984","4.13128555975577","3.71585880375918","3.42794945469391","3.35008963930052"
"14.04.2023","v2","DK","1A4c","EM","CH4","DK_EM_1A4c_CH4","kt","1.3129715190238","1.29986504095959","1.28887774985619","1.24277668281637","1.25375597163211","1.73328153724695","2.27419473877515","2.62060681925026","2.93282905075326","2.85699255236439","2.59034926900135","2.38810853641212","2.52263058705081","2.4596265581975","2.49460087890876","2.28288151637053","1.85762429542824","1.61223001701795","1.46744571751726","1.40872174489228","1.47686753416396","1.33780229901575","1.19289365160065","1.08011364807963","1.04060901328386","0.97206620055509","0.99835916846491","1.01166841064981","1.05318586072993","1.04358739798019","0.98639096307231","1.04808645942971"
"14.04.2023","v2","DK","1A5b","EM","CH4","DK_EM_1A5b_CH4","kt","0.08210077322854","0.09542046356144","0.08954164998652","0.0945323694732","0.09650113191903","0.10213657241221","0.09733883777604","0.10023514129267","0.10213226712521","0.09940339297598","0.09240280583355","0.09054725027502","0.08538272699868","0.08108650410235","0.08222393586732","0.07450186203653","0.05851455045356","0.05112928401482","0.04060674522371","0.03546933784507","0.02833741216037","0.02555466016456","0.01819048997987","0.01505690291826","0.0122694189068","0.01055424837284","0.01006670679585","0.01167311896603","0.00923794996517","0.0094936852132","0.01073857997268","0.00948606610198"
"14.04.2023","v2","DK","1B1a","EM","CH4","DK_EM_1B1a_CH4","kt","NO,NE","NO,NE","NO,NE","NO,NE","NO,NE","NO,NE","NO,NE","NO,NE","NO,NE","NO,NE","NO,NE","NO,NE","NO,NE","NO,NE","NO,NE","NO,NE","NO,NE","NO,NE","NO,NE","NO,NE","NO,NE","NO,NE","NO,NE","NO,NE","NO,NE","NO,NE","NO,NE","NO,NE","NO,NE","NO,NE","NO,NE","NO,NE"
"14.04.2023","v2","DK","1B2a","EM","CH4","DK_EM_1B2a_CH4","kt","1.72144153158312","2.07354869006648","2.220331058722","2.41691188719568","2.6980671287952","2.72016738708556","2.930742803942","3.1571310223074","3.24733019655816","3.66719243810988","4.051846469985","4.097085487325","4.36579151050524","4.32295039092","4.5489147941","4.54834488823764","4.3019482695","4.006722820475","3.75292024225","3.26169536981188","2.8569710449725","2.573933736646","2.295064494614","2.15656444067948","1.971081935013","1.71176427005","1.43046510044","1.237886384114","0.955880413569","0.837182370323","0.752595660292","0.7409456281755"
"14.04.2023","v2","DK","1B2b","EM","CH4","DK_EM_1B2b_CH4","kt","2.37971391812","2.81450066368","2.740511804","2.89792419944","2.83572997584","3.30454605732","3.36666365048","4.17057870068","4.28801442652","4.48354288624","4.597070269","4.6430003964","4.55492408844","4.2170482711","4.4714232802","4.7796968862","4.5101086096","4.2617272244","3.9970112534","3.50571529892","3.3747728761","2.8073951347","2.4219385606","2.12543312112","2.1576262101","2.0440168332","2.0304687928","2.100498856","1.8754459621","1.500792278","0.9393631915","0.989841474"
"14.04.2023","v2","DK","1B2c","EM","CH4","DK_EM_1B2c_CH4","kt","1.22688651410616","2.4383835735506","2.51543199661016","2.18595178936624","2.22847510185244","1.75629972790252","1.9757611236586","2.73263481972388","1.98296710150748","4.15452471113068","2.74103896663052","2.95041912023904","2.44267438678512","2.55926885609952","2.87158712430668","2.02988985460561","2.05013067279455","2.05540625463412","1.55044174319163","1.0042359778393","1.34140573030182","0.907559612467","0.82468714708617","0.98416643056081","0.96683027031924","0.98785029003767","1.07479968297551","1.03891983292065","0.96509345752648","0.79979507613606","0.52518426766533","0.4529097381435"
"14.04.2023","v2","DK","2B10","EM","CH4","DK_EM_2B10_CH4","kt","NA","NA","NA","NA","NA","NA","NA","NA","NA","NA","NA","NA","NA","NA","NA","NA","NA","NA","NA","NA","NA","NA","NA","NA","NA","NA","NA","NA","NA","NA","NA","NA"
"14.04.2023","v2","DK","2D1","EM","CH4","DK_EM_2D1_CH4","kt","NA,NO","NA,NO","NA,NO","NA,NO","NA,NO","NA,NO","NA,NO","NA,NO","NA,NO","NA,NO","NA,NO","NA,NO","NA,NO","NA,NO","NA,NO","NA,NO","NA,NO","NA,NO","NA,NO","NA,NO","NA,NO","NA,NO","NA,NO","NA,NO","NA,NO","NA,NO","NA,NO","NA,NO","NA,NO","NA,NO","NA,NO","NA,NO"
"14.04.2023","v2","DK","2D2","EM","CH4","DK_EM_2D2_CH4","kt","0.00091114866265","0.00105459060854","0.00117281993312","0.0011368921146","0.001357188635","0.001111044022","0.001041807338","0.001063376556","0.001680228022","0.001987108464","0.002061165183","0.001991267597","0.002965237253","0.002996542978","0.003120102128","0.004206048088","0.003567796804","0.003917227017","0.003281667499","0.003146979858","0.004283188371","0.003826409983","0.003443218713","0.003592204803","0.003457881614","0.002933535495","0.002736025864","0.003134569856","0.002446870954","0.002524398316","0.002366750804","0.002741476793"
"14.04.2023","v2","DK","2D3","EM","CH4","DK_EM_2D3_CH4","kt","0.0111558166402","0.01141705460783","0.00976669332813","0.01089455843344","0.0096802693592","0.0138356018724","0.015616614046","0.0157272873296","0.01335850956","0.0122367827604","0.0129073912132","0.0173103449772","0.0148444514504","0.0117382885268","0.016361231502","0.017076494908","0.01611980755","0.0204156328684","0.0181999049936","0.0110054970608","0.0132243710676","0.0171477587644","0.0142262767372","0.0146989320808","0.0150916330356","0.015147905388","0.0158502250632","0.0161188315464","0.0179947714276","0.0154395567524","0.0168726031452","0.0158714671544"
"14.04.2023","v2","DK","2G4","EM","CH4","DK_EM_2G4_CH4","kt","0.0852276449","0.07722254735","0.097430627","0.0808081631","0.07438927585","0.0864280646","0.0982590204","0.11790917495","0.0995991772","0.1068589991","0.119195455","0.1023989293","0.1354355842","0.15938886575","0.1383035871","0.1244889094","0.15369680325","0.10752697785","0.09637692085","0.1038183525","0.08105929925","0.071585862","0.11441581","0.11418229325","0.09356313525","0.12434810575","0.06849616575","0.071662347","0.0728722945","0.0784576815","0.0601127235","0.098081995"
"14.04.2023","v2","DK","2H","EM","CH4","DK_EM_2H_CH4","kt","NA","NA","NA","NA","NA","NA","NA","NA","NA","NA","NA","NA","NA","NA","NA","NA","NA","NA","NA","NA","NA","NA","NA","NA","NA","NA","NA","NA","NA","NA","NA","NA"
"14.04.2023","v2","DK","3A1","EM","CH4","DK_EM_3A1_CH4","kt","145.3213632835411","145.8030447028624","142.9939647673205","144.4592356256381","141.1712013452942","140.7846418732928","140.3869730268251","134.4679692754961","133.6630516617441","127.7647748151827","125.5715587328955","127.2144422804716","124.5804589566393","122.7369160483386","117.8057560577315","117.6206792255473","117.3988803528276","120.0563204229634","122.1103134516751","122.8290243393791","124.2004263440081","123.0369233790105","127.0866134671097","128.1526924957577","127.9043183979922","126.8161769968924","128.902976558067","129.4963126591355","129.6339439078625","128.2159876849838","126.4267816244977","127.9858708730232"
"14.04.2023","v2","DK","3A2","EM","CH4","DK_EM_3A2_CH4","kt","2.55309217999443","2.80598127138045","2.70903696516901","2.44594382117403","2.32240206715664","2.35483407562011","2.59250687572249","2.66076590654352","2.70769311429542","2.80296652108694","2.89813586954586","3.01706162261231","2.97997050281611","3.0446486059109","3.11299598501937","3.1597572176853","3.18473664466331","3.12189021684099","3.00616937429859","2.96098961804844","2.89050277069863","2.58435441689013","2.52798188965285","2.49351688394958","2.47053377886951","2.38938077746297","2.37760586416734","2.35260449087171","2.36144266079932","2.45660731919725","2.32696431332204","2.29880550193281"
"14.04.2023","v2","DK","3A3","EM","CH4","DK_EM_3A3_CH4","kt","10.3499859212772","10.7662978313107","11.5549661284893","12.508926911274","12.1420480384712","12.0720846210115","12.122430657427","12.5539888108073","13.3851960362047","13.2914922310532","13.1973404548696","14.1753543386041","14.5105516663318","14.5452340474568","15.0464786644034","14.5813703058714","14.6615328745757","15.1045575415894","14.2671415825339","13.8725218224397","14.2544913813952","14.3277542581527","13.5945622843529","13.5498019024625","13.8247542283386","13.8188545535483","13.5718872921435","13.4443503366177","13.777647241344","13.1180346818717","14.6359533960007","14.0271009460487"
"14.04.2023","v2","DK","3A4","EM","CH4","DK_EM_3A4_CH4","kt","3.28956435982245","3.31478683959842","3.34650311883939","3.36578722063237","3.41551560424234","3.43828090825832","3.47273994338329","3.48853304051227","3.55165910163774","3.55007193281113","3.58621683084614","3.72059902966844","3.82332318291409","3.95018881432866","4.0693230118639","4.19097376707801","4.29231764278708","4.4088655876706","4.5442565296857","4.2919959654449","4.02745068646161","3.75050909884946","3.74085770426232","3.63749932706254","3.61425353782095","3.71998062003322","3.88448308844211","4.04323260468088","4.14959022576696","4.17521475177076","4.7645370028313","4.76639323188781"
"14.04.2023","v2","DK","3B","EM","CH4","DK_EM_3B_CH4","kt","90.19054335949097","94.15117501723809","100.15430401130808","105.21331736612285","103.96495363518225","105.24404643860981","106.73238536185922","110.13478020451048","115.36701088050658","113.51216240693466","117.20506470981594","122.24410241942319","126.4451493347428","128.83180200327266","131.61988144340083","125.22175782244415","119.3892974423512","118.89123371003537","114.76682745048534","113.77851310435373","116.17081932547451","115.58539843627081","113.02794298905931","110.62099896413879","111.51648424595213","110.53987759509438","110.04738939019785","109.22203158275241","111.01862576267435","106.30001790254634","112.18406211725593","109.54661133903963"
"14.04.2023","v2","DK","3D","EM","CH4","DK_EM_3D_CH4","kt","NE,NO","NE,NO","NE,NO","NE,NO","NE,NO","NE,NO","NE,NO","NE,NO","NE,NO","NE,NO","NE,NO","NE,NO","NE,NO","NE,NO","NE,NO","NE,NO","NE,NO","NE,NO","NE,NO","NE,NO","NE,NO","NE,NO","NE,NO","NE,NO","NE,NO","NE,NO","NE,NO","NE,NO","NE,NO","NE,NO","NE,NO","NE,NO"
"14.04.2023","v2","DK","3F","EM","CH4","DK_EM_3F_CH4","kt","0.066584835","0.067280976","0.058973967","0.0657355635","0.063255465","0.071500914","0.070967394","0.0749038995","0.0888138945","0.083955528","0.083795985","0.086782671","0.074369097","0.084739905","0.088215993","0.0893679345","0.0894259035","0.079435998","0.07655499","0.088791579","0.0677142045","0.067099374","0.075633642","0.080182413","0.080707212","0.075121668","0.0711133425","0.080603586","0.083044953","0.0967920705","0.096379362","0.098312859"
"14.04.2023","v2","DK","3J","EM","CH4","DK_EM_3J_CH4","kt","NA","NA","NA","NA","NA","NA","NA","NA","NA","NA","NA","NA","NA","NA","NA","NA","NA","NA","NA","NA","NA","NA","NA","NA","NA","NA","NA","NA","NA","NA","NA","NA"
"14.04.2023","v2","DK","4A","EM","CH4","DK_EM_4A_CH4","kt","0.18633681569","0.187148666498","0.214990987449","0.243692134045","0.27339113229","0.32922027753","0.38487010349","0.44056652742","0.49709157058","0.55183849545","0.60741408355","0.66294935637","0.71844433591","0.77389902217","0.85624974666","0.88753522293","0.93394197242","0.98148342334","1.03199734383","1.08444090687","1.04777644425","1.01111198164","1.00147912407","0.95701788581","0.9519681217","0.94134302415","0.9353073103","0.93032763084","0.92472416516","0.91444454183","0.89918905185","0.87238105675"
"14.04.2023","v2","DK","4B","EM","CH4","DK_EM_4B_CH4","kt","5.4691616618","5.4189675137","5.3687733656","5.3185792175","5.2683850695","5.2181909214","5.1679967733","5.1178026252","5.0676084771","5.0174143291","4.967220181","4.9170260329","4.8668318848","4.8166377368","4.7664435887","4.7162494406","4.6660552925","4.6158611444","4.5656669964","4.5154728483","4.3860781388","4.388942817256","4.444350470684","4.320021552527","4.290263964675","3.998503160747","3.934160024776","3.898873111248","3.782358231303","3.795274458865","3.708802198264","3.671747690683"
"14.04.2023","v2","DK","4C","EM","CH4","DK_EM_4C_CH4","kt","4.7654446316225","4.7177372232225","4.6700515221225","4.6223696616625","4.5747442016625","4.5270495552625","4.4793570335625","4.4317423917625","4.3841685805625","4.3363690238625","4.2887862164025","4.2413483604825","4.1939354562425","4.1461951265425","4.0984201425625","4.0513003779425","4.0028937968825","3.9553241751225","3.9076614324825","3.8600071364225","4.0245207287225","3.8953138006225","3.8450607124225","3.9420118466725","3.8728523112725","4.2684240783225","4.3214849470225","4.3664856707005","4.4980501280765","4.4712086034825","4.5406263903825","4.5846590777575"
"14.04.2023","v2","DK","4D","EM","CH4","DK_EM_4D_CH4","kt","0.071479685832","0.089970240218","0.108460794605","0.126951348991","0.145441903378","0.16393245776","0.18242301215","0.20091356654","0.21940412092","0.23789467531","0.2563852297","0.27487578408","0.29336633847","0.31185689286","0.33034744724","0.35014534757","0.39976052661","0.44937570566","0.49899088471","0.54860606376","0.59822124281","0.64783642186","0.71367617877","0.71996466719","0.78180659016","0.82209459005","0.90676905287","1.00515681401","1.0363997284","1.0763292411","1.1597704769","1.2562495947"
"14.04.2023","v2","DK","4E","EM","CH4","DK_EM_4E_CH4","kt","NA","NA","NA","NA","NA","NA","NA","NA","NA","NA","NA","NA","NA","NA","NA","NA","NA","NA","NA","NA","NA","NA","NA","NA","NA","NA","NA","NA","NA","NA","NA","NA"
"14.04.2023","v2","DK","4F","EM","CH4","DK_EM_4F_CH4","kt","NA","NA","NA","NA","NA","NA","NA","NA","NA","NA","NA","NA","NA","NA","NA","NA","NA","NA","NA","NA","NA","NA","NA","NA","NA","NA","NA","NA","NA","NA","NA","NA"
"14.04.2023","v2","DK","4H","EM","CH4","DK_EM_4H_CH4","kt","NA","NA","NA","NA","NA","NA","NA","NA","NA","NA","NA","NA","NA","NA","NA","NA","NA","NA","NA","NA","NA","NA","NA","NA","NA","NA","NA","NA","NA","NA","NA","NA"
"14.04.2023","v2","DK","5A1","EM","CH4","DK_EM_5A1_CH4","kt","54.7063060896559","54.4713249662634","53.3744189546793","52.2918133335183","48.5254783694213","44.5417610262615","42.6798002641274","38.7898033385643","35.4942216275527","35.8634489661014","35.1796110246481","34.8921591715768","31.7577814474616","32.5607339846001","27.5349923636034","26.5864675208046","28.5168611976491","26.8464673827222","25.8804206330318","24.5099941558606","22.1195658930333","22.5804562321774","22.1430721836636","21.0719534519006","20.8688302691794","19.8110332749473","18.7129171295342","17.9770296080793","17.5712543155913","16.9241334265956","16.6868482983099","15.7842905027984"
"14.04.2023","v2","DK","5A2","EM","CH4","DK_EM_5A2_CH4","kt","0.01659746806926","0.01687424482738","0.01713528381633","0.01738257147","0.01761988473354","0.01783078218909","0.01799013008537","0.01808443243786","0.01812961110529","0.01809399864967","0.0180016826708","0.0178506005417","0.01767406841786","0.01748505133462","0.01729840766502","0.0171169972368","0.01694351294984","0.01677117505156","0.01658598561882","0.0163843051673","0.01617784726026","0.01596536754187","0.01573846750389","0.01549644768664","0.01524604967641","0.0149848840622","0.01471756811005","0.01445792683513","0.01419490312667","0.01392695056354","0.01365753675956","0.01339392261975"
"14.04.2023","v2","DK","5B1","EM","CH4","DK_EM_5B1_CH4","kt","1.0682472","1.1829709","1.2973588","1.4119248","1.5261865","1.447962","1.682602","1.961682","2.030556","2.336812","2.484966","2.354042","2.604052","2.712848","2.490758","2.63443","2.794434","3.08412","2.8333942","3.0959882","2.9578052","2.8195802","2.6930568","2.8596028","2.8139904","3.0416814","3.0498194","3.3033208","3.3377614","3.4697992","3.3680542","3.3655016"
"14.04.2023","v2","DK","5B2","EM","CH4","DK_EM_5B2_CH4","kt","0.22376449368884","0.33012","0.32172","0.48216","0.4572056899212","0.62650456955851","0.79369851204","0.88477563522807","1.037603653212","1.0464151323696","1.21101575658","1.3716770326728","1.57240428534","1.9050716469986","1.92724739314273","1.99518236628939","2.29718719026605","2.30826914671945","2.36407954051463","2.58484561305213","2.67463175394555","2.580816","2.75016","2.884518","3.661392","4.36674","6.547884","7.521228","8.43654","9.705152","11.440442","14.376257"
"14.04.2023","v2","DK","5C1","EM","CH4","DK_EM_5C1_CH4","kt","0.00050918916","0.00050717616","0.0005182638","0.00054052344","0.00055292658714","0.00061919431614","0.00079732738817","0.00093494139273","0.00137221167026","0.00147725768015","0.00156158573754","0.0016136141426","0.00164983139093","0.00165325539015","0.0016745574225","0.0017073053091","0.001784687938","0.00181600895064","0.00181824427904","0.00183272289264","0.00185461319612","0.00180425901253","0.0018096763076","0.0018151115768","0.00181678179671","0.00182843722504","0.00185011141433","0.00186169672627","0.00189555030413","0.00188973005602","0.00188232917338","0.00190531337524"
"14.04.2023","v2","DK","5C2","EM","CH4","DK_EM_5C2_CH4","kt","0.10768554050556","0.10863948993347","0.10925394782699","0.11021076611545","0.11141040006595","0.11203123669307","0.11071704222535","0.10999436717164","0.10465746245236","0.09711895076832","0.08400583458226","0.08434453794728","0.08112680729042","0.07671678307514","0.07318497616248","0.07363538326755","0.07378044212505","0.07380983873084","0.07369885180565","0.07393411730989","0.07455674752181","0.07501796772145","0.07491796321858","0.0747358606169","0.07474573120514","0.07469170079792","0.07487581465114","0.07522167428985","0.07577457959124","0.07635893147639","0.07682897862032","0.07736798851239"
"14.04.2023","v2","DK","5D1","EM","CH4","DK_EM_5D1_CH4","kt","2.563623720892","2.594036472789","2.542314822057","2.504209576093","2.576012992875","2.71454440847","2.705077373328","2.885330935406","2.858161364784","2.945674169714","3.08332070882","3.068708091565","3.071254364725","3.071610404487","2.996570628394","3.106602632132","3.056131019326","3.034747259245","2.98410595225","2.943294085526","2.929323955326","2.873780947191","2.981908467458","3.01429033478","3.127939096625","2.928566780804","3.045025799967","3.100056766898","3.140535835206","3.18316384302","3.346995246735","3.312053490561"
"14.04.2023","v2","DK","5D2","EM","CH4","DK_EM_5D2_CH4","kt","IE,NA","IE,NA","IE,NA","IE,NA","IE,NA","IE,NA","IE,NA","IE,NA","IE,NA","IE,NA","IE,NA","IE,NA","IE,NA","IE,NA","IE,NA","IE,NA","IE,NA","IE,NA","IE,NA","IE,NA","IE,NA","IE,NA","IE,NA","IE,NA","IE,NA","IE,NA","IE,NA","IE,NA","IE,NA","IE,NA","IE,NA","IE,NA"
"14.04.2023","v2","DK","5E","EM","CH4","DK_EM_5E_CH4","kt","0.10890804502956","0.11221574316847","0.1209205858104","0.108166262285","0.10861818540932","0.12350438766254","0.12482467742582","0.11612424653593","0.10540465643355","0.1122887052727","0.11027194131633","0.10862943457246","0.1056019802517","0.11727983862479","0.10299698774385","0.10670399935927","0.10914873155305","0.11353032704214","0.12253740508792","0.12462148528658","0.1145458110666","0.11175859240079","0.10756560260833","0.10927815841773","0.10432166372575","0.10944864026034","0.12253372749756","0.11807779452299","0.12240768012255","0.1125825217328","0.1128622608507","0.10437793482086"
"14.04.2023","v2","DK","1A1a","EM","N2O","DK_EM_1A1a_N2O","kt","0.26730490970221","0.34750877517891","0.31009323646448","0.32844632910953","0.35992386379307","0.34538623194669","0.46882763912136","0.39094166292861","0.36153153955398","0.34473747818356","0.31957764414989","0.34160055973585","0.34843859238296","0.39253187947111","0.3423641052242","0.31365370853033","0.38231194107682","0.32928373077852","0.3182763461426","0.3269920939796","0.34754266793691","0.30236746770441","0.28040605722855","0.30062842477618","0.26922951630872","0.25101377333833","0.27239096581953","0.2639707467705","0.2652675363759","0.2416860672886","0.23170134743953","0.26744876804833"
"14.04.2023","v2","DK","1A1b","EM","N2O","DK_EM_1A1b_N2O","kt","0.00218333224","0.002688094974","0.003644619712","0.00798214996505","0.00861392149","0.008313925462","0.00910365252917","0.00749146109399","0.0073999131","0.00779738198","0.0073899131","0.0070915635","0.0067566674","0.0064739447888","0.0056568000912","0.0045447859976","0.0044609396144","0.004168282588","0.0035959215392","0.003678673991","0.0031011365718","0.00305269883","0.003531869808","0.003471396965","0.00373557436664","0.0038171894506","0.00359591294229","0.00352554694724","0.00400472348821","0.00381602470152","0.00397240706467","0.00423614910014"
"14.04.2023","v2","DK","1A1c","EM","N2O","DK_EM_1A1c_N2O","kt","0.02012009671868","0.0206054485562","0.02372331804052","0.02398203358687","0.02642726512143","0.02813400782975","0.03341017019914","0.04356267636899","0.0483734746422","0.05264682191338","0.05590659005785","0.05003122503765","0.05051954235858","0.04541049450827","0.04126287143462","0.03961743534757","0.03502876225421","0.02881000466857","0.02956296372677","0.02766917707338","0.02862744874778","0.02743421818516","0.02653027856277","0.02521262378316","0.02421283191232","0.02507450582956","0.02319108588594","0.02378815716111","0.02205033077214","0.02125248562874","0.01542685353977","0.01541822548099"
"14.04.2023","v2","DK","1A2a","EM","N2O","DK_EM_1A2a_N2O","kt","0.00235829917075","0.00257362827731","0.00253044689534","0.00263695088151","0.00269968577969","0.00264790440256","0.00238276685878","0.00244282762287","0.00247062997657","0.00234818325799","0.00230795126912","0.00244103625643","0.00155050471844","0.00198279493267","0.00193219010084","0.00198773372358","0.00221900558293","0.00248404243593","0.00224918196917","0.0011433206953","0.00139369738004","0.00143289099793","0.00157375489209","0.00164040581074","0.00173984383923","0.00169710424928","0.0018405846405","0.00194289400384","0.00203206111019","0.00192160037701","0.00188672191431","0.0020778016187"
"14.04.2023","v2","DK","1A2b","EM","N2O","DK_EM_1A2b_N2O","kt","NO,IE","NO,IE","NO,IE","NO,IE","NO,IE","NO,IE","NO,IE","NO,IE","NO,IE","NO,IE","NO,IE","NO,IE","NO,IE","NO,IE","NO,IE","NO,IE","NO,IE","NO,IE","NO,IE","NO,IE","NO,IE","NO,IE","NO,IE","NO,IE","NO,IE","NO,IE","NO,IE","NO,IE","NO,IE","","",""
"14.04.2023","v2","DK","1A2c","EM","N2O","DK_EM_1A2c_N2O","kt","0.01474136204843","0.01555753923396","0.01641344247116","0.01443567150117","0.01461647917881","0.01419296790334","0.01507357748861","0.01436925339943","0.01452734980077","0.01262354904464","0.01264375781801","0.01304154666315","0.01267339204478","0.01108465004403","0.01006949847036","0.00841381702267","0.00841458108606","0.00659481100465","0.00723745051817","0.00689977633924","0.0077269464458","0.00758307362058","0.00701950293837","0.0072144465396","0.00741776150687","0.00727662723653","0.00720044489874","0.00564750657911","0.00502798665956","0.00472029118045","0.00454358011229","0.00497429752234"
"14.04.2023","v2","DK","1A2d","EM","N2O","DK_EM_1A2d_N2O","kt","0.00943872054658","0.00903771945057","0.00715729798945","0.00671877277816","0.00687911411448","0.00617436049906","0.00723374786373","0.00663256514766","0.00666729616839","0.00620256943472","0.00549066171714","0.00512829109099","0.00523321410697","0.00481595411189","0.00458130733635","0.00458361470933","0.00448283538078","0.01123649627917","0.01557082742526","0.01827961682143","0.019301034559","0.02148290140022","0.01600169876983","0.00580224595122","0.00376444500598","0.00285774290489","0.00368136142894","0.00263026442364","0.0031674956352","0.00308914977358","0.00346270602263","0.00360017238"
"14.04.2023","v2","DK","1A2e","EM","N2O","DK_EM_1A2e_N2O","kt","0.05715195190982","0.05759419297416","0.05457985636554","0.05536329729826","0.06334698615188","0.05886694383137","0.0572059748333","0.05601620824508","0.05493861568584","0.05809899463762","0.05715460470244","0.05574495196441","0.05494414155813","0.053358725614","0.05258516293678","0.04806850438648","0.05382929535441","0.04024776799313","0.03615176467858","0.0335581597693","0.04087989173516","0.03529150405033","0.03292515723962","0.02998862018364","0.03053998384259","0.02855016598125","0.03006985739075","0.031916199119","0.03456358096926","0.03301260185324","0.0339584504186","0.03267703350559"
"14.04.2023","v2","DK","1A2f","EM","N2O","DK_EM_1A2f_N2O","kt","0.03009965822722","0.0415092276515","0.04151901427078","0.03569286813612","0.03973220921582","0.1013085960862","0.09664339387645","0.09911256618655","0.10460310502962","0.10236017482386","0.09612277426894","0.09399170092928","0.0881188327958","0.08034968440888","0.09246410318842","0.08588549579262","0.09748195342884","0.11177235476943","0.09051194036762","0.06462365936361","0.06220660874094","0.06868667700983","0.06605134253472","0.06797406898524","0.06217938427294","0.07364246283538","0.10127394248556","0.09711644522598","0.11373044374109","0.09421097278422","0.09981865731983","0.11828284136037"
"14.04.2023","v2","DK","1A2g","EM","N2O","DK_EM_1A2g_N2O","kt","0.09534894033501","0.09497124477033","0.09576909200406","0.0913621053583","0.0744636779888","0.07235446307935","0.0743670050584","0.07349190681713","0.07435608594542","0.07191276786032","0.07199810352429","0.07246726199722","0.06280689431946","0.06285155399268","0.06273044293945","0.06189011002401","0.06324224359551","0.06666163028768","0.07830193508201","0.06494991394743","0.07417060730659","0.07092291432489","0.06110301040253","0.0557781586783","0.05142240551622","0.0550732726605","0.0476694304404","0.0550640067104","0.05118604607293","0.05201005003082","0.0497778527732","0.05014386923697"
"14.04.2023","v2","DK","1A3a","EM","N2O","DK_EM_1A3a_N2O","kt","0.01176494438981","0.01130403666152","0.01105672114113","0.01077499588858","0.010941481546","0.01155814312484","0.01300985302222","0.01315118542685","0.01200266263524","0.01105227627333","0.01006026163161","0.01005009644991","0.0096244744377","0.01013405300311","0.00991589977231","0.01032703484047","0.01056867389975","0.0110358036843","0.01098629930217","0.01024303754974","0.01071491027198","0.0106627040616","0.00859087476711","0.00837889996058","0.00847343935847","0.00816858135824","0.00847326322901","0.00855244025893","0.00837446375509","0.00846274069851","0.00468398544958","0.00530096738205"
"14.04.2023","v2","DK","1A3b","EM","N2O","DK_EM_1A3b_N2O","kt","0.29609240604417","0.31004652644658","0.32325516798865","0.32981456324092","0.34793155280312","0.35283167912442","0.35777845271541","0.36598079363917","0.36622327005874","0.36565902422562","0.36110568220908","0.35513463828287","0.35243832044691","0.35476519731776","0.35208615536055","0.33955747663878","0.33735976416547","0.35383186775691","0.35878239581936","0.35091869754193","0.36209888927172","0.38335870966746","0.38704871592837","0.39215137673315","0.4130976962477","0.42482616403024","0.43689950028583","0.44198664244663","0.45121303424877","0.44321787583111","0.41883482339186","0.42529107858105"
"14.04.2023","v2","DK","1A3c","EM","N2O","DK_EM_1A3c_N2O","kt","0.0089825538272","0.0091368826304","0.0096634387584","0.0100298625792","0.0090900648","0.0091697289984","0.0091003222592","0.008860248288","0.00747611932032","0.00702313804416","0.0068963547072","0.0063925958208","0.00637186698624","0.00660807928704","0.00654460727424","0.00702635181696","0.0068642169792","0.00688920406272","0.00716478508032","0.0069682628736","0.0073310174784","0.00754883092992","0.0075471436992","0.00750070468224","0.00763195522967","0.00751632777576","0.00767308935156","0.00738454680976","0.0067817793446","0.0067693766156","0.00594534806941","0.00558514337696"
"14.04.2023","v2","DK","1A3d","EM","N2O","DK_EM_1A3d_N2O","kt","0.01906532978192","0.0213699674957","0.02182840437716","0.01955820308936","0.01818737023211","0.01908273646921","0.02071857613653","0.02070007590495","0.01780522034433","0.01575486594111","0.01586814546893","0.01690644262081","0.01823479196961","0.01802670321525","0.01626412542083","0.01849213685417","0.01705614146418","0.01582499918027","0.0192974624302","0.01813286902668","0.01625976833592","0.01594396381284","0.01568741041005","0.01550190697807","0.01277387087545","0.01216186129992","0.01390900150919","0.01431306623626","0.01375629215413","0.01391763209463","0.01380900130198","0.0154835366787"
"14.04.2023","v2","DK","1A4a","EM","N2O","DK_EM_1A4a_N2O","kt","0.02326887104483","0.02333865233707","0.02339256662395","0.02481005479771","0.0235474149862","0.02538872556686","0.02864016221251","0.02681796084697","0.02470521353942","0.02727871738554","0.02169627985684","0.0212305253693","0.02153304911243","0.02858230941517","0.02425435838143","0.02603711800906","0.0295693891744","0.02800170656555","0.02920725826784","0.02693472243871","0.02597159473688","0.02460133857898","0.0250782451334","0.02437649708439","0.02252879110864","0.02390405711236","0.02597168683705","0.02670979206179","0.02661943730436","0.02498503648851","0.02419990236759","0.02731678375479"
"14.04.2023","v2","DK","1A4b","EM","N2O","DK_EM_1A4b_N2O","kt","0.10870109621847","0.11849695026399","0.11515771944822","0.12558606169525","0.11957467104929","0.12049008735223","0.1269305974856","0.1219750100269","0.1154163247991","0.11462672562244","0.1203952756546","0.13342973704248","0.13296225641405","0.14504568302116","0.14967107470681","0.16493682621271","0.17467059876679","0.19552198425463","0.19059811316952","0.18939585576331","0.20397924784297","0.18178999546459","0.17523867899806","0.17971113436437","0.17014012294323","0.19385563183429","0.20423586311419","0.19482247569298","0.18534575094064","0.17267589122655","0.16277463211602","0.16573749803126"
"14.04.2023","v2","DK","1A4c","EM","N2O","DK_EM_1A4c_N2O","kt","0.06689574583156","0.06854703186676","0.06634527785024","0.0636564678537","0.0636151997328","0.06405534495581","0.063517118632","0.0623129498414","0.06308638376538","0.06356509628285","0.0676511608249","0.06996295988005","0.06911313126324","0.06955442777177","0.06787998163164","0.06899182284567","0.06937838209228","0.06882647125541","0.06660060751917","0.06678468103342","0.06846095285102","0.06562840521836","0.06454928766492","0.06527614155334","0.06442615714266","0.06431362120806","0.06348828258321","0.06579689632333","0.06699486986366","0.06705441845914","0.06688176479831","0.06936849093114"
"14.04.2023","v2","DK","1A5b","EM","N2O","DK_EM_1A5b_N2O","kt","0.00502429251949","0.00943225704348","0.00533998091375","0.00856093417715","0.00921094321845","0.0083811721919","0.00697749404398","0.00629239685785","0.0072353001758","0.00728827897277","0.00582881544051","0.00499326573057","0.00542801652208","0.00557782715258","0.00964502316396","0.01087585595574","0.00697770296942","0.00860918434645","0.00669547398117","0.0084387573958","0.00707801129982","0.01007669162436","0.00772501030309","0.00859184521821","0.00843181903222","0.00728606353752","0.00779905018274","0.01157779316539","0.00831028703109","0.00720582930227","0.0087613652726","0.00835238487376"
"14.04.2023","v2","DK","1B1a","EM","N2O","DK_EM_1B1a_N2O","kt","NE,NO","NE,NO","NE,NO","NE,NO","NE,NO","NE,NO","NE,NO","NE,NO","NE,NO","NE,NO","NE,NO","NE,NO","NE,NO","NE,NO","NE,NO","NE,NO","NE,NO","NE,NO","NE,NO","NE,NO","NE,NO","NE,NO","NE,NO","NE,NO","NE,NO","NE,NO","NE,NO","NE,NO","NE,NO","NE,NO","NE,NO","NE,NO"
"14.04.2023","v2","DK","1B2a","EM","N2O","DK_EM_1B2a_N2O","kt","5.7879649e-06","3.23317e-09","2.305315e-08","1.9981e-10","4.7934e-10","3.09675e-09","3.01265e-09","6.183e-11","1.018192e-08","7.53895e-09","1.14114e-07","NO,NA","1.793150961e-05","NO,NA","NO,NA","1.42989669e-06","NO,NA","NO,NA","NO,NA","1.29551e-08","NO,NA","NO,NA","NO,NA","2.68759e-09","NO,NA","5.9056e-08","NO,NA","NO,NA","NO,NA","NO,NA","NO,NA","NO,NA"
"14.04.2023","v2","DK","1B2c","EM","N2O","DK_EM_1B2c_N2O","kt","0.00041195787614","0.00064140416751","0.00065599753754","0.0005935704159","0.00058848232167","0.00049941041498","0.00053101241537","0.00061329020354","0.00051467755986","0.00092524759166","0.00066006882585","0.00064614665362","0.00063671249486","0.0005858111928","0.00067470511153","0.0005652523581","0.00056525135314","0.00057502731919","0.0004996861514","0.00031232462486","0.00040366350188","0.00031336994359","0.00034143108015","0.00031294170115","0.00037340488884","0.00029710951008","0.00033683943802","0.00030053334722","0.00031920521811","0.00027416580822","0.0002182237838","0.00018133077726"
"14.04.2023","v2","DK","2B2","EM","N2O","DK_EM_2B2_N2O","kt","3.3642","3.080112","2.721264","2.564268","2.601648","2.91564","2.69136","2.736216","2.601648","3.06516","3.237108","2.855832","2.497","2.886","1.712","","","","","","","","","","","","","","","","",""
"14.04.2023","v2","DK","2B10","EM","N2O","DK_EM_2B10_N2O","kt","NA","NA","NA","NA","NA","NA","NA","NA","NA","NA","NA","NA","NA","NA","NA","NA","NA","NA","NA","NA","NA","NA","NA","NA","NA","NA","NA","NA","NA","NA","NA","NA"
"14.04.2023","v2","DK","2D1","EM","N2O","DK_EM_2D1_N2O","kt","NA,NO","NA,NO","NA,NO","NA,NO","NA,NO","NA,NO","NA,NO","NA,NO","NA,NO","NA,NO","NA,NO","NA,NO","NA,NO","NA,NO","NA,NO","NA,NO","NA,NO","NA,NO","NA,NO","NA,NO","NA,NO","NA,NO","NA,NO","NA,NO","NA,NO","NA,NO","NA,NO","NA,NO","NA,NO","NA,NO","NA,NO","NA,NO"
"14.04.2023","v2","DK","2D2","EM","N2O","DK_EM_2D2_N2O","kt","0.00018072370168","0.00020917499674","0.00023262544128","0.0002254992624","0.00026919444","0.000220372368","0.000206639472","0.000210917664","0.000333268368","0.000394137216","0.000408826152","0.000394962168","0.000588146232","0.000594355632","0.000618863232","0.000834257472","0.000707662176","0.000776970648","0.000650909256","0.000624194352","0.000849558024","0.000758957352","0.000682952472","0.000712503432","0.000685860816","0.00058185828","0.000542682816","0.000621732864","0.000485329776","0.000500707104","0.000469438176","0.000543763992"
"14.04.2023","v2","DK","2D3","EM","N2O","DK_EM_2D3_N2O","kt","NO,NA","NO,NA","NO,NA","NO,NA","NO,NA","NO,NA","NO,NA","NO,NA","NO,NA","NO,NA","NO,NA","NO,NA","NO,NA","NO,NA","NO,NA","NO,NA","NO,NA","NO,NA","NO,NA","NO,NA","NO,NA","NO,NA","NO,NA","NO,NA","NO,NA","NO,NA","NO,NA","NO,NA","NO,NA","NO,NA","NO,NA","NO,NA"
"14.04.2023","v2","DK","2G3","EM","N2O","DK_EM_2G3_N2O","kt","0.058595","0.06042","0.058675","0.0591875","0.05798","0.06087","0.058865","0.0584475","0.05753","0.05839","0.05709","0.0574225","0.05761","0.058432","0.05641","0.0548825","0.055865","0.06487","0.05017","0.0633775","0.0512225","0.0586225","0.04528","0.0519675","0.0526075","0.0537325","0.0537325","0.05529","0.054835","0.0549025","0.0582225","0.0606375"
"14.04.2023","v2","DK","2G4","EM","N2O","DK_EM_2G4_N2O","kt","0.003527080847","0.0042466085505","0.0046176964375","0.004095929588","0.004725583183","0.0067843687405","0.006345702222","0.005320057411","0.007850022826","0.0139730243705","0.010518728435","0.008436479819","0.0103504381685","0.0130298268875","0.017913929688","0.008239104177","0.009403695725","0.009659859543","0.0093922272405","0.011361927195","0.01133336213","0.00991346403","0.00771612557","0.009574883675","0.008047949965","0.012157125025","0.00936515183","0.008683438145","0.012712797085","0.008934654595","0.008767494445","0.010402337245"
"14.04.2023","v2","DK","2H","EM","N2O","DK_EM_2H_N2O","kt","NA","NA","NA","NA","NA","NA","NA","NA","NA","NA","NA","NA","NA","NA","NA","NA","NA","NA","NA","NA","NA","NA","NA","NA","NA","NA","NA","NA","NA","NA","NA","NA"
"14.04.2023","v2","DK","3B","EM","N2O","DK_EM_3B_N2O","kt","3.24936339458881","3.28378856661694","3.38665588183794","3.38135522061567","3.25061486691795","3.14875612301821","3.15924531134887","3.21004968461845","3.32830129072963","3.26537627335983","3.25083584748389","3.35414300825828","3.41829571064201","3.37619323652179","3.48698365055106","3.27879846593292","3.05156974047931","3.02717076343108","2.84585970397584","2.67692013903747","2.64726853259158","2.59263517042341","2.54113523735218","2.51900540334166","2.50688960613841","2.47290302989688","2.4476032813525","2.43866033964058","2.48147648695703","2.31944550385914","2.35380152047458","2.25368904365022"
"14.04.2023","v2","DK","3D","EM","N2O","DK_EM_3D_N2O","kt","20.64667373993265","19.97957544638234","19.32427294871089","18.67012526099276","18.46342339292354","18.09001647586883","16.90688074697612","16.94836073164052","17.08802206001767","16.41732460562234","16.20134265790417","15.74879870855943","15.67744317019073","15.06256525272239","15.24266224625438","15.18995707038589","15.01768659585916","15.54539725442489","15.8421266218917","15.64669744578116","15.09835079029719","15.32172365942165","15.14367973774007","15.10150756229965","15.55777355838227","15.43097185250824","15.92332403641567","16.11890730239279","15.21552481549558","16.05201754767986","16.28362999772808","15.29810052165668"
"14.04.2023","v2","DK","3F","EM","N2O","DK_EM_3F_N2O","kt","0.0010513395","0.0010623312","0.0009311679","0.00103792995","0.0009987705","0.0011289618","0.0011205378","0.00118269315","0.00140232465","0.0013256136","0.0013230945","0.0013702527","0.0011742489","0.0013379985","0.0013928841","0.00141107265","0.00141198795","0.0012542526","0.001208763","0.0014019723","0.00106917165","0.0010594638","0.0011942154","0.0012660381","0.0012743244","0.0011861316","0.00112284225","0.0012726882","0.0013112361","0.00152829585","0.0015217794","0.0015523083"
"14.04.2023","v2","DK","3J","EM","N2O","DK_EM_3J_N2O","kt","NA","NA","NA","NA","NA","NA","NA","NA","NA","NA","NA","NA","NA","NA","NA","NA","NA","NA","NA","NA","NA","NA","NA","NA","NA","NA","NA","NA","NA","NA","NA","NA"
"14.04.2023","v2","DK","4A","EM","N2O","DK_EM_4A_N2O","kt","0.090596029883","0.088964276192","0.088727494749","0.088437892456","0.088103160112","0.087720413667","0.087281000972","0.086797419575","0.086312930228","0.08568333043","0.085054222681","0.084375439482","0.083647680831","0.08287094673","0.083536729678","0.081013608948","0.080065347556","0.078956913853","0.077863450837","0.07672307751","0.077574473435","0.07842586936","0.078700419932","0.079764095398","0.079939298404","0.080172473564","0.080338778062","0.080526230725","0.080683152042","0.080978905559","0.081318932521","0.082248541374"
"14.04.2023","v2","DK","4B","EM","N2O","DK_EM_4B_N2O","kt","0.00018631870158","0.00019054881902","0.00019689399518","0.00020535423006","0.00021592952366","0.00022861987599","0.00024342528703","0.00026034575679","0.00027938128528","0.00030053187248","0.00032379751841","0.00034917822305","0.00037667398642","0.0004062848085","0.00043801068931","0.0010076906421","0.0010819071055","0.0011773688603","0.0012940759064","0.0014320282438","0.0015912258726","0.0017716687927","0.0022132353851","0.0020478738874","0.0028965294701","0.013035711325","0.014071731173","0.0052665814298","0.012937005548","0.011771819668","0.0102190392","0.0087378171301"
"14.04.2023","v2","DK","4C","EM","N2O","DK_EM_4C_N2O","kt","2.271745929e-05","2.058301929e-05","2.043055929e-05","2.062875729e-05","2.352549729e-05","2.367795729e-05","2.398287729e-05","3.206325729e-05","4.349775729e-05","3.236817729e-05","3.409097529e-05","5.827113129e-05","8.223784329e-05","7.461484329e-05","6.872988729e-05","0.001104289265","0.001037786213","0.001048123001","0.001049983013","0.001052086961","0.001061691941","0.001064436221","0.00057414547929","0.000235801665","0.0022076964643","0.0076347038507","0.0016283414636","2.86030206e-05","0.0026860944387","0.00042637066843","0.00054867449057","0.00058805863521"
"14.04.2023","v2","DK","4D","EM","N2O","DK_EM_4D_N2O","kt","0.00075220471092","0.00075220471092","0.00075220471092","0.00075220471092","0.00075220471092","0.00075220471092","0.00075220471092","0.00075220471092","0.00075220471092","0.00075220471092","0.00075220471092","0.00075220471092","0.00075220471092","0.00075220471092","0.00075220471092","0.00075220471092","0.00075220471092","0.00075220471092","0.00075220471092","0.00075220471092","0.00075220471092","0.00075220471092","0.00075220471092","0.00037704496788","0.00037704496788","0.00037704496788","0.00037704496788","0.00037704496788","0.00037704496788","0.00037704496788","0.00037704496788","0.00037704496788"
"14.04.2023","v2","DK","4E","EM","N2O","DK_EM_4E_N2O","kt","0.14709499688754","0.14596897799808","0.14484295911062","0.14371694022216","0.1425909213347","0.13655238827024","0.13051385520478","0.12447532214132","0.11843678907586","0.1123982560104","0.10635972294594","0.10032118988048","0.09428265681502","0.08824412375156","0.0822055906861","0.07716019266196","0.07486580257583","0.07257141249069","0.07027702240556","0.06798263231942","0.06568824223429","0.06339385214815","0.06506158533643","0.06326246790501","0.064872684046","0.06242710295939","0.0636085469135","0.06175124243","0.0596989789532","0.0568190559664","0.0586594918028","0.0604210909333"
"14.04.2023","v2","DK","4F","EM","N2O","DK_EM_4F_N2O","kt","NA","NA","NA","NA","NA","NA","NA","NA","NA","NA","NA","NA","NA","NA","NA","NA","NA","NA","NA","NA","NA","NA","NA","NA","NA","NA","NA","NA","NA","NA","NA","NA"
"14.04.2023","v2","DK","4H","EM","N2O","DK_EM_4H_N2O","kt","NA","NA","NA","NA","NA","NA","NA","NA","NA","NA","NA","NA","NA","NA","NA","NA","NA","NA","NA","NA","NA","NA","NA","NA","NA","NA","NA","NA","NA","NA","NA","NA"
"14.04.2023","v2","DK","5B1","EM","N2O","DK_EM_5B1_N2O","kt","0.07454456","0.08266638","0.09077348","0.09888828","0.1069881","0.100838","0.11777","0.137518","0.146272","0.173604","0.19043","0.18023","0.207596","0.214416","0.178602","0.18911","0.20171","0.224508","0.20600168","0.22375568","0.21245048","0.20114328","0.19291632","0.20518232","0.20334016","0.21836696","0.22186296","0.24317792","0.24216216","0.25284408","0.24717208","0.24603264"
"14.04.2023","v2","DK","5B2","EM","N2O","DK_EM_5B2_N2O","kt","NO,NA","NO,NA","NO,NA","NO,NA","NO,NA","NO,NA","NO,NA","NO,NA","NO,NA","NO,NA","NO,NA","NO,NA","NO,NA","NO,NA","NO,NA","NO,NA","NO,NA","NO,NA","NO,NA","NO,NA","NO,NA","NO,NA","NO,NA","NO,NA","NO,NA","NO,NA","NO,NA","NO,NA","NO,NA","NO,NA","NO,NA","NO,NA"
"14.04.2023","v2","DK","5C1","EM","N2O","DK_EM_5C1_N2O","kt","0.00063649077","0.000633974808","0.000647834646","0.000675659484","0.00067366055095","0.00069876480615","0.00071685400042","0.00073235090036","0.00077751861904","0.00082678659709","0.00084467333707","0.00085416415395","0.00086971691059","0.00086527827162","0.0008843358828","0.00091682451948","0.00100489986853","0.00105001703795","0.00106151381094","0.00107178816655","0.00109222933569","0.00102851580654","0.00103064534475","0.00102967267971","0.00102219703869","0.0010376688682","0.00106157218651","0.00106354209377","0.00109745443275","0.00108619086727","0.00106802297411","0.00108778825636"
"14.04.2023","v2","DK","5C2","EM","N2O","DK_EM_5C2_N2O","kt","0.00248505093474","0.00250706515231","0.00252124494985","0.00254332537189","0.00257100923229","0.00258533623138","0.00255500866674","0.00253833155011","0.00241517221044","0.00224120655619","0.00193859618267","0.00194641241417","0.00187215709131","0.00177038730173","0.00168888406529","0.0016992780754","0.0017026255875","0.00170330397071","0.00170074273398","0.00170617193792","0.00172054032743","0.00173118387049","0.00172887607427","0.00172467370654","0.00172490148934","0.0017236546338","0.00172790341502","0.0017358847913","0.00174864414442","0.00176212918792","0.0017729764297","0.00178541511952"
"14.04.2023","v2","DK","5D1","EM","N2O","DK_EM_5D1_N2O","kt","0.40292092247184","0.38517426696626","0.36743464490484","0.3435885263153","0.40530273126619","0.4225831712999","0.39636465475917","0.3944427637724","0.42001172952496","0.4086558766405","0.44288425457966","0.43642006539982","0.54212873668166","0.43538395265324","0.39852589901078","0.49091878329811","0.3990565571541","0.47505746495088","0.62570603962376","0.39984397397494","0.42150117440525","0.45918613199614","0.40813272512084","0.45216843274196","0.46035804242072","0.4696771824022","0.44706379848988","0.46725474652562","0.45453429317418","0.45198700147722","0.45591206758062","0.45752344936436"
"14.04.2023","v2","DK","5D2","EM","N2O","DK_EM_5D2_N2O","kt","0.75971459029395","0.67866659029395","0.70968659029395","0.44397059029395","0.47076659029395","0.42694259029395","0.30444659029395","0.31632659029395","0.25481459029395","0.16162259029395","0.16743059029395","0.15330659029395","0.14340659029395","0.10314659029395","0.09654659029395","0.09190041808615","0.09208381239787","0.0730024014735","0.08117494240621","0.0565037040846","0.07102151192772","0.06700464317602","0.05055621789422","0.05515238817808","0.05683764384238","0.0640548560114","0.06690996368194","0.05679685491642","0.07293704459812","0.05142075271708","0.05934490493943","0.04252957940466"
"14.04.2023","v2","DK","5E","EM","N2O","DK_EM_5E_N2O","kt","NE","NE","NE","NE","NE","NE","NE","NE","NE","NE","NE","NE","NE","NE","NE","NE","NE","NE","NE","NE","NE","NE","NE","NE","NE","NE","NE","NE","NE","NE","NE","NE"
"14.04.2023","v2","DK","2B10","EM","HFC","DK_EM_2B10_HFC","kt","NA","NA","NA","NA","NA","NA","NA","NA","NA","NA","NA","NA","NA","NA","NA","NA","NA","NA","NA","NA","NA","NA","NA","NA","NA","NA","NA","NA","NA","NA","NA","NA"
"14.04.2023","v2","DK","2E5","EM","HFC","DK_EM_2E5_HFC","kt","","","","","","","","","","","","8.68","","","","","0.992","2.976","1.488","2.976","4.464","4.464","1.488","","1.736","","","","","","",""
"14.04.2023","v2","DK","2F1","EM","HFC","DK_EM_2F1_HFC","kt","NO,NE","NO,NE","0.5434","3.68827500275","16.65126097775","45.40680373339","111.0132902319161","180.33367004670382","266.0617772811368","449.78455056514645","536.9155845197271","529.0209707162818","581.3263880706519","638.6794153222668","679.1675952957488","749.573628879778","779.8770976806511","819.2704736335717","831.2390821466369","863.9697293525298","729.5513768228944","665.5150550044075","682.8024087918768","644.8885666429568","601.7217369441553","475.46759608983535","546.7035626259182","461.2959612198421","526.9722133612232","381.35226393938274","380.9035743530157","345.3921823893847"
"14.04.2023","v2","DK","2F2","EM","HFC","DK_EM_2F2_HFC","kt","","","3.014","97.11570412","127.85999632","192.2460382","259.57833044","193.0194942486","234.4206824572","181.0999282658","179.5623422658","181.4015962658","163.7148945158","128.6768589658","144.3119093658","118.6370833658","106.6508407572","102.6656544486","95.84071452","87.32929032","77.69968344","66.2023032","55.3250172","36.8037912","24.03349296","12.88028496","4.61215596","0.86920371","0.85495176","0.77857686","0.70834986","0.64519416"
"14.04.2023","v2","DK","2F4","EM","HFC","DK_EM_2F4_HFC","kt","","","","","","","","","0.79326","11.58612","18.86898","15.16684","14.0647","14.84756","14.91542","20.96328","24.47614","20.8230784424","18.5627778882","17.7056812244","16.687497736","15.894800974","15.8479853337","16.0186","16.147068951","13.0523380212","14.534069606","15.125231736","14.0230531012","11.4538316752","10.434565","10.1484566988"
"14.04.2023","v2","DK","2B10","EM","PFC","DK_EM_2B10_PFC","kt","NA","NA","NA","NA","NA","NA","NA","NA","NA","NA","NA","NA","NA","NA","NA","NA","NA","NA","NA","NA","NA","NA","NA","NA","NA","NA","NA","NA","NA","NA","NA","NA"
"14.04.2023","v2","DK","2E5","EM","PFC","DK_EM_2E5_PFC","kt","","","","","","","","","","","","","","","","","3.57876","5.2212","4.05504","6.6798","6.6798","5.142","3.1014","3.315","2.4384","","","0.97461","","0.98787","",""
"14.04.2023","v2","DK","2F1","EM","PFC","DK_EM_2F1_PFC","kt","","","","","0.06675","0.638575","2.1099675","5.23647075","11.565823675","15.8693913075","20.34335217675","23.50510395863","23.78507756339","22.56234605714","20.69705351857","18.91581429948","17.36465786971","15.64020708265","14.15268187394","12.34674818708","2.952279260387","2.126009907619","0.08332373288687","","0.001602","0.01588548","0.007114238625","0.006433752","0.006615165375","0.006250515375","0.006250515375","0.006449083875"
"14.04.2023","v2","DK","2F5","EM","PFC","DK_EM_2F5_PFC","kt","","","","","","","","","","","2.403","4.628","4.45","2.225","","","","","","","","","","","","","","","","","",""
"14.04.2023","v2","DK","2B10","EM","FGAS_IPCC","DK_EM_2B10_FGAS_IPCC","kt","NA","NA","NA","NA","NA","NA","NA","NA","NA","NA","NA","NA","NA","NA","NA","NA","NA","NA","NA","NA","NA","NA","NA","NA","NA","NA","NA","NA","NA","NA","NA","NA"
"14.04.2023","v2","DK","2B10","EM","SF6","DK_EM_2B10_SF6","kt","NA","NA","NA","NA","NA","NA","NA","NA","NA","NA","NA","NA","NA","NA","NA","NA","NA","NA","NA","NA","NA","NA","NA","NA","NA","NA","NA","NA","NA","NA","NA","NA"
"14.04.2023","v2","DK","2C4","EM","SF6","DK_EM_2C4_SF6","kt","0.0013","0.0013","0.0013","0.0015","0.0019","0.0015","0.0004","0.0006","0.0007","0.0007","0.000891","","","","","","","","","","","","","","","","","","","","",""
"14.04.2023","v2","DK","2G1","EM","SF6","DK_EM_2G1_SF6","kt","6e-05","0.000107","0.000114","0.000126475","0.000143947625","0.00016991788688","0.00018802829744","0.00038749244345","0.00027445427586","0.00048691380616","0.00047252854579","0.00050866521864","0.00037147121497","0.00040631318809","0.00041401295805","0.00051001243581","0.00052832712274","0.00061661944276","0.00066387142762","0.00059873533892","0.000584623562","0.00058163232521","0.00054424105079","0.00058539938887","0.00054869420633","0.00054502827571","0.00059796254568","0.00063136725019","0.00061165269702","0.00059885888737","0.00061463782748","0.00059694157855"
"14.04.2023","v2","DK","2G2","EM","SF6","DK_EM_2G2_SF6","kt","0.0005","0.00127125","0.00237225","0.00267005","0.00313635","0.002888725","0.002013675","0.002114275","0.0015603","0.0015759","0.00113279825","0.0007486295625","0.0006841420625","0.0009191420625","0.0009741420625","0.0004041420625","0.0009850420625","0.0006641420625","0.0006741420625","0.0009581420625","0.0010441420625","0.0028224920625","0.0051426920625","0.0059980920625","0.0062317920625","0.0047904170625","0.0039814670625","0.0027038670625","0.0026296420625","0.0025662420625","0.0014225538125","6.5505e-05"
"14.04.2023","v2","DK","2B10","EM","NF3","DK_EM_2B10_NF3","kt","NA","NA","NA","NA","NA","NA","NA","NA","NA","NA","NA","NA","NA","NA","NA","NA","NA","NA","NA","NA","NA","NA","NA","NA","NA","NA","NA","NA","NA","NA","NA","NA"
