Vorgang gestartet
Berechne Variable Confidential Emissions of F-Gases, Ereignis #9528 (1/986)
Berechne Variable Confidential Emissions of F-Gases, Ereignis #9529 (2/986)
Berechne Variable Confidential Emissions of F-Gases, Ereignis #9530 (3/986)
Berechne Variable Confidential Emissions of F-Gases, Ereignis #9531 (4/986)
Berechne Variable Confidential Emissions of F-Gases, Ereignis #9532 (5/986)
Berechne Variable Confidential Emissions of F-Gases, Ereignis #9533 (6/986)
Berechne Variable Confidential Emissions of F-Gases, Ereignis #9534 (7/986)
Berechne Variable Confidential Emissions of F-Gases, Ereignis #9535 (8/986)
Berechne Variable Confidential Emissions of F-Gases, Ereignis #9536 (9/986)
Berechne Variable Confidential Emissions of F-Gases, Ereignis #9537 (10/986)
Berechne Variable Confidential Emissions of F-Gases, Ereignis #9538 (11/986)
Berechne Variable Confidential Emissions of F-Gases, Ereignis #9540 (12/986)
Berechne Variable Confidential Emissions of F-Gases, Ereignis #9541 (13/986)
Berechne Variable Confidential Emissions of F-Gases, Ereignis #9542 (14/986)
Berechne Variable Confidential Emissions of F-Gases, Ereignis #9543 (15/986)
Berechne Variable Confidential Emissions of F-Gases, Ereignis #9544 (16/986)
Berechne Variable Confidential Emissions of F-Gases, Ereignis #9545 (17/986)
Berechne Variable Confidential Emissions of F-Gases, Ereignis #9546 (18/986)
Berechne Variable Confidential Emissions of F-Gases, Ereignis #9547 (19/986)
Berechne Variable Confidential Emissions of F-Gases, Ereignis #9548 (20/986)
Berechne Variable Confidential Emissions of F-Gases, Ereignis #9549 (21/986)
Berechne Variable Confidential Emissions of F-Gases, Ereignis #9550 (22/986)
Berechne Variable Confidential Emissions of F-Gases, Ereignis #9551 (23/986)
Berechne Variable Confidential Emissions of F-Gases, Ereignis #9552 (24/986)
Berechne Variable Confidential Emissions of F-Gases, Ereignis #9553 (25/986)
Berechne Variable Confidential Emissions of F-Gases, Ereignis #9554 (26/986)
Berechne Variable Confidential Emissions of F-Gases, Ereignis #9555 (27/986)
Berechne Variable Confidential Emissions of F-Gases, Ereignis #9556 (28/986)
Berechne Variable Confidential Emissions of F-Gases, Ereignis #9557 (29/986)
Berechne Variable Confidential Emissions of F-Gases, Ereignis #9558 (30/986)
Berechne Variable Confidential Emissions of F-Gases, Ereignis #9559 (31/986)
Berechne Variable Confidential Emissions of F-Gases, Ereignis #9560 (32/986)
Berechne Variable Confidential Emissions of F-Gases, Ereignis #9561 (33/986)
Berechne Variable Confidential Emissions of F-Gases, Ereignis #9562 (34/986)
Berechne Variable Confidential Emissions of F-Gases, Ereignis #9563 (35/986)
Berechne Variable Confidential Emissions of F-Gases, Ereignis #9564 (36/986)
Berechne Variable Confidential Emissions of F-Gases, Ereignis #9565 (37/986)
Berechne Variable Confidential Emissions of F-Gases, Ereignis #9566 (38/986)
Berechne Variable Confidential Emissions of F-Gases, Ereignis #9568 (39/986)
Berechne Variable Confidential Emissions of F-Gases, Ereignis #9569 (40/986)
Berechne Variable Confidential Emissions of F-Gases, Ereignis #9570 (41/986)
Berechne Variable Confidential Emissions of F-Gases, Ereignis #9571 (42/986)
Berechne Variable Confidential Emissions of F-Gases, Ereignis #9572 (43/986)
Berechne Variable Confidential Emissions of F-Gases, Ereignis #9573 (44/986)
Berechne Variable Confidential Emissions of F-Gases, Ereignis #9574 (45/986)
Berechne Variable Confidential Emissions of F-Gases, Ereignis #9575 (46/986)
Berechne Variable Confidential Emissions of F-Gases, Ereignis #9576 (47/986)
Berechne Variable Confidential Emissions of F-Gases, Ereignis #9577 (48/986)
Berechne Variable Confidential Emissions of F-Gases, Ereignis #9578 (49/986)
Berechne Variable Confidential Emissions of F-Gases, Ereignis #9579 (50/986)
Berechne Variable Confidential Emissions of F-Gases, Ereignis #9580 (51/986)
Berechne Variable Confidential Emissions of F-Gases, Ereignis #9581 (52/986)
Berechne Variable Confidential Emissions of F-Gases, Ereignis #9582 (53/986)
Berechne Variable Confidential Emissions of F-Gases, Ereignis #9583 (54/986)
Berechne Variable Confidential Emissions of F-Gases, Ereignis #9584 (55/986)
Berechne Variable Confidential Emissions of F-Gases, Ereignis #9585 (56/986)
Berechne Variable Confidential Emissions of F-Gases, Ereignis #9586 (57/986)
Berechne Variable Confidential Emissions of F-Gases, Ereignis #9587 (58/986)
Berechne Variable Confidential Emissions of F-Gases, Ereignis #9588 (59/986)
Berechne Variable Confidential Emissions of F-Gases, Ereignis #9589 (60/986)
Berechne Variable Confidential Emissions of F-Gases, Ereignis #9590 (61/986)
Berechne Variable Confidential Emissions of F-Gases, Ereignis #9591 (62/986)
Berechne Variable Confidential Emissions of F-Gases, Ereignis #9592 (63/986)
Berechne Variable Confidential Emissions of F-Gases, Ereignis #9593 (64/986)
Berechne Variable Confidential Emissions of F-Gases, Ereignis #9594 (65/986)
Berechne Variable Confidential Emissions of F-Gases, Ereignis #9596 (66/986)
Berechne Variable Confidential Emissions of F-Gases, Ereignis #9597 (67/986)
Berechne Variable Confidential Emissions of F-Gases, Ereignis #9598 (68/986)
Berechne Variable Confidential Emissions of F-Gases, Ereignis #9599 (69/986)
Berechne Variable Confidential Emissions of F-Gases, Ereignis #9600 (70/986)
Berechne Variable Confidential Emissions of F-Gases, Ereignis #9601 (71/986)
Berechne Variable Confidential Emissions of F-Gases, Ereignis #9602 (72/986)
Berechne Variable Confidential Emissions of F-Gases, Ereignis #9604 (73/986)
Berechne Variable Confidential Emissions of F-Gases, Ereignis #9605 (74/986)
Berechne Variable Confidential Emissions of F-Gases, Ereignis #9606 (75/986)
Berechne Variable Confidential Emissions of F-Gases, Ereignis #9607 (76/986)
Berechne Variable Confidential Emissions of F-Gases, Ereignis #9608 (77/986)
Berechne Variable Confidential Emissions of F-Gases, Ereignis #9609 (78/986)
Berechne Variable Confidential Emissions of F-Gases, Ereignis #9610 (79/986)
Berechne Variable Confidential Emissions of F-Gases, Ereignis #9611 (80/986)
Berechne Variable Confidential Emissions of F-Gases, Ereignis #9612 (81/986)
Berechne Variable Confidential Emissions of F-Gases, Ereignis #9613 (82/986)
Berechne Variable Confidential Emissions of F-Gases, Ereignis #9614 (83/986)
Berechne Variable Confidential Emissions of F-Gases, Ereignis #9615 (84/986)
Berechne Variable Confidential Emissions of F-Gases, Ereignis #9616 (85/986)
Berechne Variable Confidential Emissions of F-Gases, Ereignis #9617 (86/986)
Berechne Variable Confidential Emissions of F-Gases, Ereignis #9618 (87/986)
Berechne Variable Confidential Emissions of F-Gases, Ereignis #9619 (88/986)
Berechne Variable Confidential Emissions of F-Gases, Ereignis #9620 (89/986)
Berechne Variable Confidential Emissions of F-Gases, Ereignis #9621 (90/986)
Berechne Variable Confidential Emissions of F-Gases, Ereignis #9622 (91/986)
Berechne Variable Confidential Emissions of F-Gases, Ereignis #9623 (92/986)
Berechne Variable Confidential Emissions of F-Gases, Ereignis #9624 (93/986)
Berechne Variable Confidential Emissions of F-Gases, Ereignis #9625 (94/986)
Berechne Variable Confidential Emissions of F-Gases, Ereignis #9626 (95/986)
Berechne Variable Confidential Emissions of F-Gases, Ereignis #9627 (96/986)
Berechne Variable Confidential Emissions of F-Gases, Ereignis #9628 (97/986)
Berechne Variable Confidential Emissions of F-Gases, Ereignis #9629 (98/986)
Berechne Variable Confidential Emissions of F-Gases, Ereignis #9630 (99/986)
Berechne Variable Confidential Emissions of F-Gases, Ereignis #9631 (100/986)
Berechne Variable Confidential Emissions of F-Gases, Ereignis #9632 (101/986)
Berechne Variable Confidential Emissions of F-Gases, Ereignis #9633 (102/986)
Berechne Variable Confidential Emissions of F-Gases, Ereignis #9634 (103/986)
Berechne Variable Confidential Emissions of F-Gases, Ereignis #9635 (104/986)
Berechne Variable Confidential Emissions of F-Gases, Ereignis #9636 (105/986)
Berechne Variable Confidential Emissions of F-Gases, Ereignis #9637 (106/986)
Berechne Variable Confidential Emissions of F-Gases, Ereignis #9638 (107/986)
Berechne Variable Pulp and paper, Ereignis #9639 (108/986)
Berechne Variable Pulp and paper, Ereignis #9640 (109/986)
Berechne Variable Pulp and paper, Ereignis #9641 (110/986)
Berechne Variable Pulp and paper, Ereignis #9642 (111/986)
Berechne Variable Pulp and paper, Ereignis #9643 (112/986)
Berechne Variable Pulp and paper, Ereignis #9644 (113/986)
Berechne Variable Pulp and paper, Ereignis #9645 (114/986)
Berechne Variable Pulp and paper, Ereignis #9646 (115/986)
Berechne Variable Pulp and paper, Ereignis #9647 (116/986)
Berechne Variable Pulp and paper, Ereignis #9648 (117/986)
Berechne Variable Pulp and paper, Ereignis #9649 (118/986)
Berechne Variable Pulp and paper, Ereignis #9650 (119/986)
Berechne Variable Pulp and paper, Ereignis #9651 (120/986)
Berechne Variable Pulp and paper, Ereignis #9652 (121/986)
Berechne Variable Pulp and paper, Ereignis #9653 (122/986)
Berechne Variable Pulp and paper, Ereignis #9654 (123/986)
Berechne Variable Pulp and paper, Ereignis #9655 (124/986)
Berechne Variable Pulp and paper, Ereignis #9656 (125/986)
Berechne Variable Pulp and paper, Ereignis #9657 (126/986)
Berechne Variable Pulp and paper, Ereignis #9658 (127/986)
Berechne Variable Pulp and paper, Ereignis #9659 (128/986)
Berechne Variable Pulp and paper, Ereignis #9660 (129/986)
Berechne Variable Pulp and paper, Ereignis #9661 (130/986)
Berechne Variable Pulp and paper, Ereignis #9662 (131/986)
Berechne Variable Pulp and paper, Ereignis #9663 (132/986)
Berechne Variable Pulp and paper, Ereignis #9665 (133/986)
Berechne Variable Pulp and paper, Ereignis #9666 (134/986)
Berechne Variable Pulp and paper, Ereignis #9667 (135/986)
Berechne Variable Pulp and paper, Ereignis #9668 (136/986)
Berechne Variable Pulp and paper, Ereignis #9669 (137/986)
Berechne Variable Pulp and paper, Ereignis #9670 (138/986)
Berechne Variable Pulp and paper, Ereignis #9672 (139/986)
Berechne Variable Pulp and paper, Ereignis #9673 (140/986)
Berechne Variable Pulp and paper, Ereignis #9674 (141/986)
Berechne Variable Pulp and paper, Ereignis #9675 (142/986)
Berechne Variable Pulp and paper, Ereignis #9676 (143/986)
Berechne Variable Pulp and paper, Ereignis #9677 (144/986)
Berechne Variable Pulp and paper, Ereignis #9678 (145/986)
Berechne Variable Pulp and paper, Ereignis #9679 (146/986)
Berechne Variable Pulp and paper, Ereignis #9680 (147/986)
Berechne Variable Pulp and paper, Ereignis #9681 (148/986)
Berechne Variable Pulp and paper, Ereignis #9682 (149/986)
Berechne Variable Pulp and paper, Ereignis #9683 (150/986)
Berechne Variable Pulp and paper, Ereignis #9684 (151/986)
Berechne Variable Pulp and paper, Ereignis #9685 (152/986)
Berechne Variable Pulp and paper, Ereignis #9686 (153/986)
Berechne Variable Pulp and paper, Ereignis #9687 (154/986)
Berechne Variable Pulp and paper, Ereignis #9688 (155/986)
Berechne Variable Pulp and paper, Ereignis #9689 (156/986)
Berechne Variable Pulp and paper, Ereignis #9690 (157/986)
Berechne Variable Pulp and paper, Ereignis #9691 (158/986)
Berechne Variable Pulp and paper, Ereignis #9692 (159/986)
Berechne Variable Pulp and paper, Ereignis #9693 (160/986)
Berechne Variable Pulp and paper, Ereignis #9694 (161/986)
Berechne Variable Pulp and paper, Ereignis #9695 (162/986)
Berechne Variable Pulp and paper, Ereignis #9696 (163/986)
Warnung: Vertraulicher Wert für Jahr 1995
Warnung: Vertraulicher Wert für Jahr 1996
Warnung: Vertraulicher Wert für Jahr 1997
Warnung: Vertraulicher Wert für Jahr 1998
Warnung: Vertraulicher Wert für Jahr 1999
Warnung: Vertraulicher Wert für Jahr 2000
Warnung: Vertraulicher Wert für Jahr 2001
Warnung: Vertraulicher Wert für Jahr 2002
Warnung: Vertraulicher Wert für Jahr 2003
Warnung: Vertraulicher Wert für Jahr 2004
Warnung: Vertraulicher Wert für Jahr 2005
Warnung: Vertraulicher Wert für Jahr 2006
Warnung: Vertraulicher Wert für Jahr 2007
Warnung: Vertraulicher Wert für Jahr 2008
Warnung: Vertraulicher Wert für Jahr 2009
Warnung: Vertraulicher Wert für Jahr 2010
Warnung: Vertraulicher Wert für Jahr 2011
Warnung: Vertraulicher Wert für Jahr 2012
Warnung: Vertraulicher Wert für Jahr 2013
Warnung: Vertraulicher Wert für Jahr 2014
Warnung: Vertraulicher Wert für Jahr 2015
Warnung: Vertraulicher Wert für Jahr 2016
Warnung: Vertraulicher Wert für Jahr 2017
Warnung: Vertraulicher Wert für Jahr 2018
Warnung: Vertraulicher Wert für Jahr 2019
Warnung: Vertraulicher Wert für Jahr 2020
Warnung: Vertraulicher Wert für Jahr 2021
Warnung: Vertraulicher Wert für Jahr 2022
Berechne Variable Pulp and paper, Ereignis #9697 (164/986)
Berechne Variable Pulp and paper, Ereignis #9698 (165/986)
Berechne Variable Pulp and paper, Ereignis #9699 (166/986)
Berechne Variable Pulp and paper, Ereignis #9700 (167/986)
Berechne Variable Pulp and paper, Ereignis #9701 (168/986)
Berechne Variable Pulp and paper, Ereignis #9702 (169/986)
Berechne Variable Pulp and paper, Ereignis #9703 (170/986)
Berechne Variable Pulp and paper, Ereignis #9704 (171/986)
Berechne Variable Pulp and paper, Ereignis #9705 (172/986)
Berechne Variable Pulp and paper, Ereignis #9706 (173/986)
Berechne Variable Pulp and paper, Ereignis #9707 (174/986)
Berechne Variable Pulp and paper, Ereignis #9708 (175/986)
Berechne Variable Pulp and paper, Ereignis #9709 (176/986)
Berechne Variable Pulp and paper, Ereignis #9710 (177/986)
Berechne Variable Pulp and paper, Ereignis #9711 (178/986)
Berechne Variable Pulp and paper, Ereignis #9712 (179/986)
Berechne Variable Pulp and paper, Ereignis #9713 (180/986)
Berechne Variable Pulp and paper, Ereignis #9714 (181/986)
Berechne Variable Pulp and paper, Ereignis #9715 (182/986)
Berechne Variable Pulp and paper, Ereignis #9716 (183/986)
Berechne Variable Pulp and paper, Ereignis #9717 (184/986)
Berechne Variable Pulp and paper, Ereignis #9718 (185/986)
Berechne Variable Pulp and paper, Ereignis #9719 (186/986)
Berechne Variable Pulp and paper, Ereignis #9720 (187/986)
Berechne Variable Pulp and paper, Ereignis #9722 (188/986)
Berechne Variable Pulp and paper, Ereignis #9723 (189/986)
Berechne Variable Pulp and paper, Ereignis #9724 (190/986)
Berechne Variable Pulp and paper, Ereignis #9725 (191/986)
Berechne Variable Pulp and paper, Ereignis #9726 (192/986)
Berechne Variable Pulp and paper, Ereignis #9727 (193/986)
Berechne Variable Pulp and paper, Ereignis #9728 (194/986)
Berechne Variable Pulp and paper, Ereignis #9729 (195/986)
Berechne Variable Pulp and paper, Ereignis #9730 (196/986)
Berechne Variable Pulp and paper, Ereignis #9731 (197/986)
Berechne Variable Pulp and paper, Ereignis #9732 (198/986)
Berechne Variable Pulp and paper, Ereignis #9734 (199/986)
Berechne Variable Pulp and paper, Ereignis #9735 (200/986)
Berechne Variable Pulp and paper, Ereignis #9736 (201/986)
Berechne Variable Pulp and paper, Ereignis #9737 (202/986)
Berechne Variable Pulp and paper, Ereignis #9738 (203/986)
Berechne Variable Pulp and paper, Ereignis #9739 (204/986)
Berechne Variable Food and beverages industry, Ereignis #9740 (205/986)
Berechne Variable Food and beverages industry, Ereignis #9741 (206/986)
Berechne Variable Food and beverages industry, Ereignis #9742 (207/986)
Berechne Variable Food and beverages industry, Ereignis #9743 (208/986)
Berechne Variable Food and beverages industry, Ereignis #9744 (209/986)
Berechne Variable Food and beverages industry, Ereignis #9745 (210/986)
Berechne Variable Food and beverages industry, Ereignis #9746 (211/986)
Berechne Variable Food and beverages industry, Ereignis #9747 (212/986)
Berechne Variable Food and beverages industry, Ereignis #9748 (213/986)
Berechne Variable Food and beverages industry, Ereignis #9749 (214/986)
Berechne Variable Food and beverages industry, Ereignis #9750 (215/986)
Berechne Variable Food and beverages industry, Ereignis #9751 (216/986)
Berechne Variable Food and beverages industry, Ereignis #9753 (217/986)
Berechne Variable Food and beverages industry, Ereignis #9754 (218/986)
Berechne Variable Food and beverages industry, Ereignis #9755 (219/986)
Berechne Variable Food and beverages industry, Ereignis #9756 (220/986)
Berechne Variable Food and beverages industry, Ereignis #9757 (221/986)
Berechne Variable Food and beverages industry, Ereignis #9758 (222/986)
Berechne Variable Food and beverages industry, Ereignis #9759 (223/986)
Berechne Variable Food and beverages industry, Ereignis #9760 (224/986)
Berechne Variable Food and beverages industry, Ereignis #9761 (225/986)
Berechne Variable Food and beverages industry, Ereignis #9763 (226/986)
Berechne Variable Food and beverages industry, Ereignis #9764 (227/986)
Berechne Variable Food and beverages industry, Ereignis #9765 (228/986)
Berechne Variable Food and beverages industry, Ereignis #9766 (229/986)
Berechne Variable Food and beverages industry, Ereignis #9767 (230/986)
Berechne Variable Food and beverages industry, Ereignis #9768 (231/986)
Berechne Variable Food and beverages industry, Ereignis #9769 (232/986)
Berechne Variable Food and beverages industry, Ereignis #9770 (233/986)
Berechne Variable Food and beverages industry, Ereignis #9771 (234/986)
Berechne Variable Food and beverages industry, Ereignis #9772 (235/986)
Berechne Variable Food and beverages industry, Ereignis #9773 (236/986)
Berechne Variable Food and beverages industry, Ereignis #9774 (237/986)
Berechne Variable Food and beverages industry, Ereignis #9775 (238/986)
Berechne Variable Food and beverages industry, Ereignis #9776 (239/986)
Berechne Variable Food and beverages industry, Ereignis #9777 (240/986)
Berechne Variable Food and beverages industry, Ereignis #9778 (241/986)
Berechne Variable Food and beverages industry, Ereignis #9779 (242/986)
Berechne Variable Food and beverages industry, Ereignis #9780 (243/986)
Berechne Variable Food and beverages industry, Ereignis #9781 (244/986)
Berechne Variable Food and beverages industry, Ereignis #9782 (245/986)
Berechne Variable Food and beverages industry, Ereignis #9783 (246/986)
Berechne Variable Food and beverages industry, Ereignis #9784 (247/986)
Berechne Variable Food and beverages industry, Ereignis #9785 (248/986)
Berechne Variable Food and beverages industry, Ereignis #9787 (249/986)
Berechne Variable Food and beverages industry, Ereignis #9788 (250/986)
Berechne Variable Food and beverages industry, Ereignis #9789 (251/986)
Berechne Variable Food and beverages industry, Ereignis #9790 (252/986)
Berechne Variable Food and beverages industry, Ereignis #9791 (253/986)
Berechne Variable Food and beverages industry, Ereignis #9792 (254/986)
Berechne Variable Food and beverages industry, Ereignis #9793 (255/986)
Berechne Variable Food and beverages industry, Ereignis #9794 (256/986)
Berechne Variable Food and beverages industry, Ereignis #9795 (257/986)
Berechne Variable Food and beverages industry, Ereignis #9796 (258/986)
Berechne Variable Food and beverages industry, Ereignis #9797 (259/986)
Berechne Variable Food and beverages industry, Ereignis #9798 (260/986)
Berechne Variable Food and beverages industry, Ereignis #9799 (261/986)
Berechne Variable Food and beverages industry, Ereignis #9800 (262/986)
Berechne Variable Food and beverages industry, Ereignis #9801 (263/986)
Berechne Variable Food and beverages industry, Ereignis #9802 (264/986)
Berechne Variable Food and beverages industry, Ereignis #9803 (265/986)
Berechne Variable Food and beverages industry, Ereignis #9804 (266/986)
Berechne Variable Food and beverages industry, Ereignis #9805 (267/986)
Berechne Variable Food and beverages industry, Ereignis #9806 (268/986)
Berechne Variable Food and beverages industry, Ereignis #9807 (269/986)
Berechne Variable Food and beverages industry, Ereignis #9808 (270/986)
Berechne Variable Food and beverages industry, Ereignis #9809 (271/986)
Berechne Variable Food and beverages industry, Ereignis #9810 (272/986)
Berechne Variable Food and beverages industry, Ereignis #9811 (273/986)
Berechne Variable Food and beverages industry, Ereignis #9812 (274/986)
Berechne Variable Food and beverages industry, Ereignis #9813 (275/986)
Berechne Variable Food and beverages industry, Ereignis #9814 (276/986)
Berechne Variable Food and beverages industry, Ereignis #9815 (277/986)
Berechne Variable Food and beverages industry, Ereignis #9816 (278/986)
Berechne Variable Food and beverages industry, Ereignis #9817 (279/986)
Berechne Variable Food and beverages industry, Ereignis #9818 (280/986)
Berechne Variable Food and beverages industry, Ereignis #9819 (281/986)
Berechne Variable Food and beverages industry, Ereignis #9820 (282/986)
Berechne Variable Food and beverages industry, Ereignis #9821 (283/986)
Berechne Variable Food and beverages industry, Ereignis #9822 (284/986)
Berechne Variable Food and beverages industry, Ereignis #9823 (285/986)
Berechne Variable Food and beverages industry, Ereignis #9824 (286/986)
Berechne Variable Food and beverages industry, Ereignis #9825 (287/986)
Berechne Variable Food and beverages industry, Ereignis #9826 (288/986)
Berechne Variable Food and beverages industry, Ereignis #9828 (289/986)
Berechne Variable Food and beverages industry, Ereignis #9829 (290/986)
Berechne Variable Food and beverages industry, Ereignis #9830 (291/986)
Berechne Variable Food and beverages industry, Ereignis #9831 (292/986)
Berechne Variable Food and beverages industry, Ereignis #9832 (293/986)
Berechne Variable Food and beverages industry, Ereignis #9833 (294/986)
Berechne Variable Food and beverages industry, Ereignis #9834 (295/986)
Berechne Variable Food and beverages industry, Ereignis #9835 (296/986)
Berechne Variable Food and beverages industry, Ereignis #9836 (297/986)
Berechne Variable Food and beverages industry, Ereignis #9837 (298/986)
Berechne Variable Food and beverages industry, Ereignis #9838 (299/986)
Berechne Variable Food and beverages industry, Ereignis #9839 (300/986)
Berechne Variable Food and beverages industry, Ereignis #9840 (301/986)
Berechne Variable Other Industrial Process and Product Use, Ereignis #9841 (302/986)
Berechne Variable Other Industrial Process and Product Use, Ereignis #9842 (303/986)
Berechne Variable Other Industrial Process and Product Use, Ereignis #9843 (304/986)
Berechne Variable Other Industrial Process and Product Use, Ereignis #9844 (305/986)
Berechne Variable Other Industrial Process and Product Use, Ereignis #9845 (306/986)
Berechne Variable Other Industrial Process and Product Use, Ereignis #9846 (307/986)
Berechne Variable Other Industrial Process and Product Use, Ereignis #9847 (308/986)
Berechne Variable Other Industrial Process and Product Use, Ereignis #9848 (309/986)
Berechne Variable Other Industrial Process and Product Use, Ereignis #9849 (310/986)
Berechne Variable Other Industrial Process and Product Use, Ereignis #9850 (311/986)
Berechne Variable Other Industrial Process and Product Use, Ereignis #9851 (312/986)
Berechne Variable Other Industrial Process and Product Use, Ereignis #9852 (313/986)
Berechne Variable Other Industrial Process and Product Use, Ereignis #9853 (314/986)
Berechne Variable Other Industrial Process and Product Use, Ereignis #9854 (315/986)
Berechne Variable Other Industrial Process and Product Use, Ereignis #9855 (316/986)
Warnung: Vertraulicher Wert für Jahr 1990
Warnung: Vertraulicher Wert für Jahr 1991
Warnung: Vertraulicher Wert für Jahr 1992
Warnung: Vertraulicher Wert für Jahr 1993
Warnung: Vertraulicher Wert für Jahr 2007
Warnung: Vertraulicher Wert für Jahr 2008
Warnung: Vertraulicher Wert für Jahr 2009
Warnung: Vertraulicher Wert für Jahr 2010
Warnung: Vertraulicher Wert für Jahr 2011
Warnung: Vertraulicher Wert für Jahr 2012
Warnung: Vertraulicher Wert für Jahr 2013
Warnung: Vertraulicher Wert für Jahr 2014
Warnung: Vertraulicher Wert für Jahr 2015
Warnung: Vertraulicher Wert für Jahr 2016
Warnung: Vertraulicher Wert für Jahr 2017
Warnung: Vertraulicher Wert für Jahr 2018
Warnung: Vertraulicher Wert für Jahr 2019
Warnung: Vertraulicher Wert für Jahr 2020
Warnung: Vertraulicher Wert für Jahr 2021
Warnung: Vertraulicher Wert für Jahr 2022
Berechne Variable Other Industrial Process and Product Use, Ereignis #9856 (317/986)
Berechne Variable Other Industrial Process and Product Use, Ereignis #9857 (318/986)
Berechne Variable Other Industrial Process and Product Use, Ereignis #9858 (319/986)
Berechne Variable Other Industrial Process and Product Use, Ereignis #9859 (320/986)
Berechne Variable Other Industrial Process and Product Use, Ereignis #9860 (321/986)
Berechne Variable Other Industrial Process and Product Use, Ereignis #9861 (322/986)
Berechne Variable Other Industrial Process and Product Use, Ereignis #9862 (323/986)
Berechne Variable Other Industrial Process and Product Use, Ereignis #9863 (324/986)
Berechne Variable Other Industrial Process and Product Use, Ereignis #9864 (325/986)
Berechne Variable Other Industrial Process and Product Use, Ereignis #9865 (326/986)
Berechne Variable Other Industrial Process and Product Use, Ereignis #9866 (327/986)
Berechne Variable Other Industrial Process and Product Use, Ereignis #9867 (328/986)
Berechne Variable Other Industrial Process and Product Use, Ereignis #9868 (329/986)
Berechne Variable Other Industrial Process and Product Use, Ereignis #9869 (330/986)
Berechne Variable Other Industrial Process and Product Use, Ereignis #9870 (331/986)
Berechne Variable Other Industrial Process and Product Use, Ereignis #9871 (332/986)
Berechne Variable Other Industrial Process and Product Use, Ereignis #9872 (333/986)
Berechne Variable Other Industrial Process and Product Use, Ereignis #9873 (334/986)
Berechne Variable Other Industrial Process and Product Use, Ereignis #9874 (335/986)
Berechne Variable Other Industrial Process and Product Use, Ereignis #9875 (336/986)
Berechne Variable Other Industrial Process and Product Use, Ereignis #9876 (337/986)
Berechne Variable Other Industrial Process and Product Use, Ereignis #9877 (338/986)
Berechne Variable Other Industrial Process and Product Use, Ereignis #9878 (339/986)
Berechne Variable Other Industrial Process and Product Use, Ereignis #9879 (340/986)
Berechne Variable Other Industrial Process and Product Use, Ereignis #9880 (341/986)
Berechne Variable Other Industrial Process and Product Use, Ereignis #9881 (342/986)
Berechne Variable Other Industrial Process and Product Use, Ereignis #9882 (343/986)
Berechne Variable Other Industrial Process and Product Use, Ereignis #9883 (344/986)
Berechne Variable Other Industrial Process and Product Use, Ereignis #9884 (345/986)
Berechne Variable Other Industrial Process and Product Use, Ereignis #9885 (346/986)
Berechne Variable Other Industrial Process and Product Use, Ereignis #9886 (347/986)
Berechne Variable Other Industrial Process and Product Use, Ereignis #9887 (348/986)
Berechne Variable Other Industrial Process and Product Use, Ereignis #9888 (349/986)
Berechne Variable Other Industrial Process and Product Use, Ereignis #9889 (350/986)
Berechne Variable Other Industrial Process and Product Use, Ereignis #9890 (351/986)
Berechne Variable Other Industrial Process and Product Use, Ereignis #9891 (352/986)
Berechne Variable Other Industrial Process and Product Use, Ereignis #9892 (353/986)
Berechne Variable Other Industrial Process and Product Use, Ereignis #9893 (354/986)
Berechne Variable Other Industrial Process and Product Use, Ereignis #9894 (355/986)
Berechne Variable Other Industrial Process and Product Use, Ereignis #9895 (356/986)
Berechne Variable Other Industrial Process and Product Use, Ereignis #9896 (357/986)
Berechne Variable Other Industrial Process and Product Use, Ereignis #9897 (358/986)
Berechne Variable Other Industrial Process and Product Use, Ereignis #9898 (359/986)
Berechne Variable Other Industrial Process and Product Use, Ereignis #9899 (360/986)
Berechne Variable Other Industrial Process and Product Use, Ereignis #9900 (361/986)
Berechne Variable Other Industrial Process and Product Use, Ereignis #9901 (362/986)
Berechne Variable Other Industrial Process and Product Use, Ereignis #9902 (363/986)
Berechne Variable Other Industrial Process and Product Use, Ereignis #9903 (364/986)
Berechne Variable Other Industrial Process and Product Use, Ereignis #9904 (365/986)
Berechne Variable Other Industrial Process and Product Use, Ereignis #9905 (366/986)
Berechne Variable Other Industrial Process and Product Use, Ereignis #9906 (367/986)
Berechne Variable Other Industrial Process and Product Use, Ereignis #9907 (368/986)
Berechne Variable Other Industrial Process and Product Use, Ereignis #9908 (369/986)
Berechne Variable Other Industrial Process and Product Use, Ereignis #9909 (370/986)
Berechne Variable Other Industrial Process and Product Use, Ereignis #9910 (371/986)
Berechne Variable Other Industrial Process and Product Use, Ereignis #9911 (372/986)
Berechne Variable Other Industrial Process and Product Use, Ereignis #9912 (373/986)
Berechne Variable Other Industrial Process and Product Use, Ereignis #9913 (374/986)
Berechne Variable Other Industrial Process and Product Use, Ereignis #9914 (375/986)
Berechne Variable Other Industrial Process and Product Use, Ereignis #9915 (376/986)
Berechne Variable Other Industrial Process and Product Use, Ereignis #9916 (377/986)
Berechne Variable Other Industrial Process and Product Use, Ereignis #9917 (378/986)
Berechne Variable Other Industrial Process and Product Use, Ereignis #9918 (379/986)
Berechne Variable Other Industrial Process and Product Use, Ereignis #9919 (380/986)
Berechne Variable Other Industrial Process and Product Use, Ereignis #9920 (381/986)
Berechne Variable Other Industrial Process and Product Use, Ereignis #9921 (382/986)
Berechne Variable Other Industrial Process and Product Use, Ereignis #9922 (383/986)
Berechne Variable Other Industrial Process and Product Use, Ereignis #9923 (384/986)
Berechne Variable Other Industrial Process and Product Use, Ereignis #9924 (385/986)
Berechne Variable Other Industrial Process and Product Use, Ereignis #9925 (386/986)
Berechne Variable Other Industrial Process and Product Use, Ereignis #9926 (387/986)
Berechne Variable Other Industrial Process and Product Use, Ereignis #9927 (388/986)
Berechne Variable Other Industrial Process and Product Use, Ereignis #9928 (389/986)
Berechne Variable Other Industrial Process and Product Use, Ereignis #9929 (390/986)
Berechne Variable Other Industrial Process and Product Use, Ereignis #9930 (391/986)
Berechne Variable Other Industrial Process and Product Use, Ereignis #9931 (392/986)
Berechne Variable Other Industrial Process and Product Use, Ereignis #9933 (393/986)
Berechne Variable Other Industrial Process and Product Use, Ereignis #9934 (394/986)
Berechne Variable Other Industrial Process and Product Use, Ereignis #9935 (395/986)
Berechne Variable Other Industrial Process and Product Use, Ereignis #9936 (396/986)
Berechne Variable Other Industrial Process and Product Use, Ereignis #9937 (397/986)
Berechne Variable Other Industrial Process and Product Use, Ereignis #9938 (398/986)
Berechne Variable Other Industrial Process and Product Use, Ereignis #9939 (399/986)
Berechne Variable Food and beverages industry, Ereignis #20655 (400/986)
Berechne Variable Food and beverages industry, Ereignis #20656 (401/986)
Berechne Variable Food and beverages industry, Ereignis #20657 (402/986)
Berechne Variable Food and beverages industry, Ereignis #20658 (403/986)
Berechne Variable Food and beverages industry, Ereignis #20659 (404/986)
Berechne Variable Food and beverages industry, Ereignis #20660 (405/986)
Berechne Variable Food and beverages industry, Ereignis #20661 (406/986)
Berechne Variable Food and beverages industry, Ereignis #20662 (407/986)
Berechne Variable Food and beverages industry, Ereignis #20663 (408/986)
Berechne Variable Food and beverages industry, Ereignis #20664 (409/986)
Berechne Variable Food and beverages industry, Ereignis #20665 (410/986)
Berechne Variable Food and beverages industry, Ereignis #20666 (411/986)
Berechne Variable Food and beverages industry, Ereignis #20667 (412/986)
Berechne Variable Food and beverages industry, Ereignis #20668 (413/986)
Berechne Variable Food and beverages industry, Ereignis #20669 (414/986)
Berechne Variable Food and beverages industry, Ereignis #20670 (415/986)
Berechne Variable Food and beverages industry, Ereignis #20671 (416/986)
Berechne Variable Food and beverages industry, Ereignis #20672 (417/986)
Berechne Variable Food and beverages industry, Ereignis #20673 (418/986)
Berechne Variable Food and beverages industry, Ereignis #20674 (419/986)
Berechne Variable Food and beverages industry, Ereignis #20675 (420/986)
Berechne Variable Food and beverages industry, Ereignis #20676 (421/986)
Berechne Variable Food and beverages industry, Ereignis #20677 (422/986)
Berechne Variable Food and beverages industry, Ereignis #20678 (423/986)
Berechne Variable Food and beverages industry, Ereignis #20679 (424/986)
Berechne Variable Food and beverages industry, Ereignis #20680 (425/986)
Berechne Variable Food and beverages industry, Ereignis #20681 (426/986)
Berechne Variable Food and beverages industry, Ereignis #20682 (427/986)
Berechne Variable Food and beverages industry, Ereignis #20683 (428/986)
Berechne Variable Food and beverages industry, Ereignis #20684 (429/986)
Berechne Variable Food and beverages industry, Ereignis #20685 (430/986)
Berechne Variable Food and beverages industry, Ereignis #20686 (431/986)
Berechne Variable Food and beverages industry, Ereignis #20687 (432/986)
Berechne Variable Food and beverages industry, Ereignis #20688 (433/986)
Berechne Variable Food and beverages industry, Ereignis #20689 (434/986)
Berechne Variable Food and beverages industry, Ereignis #20690 (435/986)
Berechne Variable Food and beverages industry, Ereignis #20691 (436/986)
Berechne Variable Food and beverages industry, Ereignis #20692 (437/986)
Berechne Variable Food and beverages industry, Ereignis #20693 (438/986)
Berechne Variable Food and beverages industry, Ereignis #20694 (439/986)
Berechne Variable Food and beverages industry, Ereignis #20695 (440/986)
Berechne Variable Food and beverages industry, Ereignis #20696 (441/986)
Berechne Variable Food and beverages industry, Ereignis #20697 (442/986)
Berechne Variable Food and beverages industry, Ereignis #20698 (443/986)
Berechne Variable Food and beverages industry, Ereignis #20699 (444/986)
Berechne Variable Food and beverages industry, Ereignis #20700 (445/986)
Berechne Variable Food and beverages industry, Ereignis #20701 (446/986)
Berechne Variable Food and beverages industry, Ereignis #20702 (447/986)
Berechne Variable Food and beverages industry, Ereignis #20703 (448/986)
Berechne Variable Food and beverages industry, Ereignis #20704 (449/986)
Berechne Variable Food and beverages industry, Ereignis #20705 (450/986)
Berechne Variable Food and beverages industry, Ereignis #20706 (451/986)
Berechne Variable Food and beverages industry, Ereignis #20707 (452/986)
Berechne Variable Food and beverages industry, Ereignis #20708 (453/986)
Berechne Variable Food and beverages industry, Ereignis #20709 (454/986)
Berechne Variable Food and beverages industry, Ereignis #20710 (455/986)
Berechne Variable Food and beverages industry, Ereignis #20711 (456/986)
Berechne Variable Food and beverages industry, Ereignis #20712 (457/986)
Berechne Variable Food and beverages industry, Ereignis #20713 (458/986)
Berechne Variable Food and beverages industry, Ereignis #20714 (459/986)
Berechne Variable Food and beverages industry, Ereignis #20715 (460/986)
Berechne Variable Food and beverages industry, Ereignis #20716 (461/986)
Berechne Variable Food and beverages industry, Ereignis #20717 (462/986)
Berechne Variable Food and beverages industry, Ereignis #20718 (463/986)
Berechne Variable Food and beverages industry, Ereignis #20719 (464/986)
Berechne Variable Food and beverages industry, Ereignis #20720 (465/986)
Berechne Variable Food and beverages industry, Ereignis #20721 (466/986)
Berechne Variable Food and beverages industry, Ereignis #20722 (467/986)
Berechne Variable Food and beverages industry, Ereignis #20723 (468/986)
Berechne Variable Food and beverages industry, Ereignis #20724 (469/986)
Berechne Variable Food and beverages industry, Ereignis #20725 (470/986)
Berechne Variable Food and beverages industry, Ereignis #20726 (471/986)
Berechne Variable Food and beverages industry, Ereignis #20727 (472/986)
Berechne Variable Food and beverages industry, Ereignis #20728 (473/986)
Berechne Variable Food and beverages industry, Ereignis #20729 (474/986)
Berechne Variable Food and beverages industry, Ereignis #20730 (475/986)
Berechne Variable Food and beverages industry, Ereignis #20731 (476/986)
Berechne Variable Food and beverages industry, Ereignis #20732 (477/986)
Berechne Variable Food and beverages industry, Ereignis #20733 (478/986)
Berechne Variable Food and beverages industry, Ereignis #20734 (479/986)
Berechne Variable Food and beverages industry, Ereignis #20735 (480/986)
Berechne Variable Food and beverages industry, Ereignis #20736 (481/986)
Berechne Variable Food and beverages industry, Ereignis #20737 (482/986)
Berechne Variable Food and beverages industry, Ereignis #20738 (483/986)
Berechne Variable Food and beverages industry, Ereignis #20739 (484/986)
Berechne Variable Food and beverages industry, Ereignis #20740 (485/986)
Berechne Variable Food and beverages industry, Ereignis #20741 (486/986)
Berechne Variable Food and beverages industry, Ereignis #20742 (487/986)
Berechne Variable Food and beverages industry, Ereignis #20743 (488/986)
Berechne Variable Food and beverages industry, Ereignis #20744 (489/986)
Berechne Variable Food and beverages industry, Ereignis #20745 (490/986)
Berechne Variable Food and beverages industry, Ereignis #20746 (491/986)
Berechne Variable Food and beverages industry, Ereignis #20747 (492/986)
Berechne Variable Food and beverages industry, Ereignis #20748 (493/986)
Berechne Variable Food and beverages industry, Ereignis #20749 (494/986)
Berechne Variable Food and beverages industry, Ereignis #20750 (495/986)
Berechne Variable Food and beverages industry, Ereignis #20751 (496/986)
Berechne Variable Food and beverages industry, Ereignis #20752 (497/986)
Berechne Variable Food and beverages industry, Ereignis #20753 (498/986)
Berechne Variable Food and beverages industry, Ereignis #20787 (499/986)
Berechne Variable Food and beverages industry, Ereignis #20788 (500/986)
Berechne Variable Food and beverages industry, Ereignis #20789 (501/986)
Berechne Variable Food and beverages industry, Ereignis #20790 (502/986)
Berechne Variable Food and beverages industry, Ereignis #20791 (503/986)
Berechne Variable Food and beverages industry, Ereignis #20792 (504/986)
Berechne Variable Food and beverages industry, Ereignis #20793 (505/986)
Berechne Variable Food and beverages industry, Ereignis #20794 (506/986)
Berechne Variable Food and beverages industry, Ereignis #20795 (507/986)
Berechne Variable Food and beverages industry, Ereignis #20796 (508/986)
Berechne Variable Food and beverages industry, Ereignis #20797 (509/986)
Berechne Variable Food and beverages industry, Ereignis #20798 (510/986)
Berechne Variable Food and beverages industry, Ereignis #20799 (511/986)
Berechne Variable Food and beverages industry, Ereignis #20800 (512/986)
Berechne Variable Food and beverages industry, Ereignis #20801 (513/986)
Berechne Variable Food and beverages industry, Ereignis #20802 (514/986)
Berechne Variable Food and beverages industry, Ereignis #20803 (515/986)
Berechne Variable Food and beverages industry, Ereignis #20804 (516/986)
Berechne Variable Food and beverages industry, Ereignis #20805 (517/986)
Berechne Variable Food and beverages industry, Ereignis #20806 (518/986)
Berechne Variable Food and beverages industry, Ereignis #20807 (519/986)
Berechne Variable Food and beverages industry, Ereignis #20808 (520/986)
Berechne Variable Food and beverages industry, Ereignis #20809 (521/986)
Berechne Variable Food and beverages industry, Ereignis #20810 (522/986)
Berechne Variable Food and beverages industry, Ereignis #20811 (523/986)
Berechne Variable Food and beverages industry, Ereignis #20812 (524/986)
Berechne Variable Food and beverages industry, Ereignis #20813 (525/986)
Berechne Variable Food and beverages industry, Ereignis #20814 (526/986)
Berechne Variable Food and beverages industry, Ereignis #20815 (527/986)
Berechne Variable Food and beverages industry, Ereignis #20816 (528/986)
Berechne Variable Food and beverages industry, Ereignis #20817 (529/986)
Berechne Variable Food and beverages industry, Ereignis #20818 (530/986)
Berechne Variable Food and beverages industry, Ereignis #20819 (531/986)
Berechne Variable Food and beverages industry, Ereignis #20820 (532/986)
Berechne Variable Food and beverages industry, Ereignis #20821 (533/986)
Berechne Variable Food and beverages industry, Ereignis #20822 (534/986)
Berechne Variable Food and beverages industry, Ereignis #20823 (535/986)
Berechne Variable Food and beverages industry, Ereignis #20824 (536/986)
Berechne Variable Food and beverages industry, Ereignis #20825 (537/986)
Berechne Variable Food and beverages industry, Ereignis #20826 (538/986)
Berechne Variable Food and beverages industry, Ereignis #20827 (539/986)
Berechne Variable Food and beverages industry, Ereignis #20828 (540/986)
Berechne Variable Food and beverages industry, Ereignis #20829 (541/986)
Berechne Variable Food and beverages industry, Ereignis #20830 (542/986)
Berechne Variable Food and beverages industry, Ereignis #20831 (543/986)
Berechne Variable Food and beverages industry, Ereignis #20832 (544/986)
Berechne Variable Food and beverages industry, Ereignis #20833 (545/986)
Berechne Variable Food and beverages industry, Ereignis #20834 (546/986)
Berechne Variable Food and beverages industry, Ereignis #20835 (547/986)
Berechne Variable Food and beverages industry, Ereignis #20836 (548/986)
Berechne Variable Food and beverages industry, Ereignis #20837 (549/986)
Berechne Variable Food and beverages industry, Ereignis #20838 (550/986)
Berechne Variable Food and beverages industry, Ereignis #20839 (551/986)
Berechne Variable Food and beverages industry, Ereignis #20840 (552/986)
Berechne Variable Food and beverages industry, Ereignis #20841 (553/986)
Berechne Variable Food and beverages industry, Ereignis #20842 (554/986)
Berechne Variable Food and beverages industry, Ereignis #20843 (555/986)
Berechne Variable Food and beverages industry, Ereignis #20844 (556/986)
Berechne Variable Food and beverages industry, Ereignis #20845 (557/986)
Berechne Variable Food and beverages industry, Ereignis #20846 (558/986)
Berechne Variable Food and beverages industry, Ereignis #20847 (559/986)
Berechne Variable Food and beverages industry, Ereignis #20848 (560/986)
Berechne Variable Food and beverages industry, Ereignis #20849 (561/986)
Berechne Variable Food and beverages industry, Ereignis #20850 (562/986)
Berechne Variable Food and beverages industry, Ereignis #20851 (563/986)
Berechne Variable Food and beverages industry, Ereignis #20852 (564/986)
Berechne Variable Food and beverages industry, Ereignis #20853 (565/986)
Berechne Variable Food and beverages industry, Ereignis #20854 (566/986)
Berechne Variable Food and beverages industry, Ereignis #20855 (567/986)
Berechne Variable Food and beverages industry, Ereignis #20856 (568/986)
Berechne Variable Food and beverages industry, Ereignis #20857 (569/986)
Berechne Variable Food and beverages industry, Ereignis #20858 (570/986)
Berechne Variable Food and beverages industry, Ereignis #20859 (571/986)
Berechne Variable Food and beverages industry, Ereignis #20860 (572/986)
Berechne Variable Food and beverages industry, Ereignis #20861 (573/986)
Berechne Variable Food and beverages industry, Ereignis #20862 (574/986)
Berechne Variable Food and beverages industry, Ereignis #20863 (575/986)
Berechne Variable Food and beverages industry, Ereignis #20864 (576/986)
Berechne Variable Food and beverages industry, Ereignis #20865 (577/986)
Berechne Variable Food and beverages industry, Ereignis #20866 (578/986)
Berechne Variable Food and beverages industry, Ereignis #20867 (579/986)
Berechne Variable Food and beverages industry, Ereignis #20868 (580/986)
Berechne Variable Food and beverages industry, Ereignis #20869 (581/986)
Berechne Variable Food and beverages industry, Ereignis #20870 (582/986)
Berechne Variable Food and beverages industry, Ereignis #20871 (583/986)
Berechne Variable Food and beverages industry, Ereignis #20872 (584/986)
Berechne Variable Food and beverages industry, Ereignis #20873 (585/986)
Berechne Variable Food and beverages industry, Ereignis #20874 (586/986)
Berechne Variable Food and beverages industry, Ereignis #20875 (587/986)
Berechne Variable Food and beverages industry, Ereignis #20876 (588/986)
Berechne Variable Food and beverages industry, Ereignis #20877 (589/986)
Berechne Variable Food and beverages industry, Ereignis #20878 (590/986)
Berechne Variable Food and beverages industry, Ereignis #20879 (591/986)
Berechne Variable Food and beverages industry, Ereignis #20880 (592/986)
Berechne Variable Food and beverages industry, Ereignis #20881 (593/986)
Berechne Variable Food and beverages industry, Ereignis #20882 (594/986)
Berechne Variable Food and beverages industry, Ereignis #20883 (595/986)
Berechne Variable Food and beverages industry, Ereignis #20884 (596/986)
Berechne Variable Food and beverages industry, Ereignis #20885 (597/986)
Berechne Variable Pulp and paper, Ereignis #20985 (598/986)
Berechne Variable Pulp and paper, Ereignis #20986 (599/986)
Berechne Variable Pulp and paper, Ereignis #20987 (600/986)
Berechne Variable Pulp and paper, Ereignis #20988 (601/986)
Berechne Variable Pulp and paper, Ereignis #20989 (602/986)
Berechne Variable Pulp and paper, Ereignis #20990 (603/986)
Berechne Variable Pulp and paper, Ereignis #20991 (604/986)
Berechne Variable Pulp and paper, Ereignis #20992 (605/986)
Berechne Variable Pulp and paper, Ereignis #20993 (606/986)
Berechne Variable Pulp and paper, Ereignis #20994 (607/986)
Berechne Variable Pulp and paper, Ereignis #20995 (608/986)
Berechne Variable Pulp and paper, Ereignis #20996 (609/986)
Berechne Variable Pulp and paper, Ereignis #20997 (610/986)
Berechne Variable Pulp and paper, Ereignis #20998 (611/986)
Berechne Variable Pulp and paper, Ereignis #20999 (612/986)
Berechne Variable Pulp and paper, Ereignis #21000 (613/986)
Berechne Variable Pulp and paper, Ereignis #21001 (614/986)
Berechne Variable Pulp and paper, Ereignis #21002 (615/986)
Berechne Variable Pulp and paper, Ereignis #21003 (616/986)
Berechne Variable Pulp and paper, Ereignis #21004 (617/986)
Berechne Variable Pulp and paper, Ereignis #21005 (618/986)
Berechne Variable Pulp and paper, Ereignis #21006 (619/986)
Berechne Variable Pulp and paper, Ereignis #21007 (620/986)
Berechne Variable Pulp and paper, Ereignis #21008 (621/986)
Berechne Variable Pulp and paper, Ereignis #21009 (622/986)
Berechne Variable Pulp and paper, Ereignis #21010 (623/986)
Berechne Variable Pulp and paper, Ereignis #21011 (624/986)
Berechne Variable Pulp and paper, Ereignis #21012 (625/986)
Berechne Variable Pulp and paper, Ereignis #21013 (626/986)
Berechne Variable Pulp and paper, Ereignis #21014 (627/986)
Berechne Variable Pulp and paper, Ereignis #21015 (628/986)
Berechne Variable Pulp and paper, Ereignis #21016 (629/986)
Berechne Variable Pulp and paper, Ereignis #21017 (630/986)
Berechne Variable Pulp and paper, Ereignis #21018 (631/986)
Berechne Variable Pulp and paper, Ereignis #21019 (632/986)
Berechne Variable Pulp and paper, Ereignis #21020 (633/986)
Berechne Variable Pulp and paper, Ereignis #21021 (634/986)
Berechne Variable Pulp and paper, Ereignis #21022 (635/986)
Berechne Variable Pulp and paper, Ereignis #21023 (636/986)
Berechne Variable Pulp and paper, Ereignis #21024 (637/986)
Berechne Variable Pulp and paper, Ereignis #21025 (638/986)
Berechne Variable Pulp and paper, Ereignis #21026 (639/986)
Berechne Variable Pulp and paper, Ereignis #21027 (640/986)
Berechne Variable Pulp and paper, Ereignis #21028 (641/986)
Berechne Variable Pulp and paper, Ereignis #21029 (642/986)
Berechne Variable Pulp and paper, Ereignis #21030 (643/986)
Berechne Variable Pulp and paper, Ereignis #21031 (644/986)
Berechne Variable Pulp and paper, Ereignis #21032 (645/986)
Berechne Variable Pulp and paper, Ereignis #21033 (646/986)
Berechne Variable Pulp and paper, Ereignis #21034 (647/986)
Berechne Variable Pulp and paper, Ereignis #21035 (648/986)
Berechne Variable Pulp and paper, Ereignis #21036 (649/986)
Berechne Variable Pulp and paper, Ereignis #21037 (650/986)
Berechne Variable Pulp and paper, Ereignis #21038 (651/986)
Berechne Variable Pulp and paper, Ereignis #21039 (652/986)
Berechne Variable Pulp and paper, Ereignis #21040 (653/986)
Berechne Variable Pulp and paper, Ereignis #21041 (654/986)
Berechne Variable Pulp and paper, Ereignis #21042 (655/986)
Berechne Variable Pulp and paper, Ereignis #21043 (656/986)
Berechne Variable Pulp and paper, Ereignis #21044 (657/986)
Berechne Variable Pulp and paper, Ereignis #21045 (658/986)
Berechne Variable Pulp and paper, Ereignis #21046 (659/986)
Berechne Variable Pulp and paper, Ereignis #21047 (660/986)
Berechne Variable Pulp and paper, Ereignis #21048 (661/986)
Berechne Variable Pulp and paper, Ereignis #21049 (662/986)
Berechne Variable Pulp and paper, Ereignis #21050 (663/986)
Berechne Variable Pulp and paper, Ereignis #21051 (664/986)
Berechne Variable Pulp and paper, Ereignis #21052 (665/986)
Berechne Variable Pulp and paper, Ereignis #21053 (666/986)
Berechne Variable Pulp and paper, Ereignis #21054 (667/986)
Berechne Variable Pulp and paper, Ereignis #21055 (668/986)
Berechne Variable Pulp and paper, Ereignis #21056 (669/986)
Berechne Variable Pulp and paper, Ereignis #21057 (670/986)
Berechne Variable Pulp and paper, Ereignis #21058 (671/986)
Berechne Variable Pulp and paper, Ereignis #21059 (672/986)
Berechne Variable Pulp and paper, Ereignis #21060 (673/986)
Berechne Variable Pulp and paper, Ereignis #21061 (674/986)
Berechne Variable Pulp and paper, Ereignis #21062 (675/986)
Berechne Variable Pulp and paper, Ereignis #21063 (676/986)
Berechne Variable Pulp and paper, Ereignis #21064 (677/986)
Berechne Variable Pulp and paper, Ereignis #21065 (678/986)
Berechne Variable Pulp and paper, Ereignis #21066 (679/986)
Berechne Variable Pulp and paper, Ereignis #21067 (680/986)
Berechne Variable Pulp and paper, Ereignis #21068 (681/986)
Berechne Variable Pulp and paper, Ereignis #21069 (682/986)
Berechne Variable Pulp and paper, Ereignis #21070 (683/986)
Berechne Variable Pulp and paper, Ereignis #21071 (684/986)
Berechne Variable Pulp and paper, Ereignis #21072 (685/986)
Berechne Variable Pulp and paper, Ereignis #21073 (686/986)
Berechne Variable Pulp and paper, Ereignis #21074 (687/986)
Berechne Variable Pulp and paper, Ereignis #21075 (688/986)
Berechne Variable Pulp and paper, Ereignis #21076 (689/986)
Berechne Variable Pulp and paper, Ereignis #21077 (690/986)
Berechne Variable Pulp and paper, Ereignis #21078 (691/986)
Berechne Variable Pulp and paper, Ereignis #21079 (692/986)
Berechne Variable Pulp and paper, Ereignis #21080 (693/986)
Berechne Variable Pulp and paper, Ereignis #21081 (694/986)
Berechne Variable Pulp and paper, Ereignis #21082 (695/986)
Berechne Variable Pulp and paper, Ereignis #21083 (696/986)
Berechne Variable Pulp and paper, Ereignis #21117 (697/986)
Berechne Variable Pulp and paper, Ereignis #21118 (698/986)
Berechne Variable Pulp and paper, Ereignis #21119 (699/986)
Berechne Variable Pulp and paper, Ereignis #21120 (700/986)
Berechne Variable Pulp and paper, Ereignis #21121 (701/986)
Berechne Variable Pulp and paper, Ereignis #21122 (702/986)
Berechne Variable Pulp and paper, Ereignis #21123 (703/986)
Berechne Variable Pulp and paper, Ereignis #21124 (704/986)
Berechne Variable Pulp and paper, Ereignis #21125 (705/986)
Berechne Variable Pulp and paper, Ereignis #21126 (706/986)
Berechne Variable Pulp and paper, Ereignis #21127 (707/986)
Berechne Variable Pulp and paper, Ereignis #21128 (708/986)
Berechne Variable Pulp and paper, Ereignis #21129 (709/986)
Berechne Variable Pulp and paper, Ereignis #21130 (710/986)
Berechne Variable Pulp and paper, Ereignis #21131 (711/986)
Berechne Variable Pulp and paper, Ereignis #21132 (712/986)
Berechne Variable Pulp and paper, Ereignis #21133 (713/986)
Berechne Variable Pulp and paper, Ereignis #21134 (714/986)
Berechne Variable Pulp and paper, Ereignis #21135 (715/986)
Berechne Variable Pulp and paper, Ereignis #21136 (716/986)
Berechne Variable Pulp and paper, Ereignis #21137 (717/986)
Berechne Variable Pulp and paper, Ereignis #21138 (718/986)
Berechne Variable Pulp and paper, Ereignis #21139 (719/986)
Berechne Variable Pulp and paper, Ereignis #21140 (720/986)
Berechne Variable Pulp and paper, Ereignis #21141 (721/986)
Berechne Variable Pulp and paper, Ereignis #21142 (722/986)
Berechne Variable Pulp and paper, Ereignis #21143 (723/986)
Berechne Variable Pulp and paper, Ereignis #21144 (724/986)
Berechne Variable Pulp and paper, Ereignis #21145 (725/986)
Berechne Variable Pulp and paper, Ereignis #21146 (726/986)
Berechne Variable Pulp and paper, Ereignis #21147 (727/986)
Berechne Variable Pulp and paper, Ereignis #21148 (728/986)
Berechne Variable Pulp and paper, Ereignis #21149 (729/986)
Berechne Variable Pulp and paper, Ereignis #21150 (730/986)
Berechne Variable Pulp and paper, Ereignis #21151 (731/986)
Berechne Variable Pulp and paper, Ereignis #21152 (732/986)
Berechne Variable Pulp and paper, Ereignis #21153 (733/986)
Berechne Variable Pulp and paper, Ereignis #21154 (734/986)
Berechne Variable Pulp and paper, Ereignis #21155 (735/986)
Berechne Variable Pulp and paper, Ereignis #21156 (736/986)
Berechne Variable Pulp and paper, Ereignis #21157 (737/986)
Berechne Variable Pulp and paper, Ereignis #21158 (738/986)
Berechne Variable Pulp and paper, Ereignis #21159 (739/986)
Berechne Variable Pulp and paper, Ereignis #21160 (740/986)
Berechne Variable Pulp and paper, Ereignis #21161 (741/986)
Berechne Variable Pulp and paper, Ereignis #21162 (742/986)
Berechne Variable Pulp and paper, Ereignis #21163 (743/986)
Berechne Variable Pulp and paper, Ereignis #21164 (744/986)
Berechne Variable Pulp and paper, Ereignis #21165 (745/986)
Berechne Variable Pulp and paper, Ereignis #21166 (746/986)
Berechne Variable Pulp and paper, Ereignis #21167 (747/986)
Berechne Variable Pulp and paper, Ereignis #21168 (748/986)
Berechne Variable Pulp and paper, Ereignis #21169 (749/986)
Berechne Variable Pulp and paper, Ereignis #21170 (750/986)
Berechne Variable Pulp and paper, Ereignis #21171 (751/986)
Berechne Variable Pulp and paper, Ereignis #21172 (752/986)
Berechne Variable Pulp and paper, Ereignis #21173 (753/986)
Berechne Variable Pulp and paper, Ereignis #21174 (754/986)
Berechne Variable Pulp and paper, Ereignis #21175 (755/986)
Berechne Variable Pulp and paper, Ereignis #21176 (756/986)
Berechne Variable Pulp and paper, Ereignis #21177 (757/986)
Berechne Variable Pulp and paper, Ereignis #21178 (758/986)
Berechne Variable Pulp and paper, Ereignis #21179 (759/986)
Berechne Variable Pulp and paper, Ereignis #21180 (760/986)
Berechne Variable Pulp and paper, Ereignis #21181 (761/986)
Berechne Variable Pulp and paper, Ereignis #21182 (762/986)
Berechne Variable Pulp and paper, Ereignis #21183 (763/986)
Berechne Variable Pulp and paper, Ereignis #21184 (764/986)
Berechne Variable Pulp and paper, Ereignis #21185 (765/986)
Berechne Variable Pulp and paper, Ereignis #21186 (766/986)
Berechne Variable Pulp and paper, Ereignis #21187 (767/986)
Berechne Variable Pulp and paper, Ereignis #21188 (768/986)
Berechne Variable Pulp and paper, Ereignis #21189 (769/986)
Berechne Variable Pulp and paper, Ereignis #21190 (770/986)
Berechne Variable Pulp and paper, Ereignis #21191 (771/986)
Berechne Variable Pulp and paper, Ereignis #21192 (772/986)
Berechne Variable Pulp and paper, Ereignis #21193 (773/986)
Berechne Variable Pulp and paper, Ereignis #21194 (774/986)
Berechne Variable Pulp and paper, Ereignis #21195 (775/986)
Berechne Variable Pulp and paper, Ereignis #21196 (776/986)
Berechne Variable Pulp and paper, Ereignis #21197 (777/986)
Berechne Variable Pulp and paper, Ereignis #21198 (778/986)
Berechne Variable Pulp and paper, Ereignis #21199 (779/986)
Berechne Variable Pulp and paper, Ereignis #21200 (780/986)
Berechne Variable Pulp and paper, Ereignis #21201 (781/986)
Berechne Variable Pulp and paper, Ereignis #21202 (782/986)
Berechne Variable Pulp and paper, Ereignis #21203 (783/986)
Berechne Variable Pulp and paper, Ereignis #21204 (784/986)
Berechne Variable Pulp and paper, Ereignis #21205 (785/986)
Berechne Variable Pulp and paper, Ereignis #21206 (786/986)
Berechne Variable Pulp and paper, Ereignis #21207 (787/986)
Berechne Variable Pulp and paper, Ereignis #21208 (788/986)
Berechne Variable Pulp and paper, Ereignis #21209 (789/986)
Berechne Variable Pulp and paper, Ereignis #21210 (790/986)
Berechne Variable Pulp and paper, Ereignis #21211 (791/986)
Berechne Variable Pulp and paper, Ereignis #21212 (792/986)
Berechne Variable Pulp and paper, Ereignis #21213 (793/986)
Berechne Variable Pulp and paper, Ereignis #21214 (794/986)
Berechne Variable Pulp and paper, Ereignis #21215 (795/986)
Berechne Variable Confidential Emissions of F-Gases, Ereignis #21315 (796/986)
Berechne Variable Confidential Emissions of F-Gases, Ereignis #21316 (797/986)
Berechne Variable Confidential Emissions of F-Gases, Ereignis #21317 (798/986)
Berechne Variable Confidential Emissions of F-Gases, Ereignis #21318 (799/986)
Berechne Variable Confidential Emissions of F-Gases, Ereignis #21319 (800/986)
Berechne Variable Confidential Emissions of F-Gases, Ereignis #21320 (801/986)
Berechne Variable Confidential Emissions of F-Gases, Ereignis #21321 (802/986)
Berechne Variable Confidential Emissions of F-Gases, Ereignis #21322 (803/986)
Berechne Variable Confidential Emissions of F-Gases, Ereignis #21323 (804/986)
Berechne Variable Confidential Emissions of F-Gases, Ereignis #21324 (805/986)
Berechne Variable Confidential Emissions of F-Gases, Ereignis #21325 (806/986)
Berechne Variable Confidential Emissions of F-Gases, Ereignis #21326 (807/986)
Berechne Variable Confidential Emissions of F-Gases, Ereignis #21327 (808/986)
Berechne Variable Confidential Emissions of F-Gases, Ereignis #21328 (809/986)
Berechne Variable Confidential Emissions of F-Gases, Ereignis #21329 (810/986)
Berechne Variable Confidential Emissions of F-Gases, Ereignis #21330 (811/986)
Berechne Variable Confidential Emissions of F-Gases, Ereignis #21331 (812/986)
Berechne Variable Confidential Emissions of F-Gases, Ereignis #21332 (813/986)
Berechne Variable Confidential Emissions of F-Gases, Ereignis #21333 (814/986)
Berechne Variable Confidential Emissions of F-Gases, Ereignis #21334 (815/986)
Berechne Variable Confidential Emissions of F-Gases, Ereignis #21335 (816/986)
Berechne Variable Confidential Emissions of F-Gases, Ereignis #21336 (817/986)
Berechne Variable Confidential Emissions of F-Gases, Ereignis #21337 (818/986)
Berechne Variable Confidential Emissions of F-Gases, Ereignis #21338 (819/986)
Berechne Variable Confidential Emissions of F-Gases, Ereignis #21339 (820/986)
Berechne Variable Confidential Emissions of F-Gases, Ereignis #21340 (821/986)
Berechne Variable Confidential Emissions of F-Gases, Ereignis #21341 (822/986)
Berechne Variable Confidential Emissions of F-Gases, Ereignis #21342 (823/986)
Berechne Variable Confidential Emissions of F-Gases, Ereignis #21343 (824/986)
Berechne Variable Confidential Emissions of F-Gases, Ereignis #21344 (825/986)
Berechne Variable Confidential Emissions of F-Gases, Ereignis #21345 (826/986)
Berechne Variable Confidential Emissions of F-Gases, Ereignis #21346 (827/986)
Berechne Variable Confidential Emissions of F-Gases, Ereignis #21347 (828/986)
Berechne Variable Confidential Emissions of F-Gases, Ereignis #21348 (829/986)
Berechne Variable Confidential Emissions of F-Gases, Ereignis #21349 (830/986)
Berechne Variable Confidential Emissions of F-Gases, Ereignis #21350 (831/986)
Berechne Variable Confidential Emissions of F-Gases, Ereignis #21351 (832/986)
Berechne Variable Confidential Emissions of F-Gases, Ereignis #21352 (833/986)
Berechne Variable Confidential Emissions of F-Gases, Ereignis #21353 (834/986)
Berechne Variable Confidential Emissions of F-Gases, Ereignis #21354 (835/986)
Berechne Variable Confidential Emissions of F-Gases, Ereignis #21355 (836/986)
Berechne Variable Confidential Emissions of F-Gases, Ereignis #21356 (837/986)
Berechne Variable Confidential Emissions of F-Gases, Ereignis #21357 (838/986)
Berechne Variable Confidential Emissions of F-Gases, Ereignis #21358 (839/986)
Berechne Variable Confidential Emissions of F-Gases, Ereignis #21359 (840/986)
Berechne Variable Confidential Emissions of F-Gases, Ereignis #21360 (841/986)
Berechne Variable Confidential Emissions of F-Gases, Ereignis #21361 (842/986)
Berechne Variable Confidential Emissions of F-Gases, Ereignis #21362 (843/986)
Berechne Variable Confidential Emissions of F-Gases, Ereignis #21363 (844/986)
Berechne Variable Confidential Emissions of F-Gases, Ereignis #21364 (845/986)
Berechne Variable Confidential Emissions of F-Gases, Ereignis #21365 (846/986)
Berechne Variable Confidential Emissions of F-Gases, Ereignis #21366 (847/986)
Berechne Variable Confidential Emissions of F-Gases, Ereignis #21367 (848/986)
Berechne Variable Confidential Emissions of F-Gases, Ereignis #21368 (849/986)
Berechne Variable Confidential Emissions of F-Gases, Ereignis #21369 (850/986)
Berechne Variable Confidential Emissions of F-Gases, Ereignis #21370 (851/986)
Berechne Variable Confidential Emissions of F-Gases, Ereignis #21371 (852/986)
Berechne Variable Confidential Emissions of F-Gases, Ereignis #21372 (853/986)
Berechne Variable Confidential Emissions of F-Gases, Ereignis #21373 (854/986)
Berechne Variable Confidential Emissions of F-Gases, Ereignis #21374 (855/986)
Berechne Variable Confidential Emissions of F-Gases, Ereignis #21375 (856/986)
Berechne Variable Confidential Emissions of F-Gases, Ereignis #21376 (857/986)
Berechne Variable Confidential Emissions of F-Gases, Ereignis #21377 (858/986)
Berechne Variable Confidential Emissions of F-Gases, Ereignis #21378 (859/986)
Berechne Variable Confidential Emissions of F-Gases, Ereignis #21379 (860/986)
Berechne Variable Confidential Emissions of F-Gases, Ereignis #21380 (861/986)
Berechne Variable Confidential Emissions of F-Gases, Ereignis #21381 (862/986)
Berechne Variable Confidential Emissions of F-Gases, Ereignis #21382 (863/986)
Berechne Variable Confidential Emissions of F-Gases, Ereignis #21383 (864/986)
Berechne Variable Confidential Emissions of F-Gases, Ereignis #21384 (865/986)
Berechne Variable Confidential Emissions of F-Gases, Ereignis #21385 (866/986)
Berechne Variable Confidential Emissions of F-Gases, Ereignis #21386 (867/986)
Berechne Variable Confidential Emissions of F-Gases, Ereignis #21387 (868/986)
Berechne Variable Confidential Emissions of F-Gases, Ereignis #21388 (869/986)
Berechne Variable Confidential Emissions of F-Gases, Ereignis #21389 (870/986)
Berechne Variable Confidential Emissions of F-Gases, Ereignis #21390 (871/986)
Berechne Variable Confidential Emissions of F-Gases, Ereignis #21391 (872/986)
Berechne Variable Confidential Emissions of F-Gases, Ereignis #21392 (873/986)
Berechne Variable Confidential Emissions of F-Gases, Ereignis #21393 (874/986)
Berechne Variable Confidential Emissions of F-Gases, Ereignis #21394 (875/986)
Berechne Variable Confidential Emissions of F-Gases, Ereignis #21395 (876/986)
Berechne Variable Confidential Emissions of F-Gases, Ereignis #21396 (877/986)
Berechne Variable Confidential Emissions of F-Gases, Ereignis #21397 (878/986)
Berechne Variable Confidential Emissions of F-Gases, Ereignis #21398 (879/986)
Berechne Variable Confidential Emissions of F-Gases, Ereignis #21399 (880/986)
Berechne Variable Confidential Emissions of F-Gases, Ereignis #21400 (881/986)
Berechne Variable Confidential Emissions of F-Gases, Ereignis #21401 (882/986)
Berechne Variable Confidential Emissions of F-Gases, Ereignis #21402 (883/986)
Berechne Variable Confidential Emissions of F-Gases, Ereignis #21403 (884/986)
Berechne Variable Confidential Emissions of F-Gases, Ereignis #21404 (885/986)
Berechne Variable Confidential Emissions of F-Gases, Ereignis #21405 (886/986)
Berechne Variable Confidential Emissions of F-Gases, Ereignis #21406 (887/986)
Berechne Variable Confidential Emissions of F-Gases, Ereignis #21407 (888/986)
Berechne Variable Confidential Emissions of F-Gases, Ereignis #21408 (889/986)
Berechne Variable Confidential Emissions of F-Gases, Ereignis #21409 (890/986)
Berechne Variable Confidential Emissions of F-Gases, Ereignis #21410 (891/986)
Berechne Variable Confidential Emissions of F-Gases, Ereignis #21443 (892/986)
Berechne Variable Confidential Emissions of F-Gases, Ereignis #21444 (893/986)
Berechne Variable Confidential Emissions of F-Gases, Ereignis #21445 (894/986)
Berechne Variable Confidential Emissions of F-Gases, Ereignis #21446 (895/986)
Berechne Variable Confidential Emissions of F-Gases, Ereignis #21447 (896/986)
Berechne Variable Confidential Emissions of F-Gases, Ereignis #21448 (897/986)
Berechne Variable Confidential Emissions of F-Gases, Ereignis #21449 (898/986)
Berechne Variable Confidential Emissions of F-Gases, Ereignis #21450 (899/986)
Berechne Variable Confidential Emissions of F-Gases, Ereignis #21451 (900/986)
Berechne Variable Confidential Emissions of F-Gases, Ereignis #21452 (901/986)
Berechne Variable Confidential Emissions of F-Gases, Ereignis #21453 (902/986)
Berechne Variable Confidential Emissions of F-Gases, Ereignis #21454 (903/986)
Berechne Variable Confidential Emissions of F-Gases, Ereignis #21455 (904/986)
Berechne Variable Confidential Emissions of F-Gases, Ereignis #21456 (905/986)
Berechne Variable Confidential Emissions of F-Gases, Ereignis #21457 (906/986)
Berechne Variable Confidential Emissions of F-Gases, Ereignis #21458 (907/986)
Berechne Variable Confidential Emissions of F-Gases, Ereignis #21459 (908/986)
Berechne Variable Confidential Emissions of F-Gases, Ereignis #21460 (909/986)
Berechne Variable Confidential Emissions of F-Gases, Ereignis #21461 (910/986)
Berechne Variable Confidential Emissions of F-Gases, Ereignis #21462 (911/986)
Berechne Variable Confidential Emissions of F-Gases, Ereignis #21463 (912/986)
Berechne Variable Confidential Emissions of F-Gases, Ereignis #21464 (913/986)
Berechne Variable Confidential Emissions of F-Gases, Ereignis #21465 (914/986)
Berechne Variable Confidential Emissions of F-Gases, Ereignis #21466 (915/986)
Berechne Variable Confidential Emissions of F-Gases, Ereignis #21467 (916/986)
Berechne Variable Confidential Emissions of F-Gases, Ereignis #21468 (917/986)
Berechne Variable Confidential Emissions of F-Gases, Ereignis #21469 (918/986)
Berechne Variable Confidential Emissions of F-Gases, Ereignis #21470 (919/986)
Berechne Variable Confidential Emissions of F-Gases, Ereignis #21471 (920/986)
Berechne Variable Confidential Emissions of F-Gases, Ereignis #21472 (921/986)
Berechne Variable Confidential Emissions of F-Gases, Ereignis #21473 (922/986)
Berechne Variable Confidential Emissions of F-Gases, Ereignis #21474 (923/986)
Berechne Variable Confidential Emissions of F-Gases, Ereignis #21475 (924/986)
Berechne Variable Confidential Emissions of F-Gases, Ereignis #21476 (925/986)
Berechne Variable Confidential Emissions of F-Gases, Ereignis #21477 (926/986)
Berechne Variable Confidential Emissions of F-Gases, Ereignis #21478 (927/986)
Berechne Variable Confidential Emissions of F-Gases, Ereignis #21479 (928/986)
Berechne Variable Confidential Emissions of F-Gases, Ereignis #21480 (929/986)
Berechne Variable Confidential Emissions of F-Gases, Ereignis #21481 (930/986)
Berechne Variable Confidential Emissions of F-Gases, Ereignis #21482 (931/986)
Berechne Variable Confidential Emissions of F-Gases, Ereignis #21483 (932/986)
Berechne Variable Confidential Emissions of F-Gases, Ereignis #21484 (933/986)
Berechne Variable Confidential Emissions of F-Gases, Ereignis #21485 (934/986)
Berechne Variable Confidential Emissions of F-Gases, Ereignis #21486 (935/986)
Berechne Variable Confidential Emissions of F-Gases, Ereignis #21487 (936/986)
Berechne Variable Confidential Emissions of F-Gases, Ereignis #21488 (937/986)
Berechne Variable Confidential Emissions of F-Gases, Ereignis #21489 (938/986)
Berechne Variable Confidential Emissions of F-Gases, Ereignis #21490 (939/986)
Berechne Variable Confidential Emissions of F-Gases, Ereignis #21491 (940/986)
Berechne Variable Confidential Emissions of F-Gases, Ereignis #21492 (941/986)
Berechne Variable Confidential Emissions of F-Gases, Ereignis #21493 (942/986)
Berechne Variable Confidential Emissions of F-Gases, Ereignis #21494 (943/986)
Berechne Variable Confidential Emissions of F-Gases, Ereignis #21495 (944/986)
Berechne Variable Confidential Emissions of F-Gases, Ereignis #21496 (945/986)
Berechne Variable Confidential Emissions of F-Gases, Ereignis #21497 (946/986)
Berechne Variable Confidential Emissions of F-Gases, Ereignis #21498 (947/986)
Berechne Variable Confidential Emissions of F-Gases, Ereignis #21499 (948/986)
Berechne Variable Confidential Emissions of F-Gases, Ereignis #21500 (949/986)
Berechne Variable Confidential Emissions of F-Gases, Ereignis #21501 (950/986)
Berechne Variable Confidential Emissions of F-Gases, Ereignis #21502 (951/986)
Berechne Variable Confidential Emissions of F-Gases, Ereignis #21503 (952/986)
Berechne Variable Confidential Emissions of F-Gases, Ereignis #21504 (953/986)
Berechne Variable Confidential Emissions of F-Gases, Ereignis #21505 (954/986)
Berechne Variable Confidential Emissions of F-Gases, Ereignis #21506 (955/986)
Berechne Variable Confidential Emissions of F-Gases, Ereignis #21507 (956/986)
Berechne Variable Confidential Emissions of F-Gases, Ereignis #21508 (957/986)
Berechne Variable Confidential Emissions of F-Gases, Ereignis #21509 (958/986)
Berechne Variable Confidential Emissions of F-Gases, Ereignis #21510 (959/986)
Berechne Variable Confidential Emissions of F-Gases, Ereignis #21511 (960/986)
Berechne Variable Confidential Emissions of F-Gases, Ereignis #21512 (961/986)
Berechne Variable Confidential Emissions of F-Gases, Ereignis #21513 (962/986)
Berechne Variable Confidential Emissions of F-Gases, Ereignis #21514 (963/986)
Berechne Variable Confidential Emissions of F-Gases, Ereignis #21515 (964/986)
Berechne Variable Confidential Emissions of F-Gases, Ereignis #21516 (965/986)
Berechne Variable Confidential Emissions of F-Gases, Ereignis #21517 (966/986)
Berechne Variable Confidential Emissions of F-Gases, Ereignis #21518 (967/986)
Berechne Variable Confidential Emissions of F-Gases, Ereignis #21519 (968/986)
Berechne Variable Confidential Emissions of F-Gases, Ereignis #21520 (969/986)
Berechne Variable Confidential Emissions of F-Gases, Ereignis #21521 (970/986)
Berechne Variable Confidential Emissions of F-Gases, Ereignis #21522 (971/986)
Berechne Variable Confidential Emissions of F-Gases, Ereignis #21523 (972/986)
Berechne Variable Confidential Emissions of F-Gases, Ereignis #21524 (973/986)
Berechne Variable Confidential Emissions of F-Gases, Ereignis #21525 (974/986)
Berechne Variable Confidential Emissions of F-Gases, Ereignis #21526 (975/986)
Berechne Variable Confidential Emissions of F-Gases, Ereignis #21527 (976/986)
Berechne Variable Confidential Emissions of F-Gases, Ereignis #21528 (977/986)
Berechne Variable Confidential Emissions of F-Gases, Ereignis #21529 (978/986)
Berechne Variable Confidential Emissions of F-Gases, Ereignis #21530 (979/986)
Berechne Variable Confidential Emissions of F-Gases, Ereignis #21531 (980/986)
Berechne Variable Confidential Emissions of F-Gases, Ereignis #21532 (981/986)
Berechne Variable Confidential Emissions of F-Gases, Ereignis #21533 (982/986)
Berechne Variable Confidential Emissions of F-Gases, Ereignis #21534 (983/986)
Berechne Variable Confidential Emissions of F-Gases, Ereignis #21536 (984/986)
Berechne Variable Confidential Emissions of F-Gases, Ereignis #21537 (985/986)
Berechne Variable Confidential Emissions of F-Gases, Ereignis #21538 (986/986)
Datei '\\tsclient\C\Program Files\Housesoft\ZSEnext\tables\data\crf_exporter\reporter_import_files\Submission 2024\import files\2 Industry\2H.xml' wurde geschrieben (32538 Werte).
Vorgang beendet (00:01:13.8471603)
