Vorgang gestartet
Berechne Variable Iron and Steel Production, Ereignis #5562 (1/735)
Berechne Variable Iron and Steel Production, Ereignis #5563 (2/735)
Berechne Variable Iron and Steel Production, Ereignis #5565 (3/735)
Berechne Variable Iron and Steel Production, Ereignis #5566 (4/735)
Berechne Variable Iron and Steel Production, Ereignis #5567 (5/735)
Berechne Variable Iron and Steel Production, Ereignis #5568 (6/735)
Berechne Variable Iron and Steel Production, Ereignis #5569 (7/735)
Berechne Variable Iron and Steel Production, Ereignis #5570 (8/735)
Berechne Variable Iron and Steel Production, Ereignis #5571 (9/735)
Berechne Variable Iron and Steel Production, Ereignis #5572 (10/735)
Berechne Variable Iron and Steel Production, Ereignis #5573 (11/735)
Berechne Variable Iron and Steel Production, Ereignis #5574 (12/735)
Berechne Variable Iron and Steel Production, Ereignis #5575 (13/735)
Berechne Variable Iron and Steel Production, Ereignis #17882 (14/735)
Berechne Variable Iron and Steel Production, Ereignis #17883 (15/735)
Berechne Variable Iron and Steel Production, Ereignis #17884 (16/735)
Berechne Variable Iron and Steel Production, Ereignis #17885 (17/735)
Berechne Variable Iron and Steel Production, Ereignis #17886 (18/735)
Berechne Variable Iron and Steel Production, Ereignis #17887 (19/735)
Berechne Variable Iron and Steel Production, Ereignis #17888 (20/735)
Berechne Variable Iron and Steel Production, Ereignis #17889 (21/735)
Berechne Variable Iron and Steel Production, Ereignis #17890 (22/735)
Berechne Variable Iron and Steel Production, Ereignis #17891 (23/735)
Berechne Variable Iron and Steel Production, Ereignis #17892 (24/735)
Berechne Variable Iron and Steel Production, Ereignis #17893 (25/735)
Berechne Variable Iron and Steel Production, Ereignis #17894 (26/735)
Berechne Variable Iron and Steel Production, Ereignis #17895 (27/735)
Berechne Variable Iron and Steel Production, Ereignis #17896 (28/735)
Berechne Variable Iron and Steel Production, Ereignis #17897 (29/735)
Berechne Variable Iron and Steel Production, Ereignis #17898 (30/735)
Berechne Variable Iron and Steel Production, Ereignis #17899 (31/735)
Berechne Variable Iron and Steel Production, Ereignis #17900 (32/735)
Berechne Variable Iron and Steel Production, Ereignis #17901 (33/735)
Berechne Variable Iron and Steel Production, Ereignis #17902 (34/735)
Berechne Variable Iron and Steel Production, Ereignis #17903 (35/735)
Berechne Variable Iron and Steel Production, Ereignis #17904 (36/735)
Berechne Variable Iron and Steel Production, Ereignis #17905 (37/735)
Berechne Variable Iron and Steel Production, Ereignis #17906 (38/735)
Berechne Variable Iron and Steel Production, Ereignis #17907 (39/735)
Berechne Variable Iron and Steel Production, Ereignis #17908 (40/735)
Berechne Variable Iron and Steel Production, Ereignis #17909 (41/735)
Berechne Variable Iron and Steel Production, Ereignis #17910 (42/735)
Berechne Variable Iron and Steel Production, Ereignis #17911 (43/735)
Berechne Variable Iron and Steel Production, Ereignis #17912 (44/735)
Berechne Variable Iron and Steel Production, Ereignis #17913 (45/735)
Berechne Variable Iron and Steel Production, Ereignis #17914 (46/735)
Berechne Variable Iron and Steel Production, Ereignis #17915 (47/735)
Berechne Variable Iron and Steel Production, Ereignis #17916 (48/735)
Berechne Variable Iron and Steel Production, Ereignis #17917 (49/735)
Berechne Variable Iron and Steel Production, Ereignis #17918 (50/735)
Berechne Variable Iron and Steel Production, Ereignis #17919 (51/735)
Berechne Variable Iron and Steel Production, Ereignis #17920 (52/735)
Berechne Variable Iron and Steel Production, Ereignis #17921 (53/735)
Berechne Variable Iron and Steel Production, Ereignis #17922 (54/735)
Berechne Variable Iron and Steel Production, Ereignis #17923 (55/735)
Berechne Variable Iron and Steel Production, Ereignis #17924 (56/735)
Berechne Variable Iron and Steel Production, Ereignis #17925 (57/735)
Berechne Variable Iron and Steel Production, Ereignis #17926 (58/735)
Berechne Variable Iron and Steel Production, Ereignis #17927 (59/735)
Berechne Variable Iron and Steel Production, Ereignis #17928 (60/735)
Berechne Variable Iron and Steel Production, Ereignis #17929 (61/735)
Berechne Variable Iron and Steel Production, Ereignis #17930 (62/735)
Berechne Variable Iron and Steel Production, Ereignis #17931 (63/735)
Berechne Variable Iron and Steel Production, Ereignis #17932 (64/735)
Berechne Variable Iron and Steel Production, Ereignis #17933 (65/735)
Berechne Variable Iron and Steel Production, Ereignis #17934 (66/735)
Berechne Variable Iron and Steel Production, Ereignis #17935 (67/735)
Berechne Variable Iron and Steel Production, Ereignis #17936 (68/735)
Berechne Variable Iron and Steel Production, Ereignis #17937 (69/735)
Berechne Variable Iron and Steel Production, Ereignis #17938 (70/735)
Berechne Variable Iron and Steel Production, Ereignis #17939 (71/735)
Berechne Variable Iron and Steel Production, Ereignis #17940 (72/735)
Berechne Variable Iron and Steel Production, Ereignis #17941 (73/735)
Berechne Variable Iron and Steel Production, Ereignis #17942 (74/735)
Berechne Variable Iron and Steel Production, Ereignis #17943 (75/735)
Berechne Variable Iron and Steel Production, Ereignis #17944 (76/735)
Berechne Variable Iron and Steel Production, Ereignis #17945 (77/735)
Berechne Variable Iron and Steel Production, Ereignis #17946 (78/735)
Berechne Variable Iron and Steel Production, Ereignis #17947 (79/735)
Berechne Variable Iron and Steel Production, Ereignis #17948 (80/735)
Berechne Variable Iron and Steel Production, Ereignis #17949 (81/735)
Berechne Variable Iron and Steel Production, Ereignis #17950 (82/735)
Berechne Variable Iron and Steel Production, Ereignis #17951 (83/735)
Berechne Variable Iron and Steel Production, Ereignis #17952 (84/735)
Berechne Variable Iron and Steel Production, Ereignis #17953 (85/735)
Berechne Variable Iron and Steel Production, Ereignis #17954 (86/735)
Berechne Variable Iron and Steel Production, Ereignis #17955 (87/735)
Berechne Variable Iron and Steel Production, Ereignis #17956 (88/735)
Berechne Variable Iron and Steel Production, Ereignis #17957 (89/735)
Berechne Variable Iron and Steel Production, Ereignis #17958 (90/735)
Berechne Variable Iron and Steel Production, Ereignis #17959 (91/735)
Berechne Variable Iron and Steel Production, Ereignis #17960 (92/735)
Berechne Variable Iron and Steel Production, Ereignis #17961 (93/735)
Berechne Variable Iron and Steel Production, Ereignis #17962 (94/735)
Berechne Variable Iron and Steel Production, Ereignis #17963 (95/735)
Berechne Variable Iron and Steel Production, Ereignis #17964 (96/735)
Berechne Variable Iron and Steel Production, Ereignis #17965 (97/735)
Berechne Variable Iron and Steel Production, Ereignis #17966 (98/735)
Berechne Variable Iron and Steel Production, Ereignis #17967 (99/735)
Berechne Variable Iron and Steel Production, Ereignis #17968 (100/735)
Berechne Variable Iron and Steel Production, Ereignis #17969 (101/735)
Berechne Variable Iron and Steel Production, Ereignis #17970 (102/735)
Berechne Variable Iron and Steel Production, Ereignis #17971 (103/735)
Berechne Variable Steel, Ereignis #5585 (104/735)
Berechne Variable Steel, Ereignis #5587 (105/735)
Berechne Variable Steel, Ereignis #5589 (106/735)
Berechne Variable Steel, Ereignis #5590 (107/735)
Berechne Variable Steel, Ereignis #5591 (108/735)
Berechne Variable Steel, Ereignis #5592 (109/735)
Berechne Variable Steel, Ereignis #5594 (110/735)
Berechne Variable Steel, Ereignis #5595 (111/735)
Berechne Variable Steel, Ereignis #5596 (112/735)
Berechne Variable Pig Iron, Ereignis #5597 (113/735)
Berechne Variable Pig Iron, Ereignis #5598 (114/735)
Berechne Variable Pig Iron, Ereignis #5600 (115/735)
Berechne Variable Pig Iron, Ereignis #5601 (116/735)
Berechne Variable Pig Iron, Ereignis #5602 (117/735)
Berechne Variable Pig Iron, Ereignis #5603 (118/735)
Berechne Variable Pig Iron, Ereignis #5604 (119/735)
Berechne Variable Pig Iron, Ereignis #5605 (120/735)
Berechne Variable Pig Iron, Ereignis #5606 (121/735)
Berechne Variable Pig Iron, Ereignis #5607 (122/735)
Berechne Variable Pig Iron, Ereignis #5608 (123/735)
Berechne Variable Direct Reduced Iron, Ereignis #5609 (124/735)
Berechne Variable Direct Reduced Iron, Ereignis #5610 (125/735)
Berechne Variable Direct Reduced Iron, Ereignis #5612 (126/735)
Berechne Variable Direct Reduced Iron, Ereignis #5613 (127/735)
Berechne Variable Direct Reduced Iron, Ereignis #5614 (128/735)
Berechne Variable Direct Reduced Iron, Ereignis #5615 (129/735)
Berechne Variable Direct Reduced Iron, Ereignis #5616 (130/735)
Berechne Variable Direct Reduced Iron, Ereignis #5617 (131/735)
Berechne Variable Direct Reduced Iron, Ereignis #5618 (132/735)
Berechne Variable Direct Reduced Iron, Ereignis #5619 (133/735)
Berechne Variable Direct Reduced Iron, Ereignis #5620 (134/735)
Berechne Variable Sinter, Ereignis #5621 (135/735)
Berechne Variable Sinter, Ereignis #5622 (136/735)
Berechne Variable Sinter, Ereignis #5623 (137/735)
Berechne Variable Sinter, Ereignis #5624 (138/735)
Berechne Variable Sinter, Ereignis #5625 (139/735)
Berechne Variable Sinter, Ereignis #5626 (140/735)
Berechne Variable Sinter, Ereignis #5627 (141/735)
Berechne Variable Sinter, Ereignis #5628 (142/735)
Berechne Variable Sinter, Ereignis #5629 (143/735)
Berechne Variable Sinter, Ereignis #5630 (144/735)
Berechne Variable Sinter, Ereignis #5631 (145/735)
Berechne Variable Sinter, Ereignis #5632 (146/735)
Berechne Variable Pellet, Ereignis #5633 (147/735)
Berechne Variable Pellet, Ereignis #5634 (148/735)
Berechne Variable Pellet, Ereignis #5635 (149/735)
Berechne Variable Pellet, Ereignis #5636 (150/735)
Berechne Variable Pellet, Ereignis #5637 (151/735)
Berechne Variable Pellet, Ereignis #5638 (152/735)
Berechne Variable Pellet, Ereignis #5639 (153/735)
Berechne Variable Pellet, Ereignis #5641 (154/735)
Berechne Variable Pellet, Ereignis #5642 (155/735)
Berechne Variable Pellet, Ereignis #5643 (156/735)
Berechne Variable Pellet, Ereignis #5644 (157/735)
Berechne Variable Other Iron and Steel Production, Ereignis #5645 (158/735)
Berechne Variable Other Iron and Steel Production, Ereignis #5646 (159/735)
Berechne Variable Other Iron and Steel Production, Ereignis #5649 (160/735)
Berechne Variable Other Iron and Steel Production, Ereignis #5650 (161/735)
Berechne Variable Other Iron and Steel Production, Ereignis #5652 (162/735)
Berechne Variable Other Iron and Steel Production, Ereignis #5653 (163/735)
Berechne Variable Ferroalloys Production, Ereignis #5654 (164/735)
Berechne Variable Ferroalloys Production, Ereignis #5655 (165/735)
Berechne Variable Ferroalloys Production, Ereignis #5656 (166/735)
Berechne Variable Ferroalloys Production, Ereignis #5657 (167/735)
Berechne Variable Ferroalloys Production, Ereignis #5658 (168/735)
Berechne Variable Ferroalloys Production, Ereignis #5659 (169/735)
Berechne Variable Ferroalloys Production, Ereignis #5660 (170/735)
Berechne Variable Ferroalloys Production, Ereignis #5661 (171/735)
Berechne Variable Ferroalloys Production, Ereignis #5662 (172/735)
Berechne Variable Ferroalloys Production, Ereignis #5665 (173/735)
Berechne Variable Ferroalloys Production, Ereignis #5667 (174/735)
Berechne Variable Ferroalloys Production, Ereignis #5668 (175/735)
Berechne Variable Ferroalloys Production, Ereignis #5669 (176/735)
Berechne Variable Aluminium Production, Ereignis #5672 (177/735)
Berechne Variable Aluminium Production, Ereignis #5685 (178/735)
Berechne Variable Aluminium Production, Ereignis #5689 (179/735)
Berechne Variable Aluminium Production, Ereignis #5696 (180/735)
Berechne Variable Aluminium Production, Ereignis #5699 (181/735)
Berechne Variable Aluminium Production, Ereignis #5700 (182/735)
Berechne Variable Aluminium Production, Ereignis #5701 (183/735)
Berechne Variable Aluminium Production, Ereignis #5704 (184/735)
Berechne Variable CO2 Emissions, Ereignis #17491 (185/735)
Berechne Variable CO2 Emissions, Ereignis #17492 (186/735)
Berechne Variable CO2 Emissions, Ereignis #17493 (187/735)
Berechne Variable CO2 Emissions, Ereignis #17494 (188/735)
Berechne Variable CO2 Emissions, Ereignis #17496 (189/735)
Berechne Variable By-Product Production, Ereignis #5707 (190/735)
Berechne Variable By-Product Production, Ereignis #5708 (191/735)
Berechne Variable By-Product Production, Ereignis #5709 (192/735)
Berechne Variable By-Product Production, Ereignis #5710 (193/735)
Berechne Variable By-Product Production, Ereignis #5711 (194/735)
Berechne Variable By-Product Production, Ereignis #5712 (195/735)
Berechne Variable By-Product Production, Ereignis #5713 (196/735)
Berechne Variable By-Product Production, Ereignis #5715 (197/735)
Berechne Variable By-Product Production, Ereignis #5716 (198/735)
Berechne Variable By-Product Production, Ereignis #5717 (199/735)
Berechne Variable By-Product Production, Ereignis #5718 (200/735)
Berechne Variable By-Product Production, Ereignis #5719 (201/735)
Berechne Variable By-Product Production, Ereignis #5720 (202/735)
Berechne Variable By-Product Production, Ereignis #5721 (203/735)
Berechne Variable By-Product Production, Ereignis #5722 (204/735)
Berechne Variable By-Product Production, Ereignis #5723 (205/735)
Berechne Variable By-Product Production, Ereignis #5724 (206/735)
Berechne Variable By-Product Production, Ereignis #5725 (207/735)
Berechne Variable By-Product Production, Ereignis #5726 (208/735)
Berechne Variable By-Product Production, Ereignis #5727 (209/735)
Berechne Variable By-Product Production, Ereignis #5728 (210/735)
Berechne Variable By-Product Production, Ereignis #5729 (211/735)
Berechne Variable By-Product Production, Ereignis #5730 (212/735)
Berechne Variable By-Product Production, Ereignis #5731 (213/735)
Berechne Variable By-Product Production, Ereignis #5732 (214/735)
Berechne Variable By-Product Production, Ereignis #5733 (215/735)
Berechne Variable By-Product Production, Ereignis #5734 (216/735)
Berechne Variable By-Product Production, Ereignis #5735 (217/735)
Berechne Variable By-Product Production, Ereignis #5738 (218/735)
Berechne Variable By-Product Production, Ereignis #5741 (219/735)
Berechne Variable By-Product Production, Ereignis #17468 (220/735)
Berechne Variable By-Product Production, Ereignis #17479 (221/735)
Berechne Variable By-Product Production, Ereignis #17480 (222/735)
Berechne Variable By-Product Production, Ereignis #17481 (223/735)
Berechne Variable By-Product Production, Ereignis #17482 (224/735)
Berechne Variable By-Product Production, Ereignis #17483 (225/735)
Berechne Variable By-Product Production, Ereignis #17484 (226/735)
Berechne Variable By-Product Production, Ereignis #17485 (227/735)
Berechne Variable By-Product Production, Ereignis #17486 (228/735)
Berechne Variable By-Product Production, Ereignis #17487 (229/735)
Berechne Variable By-Product Production, Ereignis #17488 (230/735)
Berechne Variable F-gases used in foundries, Ereignis #5749 (231/735)
Berechne Variable F-gases used in foundries, Ereignis #5750 (232/735)
Berechne Variable F-gases used in foundries, Ereignis #5751 (233/735)
Berechne Variable F-gases used in foundries, Ereignis #5752 (234/735)
Berechne Variable F-gases used in foundries, Ereignis #5753 (235/735)
Berechne Variable F-gases used in foundries, Ereignis #5755 (236/735)
Berechne Variable F-gases used in foundries, Ereignis #5757 (237/735)
Berechne Variable F-gases used in foundries, Ereignis #5758 (238/735)
Berechne Variable F-gases used in foundries, Ereignis #5759 (239/735)
Berechne Variable F-gases used in foundries, Ereignis #5760 (240/735)
Berechne Variable F-gases used in foundries, Ereignis #5761 (241/735)
Berechne Variable F-gases used in foundries, Ereignis #5762 (242/735)
Berechne Variable F-gases used in foundries, Ereignis #5763 (243/735)
Berechne Variable F-gases used in foundries, Ereignis #5764 (244/735)
Berechne Variable F-gases used in foundries, Ereignis #5765 (245/735)
Berechne Variable F-gases used in foundries, Ereignis #5767 (246/735)
Berechne Variable F-gases used in foundries, Ereignis #5768 (247/735)
Berechne Variable F-gases used in foundries, Ereignis #5769 (248/735)
Berechne Variable F-gases used in foundries, Ereignis #5770 (249/735)
Berechne Variable F-gases used in foundries, Ereignis #5771 (250/735)
Berechne Variable F-gases used in foundries, Ereignis #5772 (251/735)
Berechne Variable F-gases used in foundries, Ereignis #5773 (252/735)
Berechne Variable F-gases used in foundries, Ereignis #5774 (253/735)
Berechne Variable F-gases used in foundries, Ereignis #5775 (254/735)
Berechne Variable F-gases used in foundries, Ereignis #5776 (255/735)
Berechne Variable F-gases used in foundries, Ereignis #5777 (256/735)
Berechne Variable F-gases used in foundries, Ereignis #5779 (257/735)
Berechne Variable F-gases used in foundries, Ereignis #17312 (258/735)
Berechne Variable F-gases used in foundries, Ereignis #17313 (259/735)
Berechne Variable F-gases used in foundries, Ereignis #17314 (260/735)
Berechne Variable F-gases used in foundries, Ereignis #17315 (261/735)
Berechne Variable F-gases used in foundries, Ereignis #17316 (262/735)
Berechne Variable F-gases used in foundries, Ereignis #17317 (263/735)
Berechne Variable F-gases used in foundries, Ereignis #17318 (264/735)
Berechne Variable F-gases used in foundries, Ereignis #17319 (265/735)
Berechne Variable F-gases used in foundries, Ereignis #17320 (266/735)
Berechne Variable F-gases used in foundries, Ereignis #17321 (267/735)
Berechne Variable F-gases used in foundries, Ereignis #17322 (268/735)
Berechne Variable F-gases used in foundries, Ereignis #17334 (269/735)
Berechne Variable F-gases used in foundries, Ereignis #17346 (270/735)
Berechne Variable Magnesium Production, Ereignis #5781 (271/735)
Berechne Variable Magnesium Production, Ereignis #5782 (272/735)
Berechne Variable Magnesium Production, Ereignis #5783 (273/735)
Berechne Variable Magnesium Production, Ereignis #5784 (274/735)
Berechne Variable Magnesium Production, Ereignis #5785 (275/735)
Berechne Variable Magnesium Production, Ereignis #5786 (276/735)
Berechne Variable Magnesium Production, Ereignis #5787 (277/735)
Berechne Variable Magnesium Production, Ereignis #5788 (278/735)
Berechne Variable Magnesium Production, Ereignis #5789 (279/735)
Berechne Variable Magnesium Production, Ereignis #5791 (280/735)
Berechne Variable Magnesium Production, Ereignis #5792 (281/735)
Berechne Variable Magnesium Production, Ereignis #5793 (282/735)
Berechne Variable Magnesium Production, Ereignis #5794 (283/735)
Berechne Variable Magnesium Production, Ereignis #5795 (284/735)
Berechne Variable Magnesium Production, Ereignis #5796 (285/735)
Berechne Variable Magnesium Production, Ereignis #5797 (286/735)
Berechne Variable Magnesium Production, Ereignis #5798 (287/735)
Berechne Variable Magnesium Production, Ereignis #5799 (288/735)
Berechne Variable Magnesium Production, Ereignis #5800 (289/735)
Berechne Variable Magnesium Production, Ereignis #5801 (290/735)
Berechne Variable Magnesium Production, Ereignis #5802 (291/735)
Berechne Variable Magnesium Production, Ereignis #5803 (292/735)
Berechne Variable Magnesium Production, Ereignis #5804 (293/735)
Berechne Variable Magnesium Production, Ereignis #5805 (294/735)
Berechne Variable Magnesium Production, Ereignis #5806 (295/735)
Berechne Variable Magnesium Production, Ereignis #5807 (296/735)
Berechne Variable Magnesium Production, Ereignis #5808 (297/735)
Berechne Variable Magnesium Production, Ereignis #5809 (298/735)
Berechne Variable Magnesium Production, Ereignis #5810 (299/735)
Berechne Variable Magnesium Production, Ereignis #5811 (300/735)
Berechne Variable Magnesium Production, Ereignis #5812 (301/735)
Warnung: Vertraulicher Wert für Jahr 1990
Warnung: Vertraulicher Wert für Jahr 1991
Warnung: Vertraulicher Wert für Jahr 1992
Warnung: Vertraulicher Wert für Jahr 1993
Warnung: Vertraulicher Wert für Jahr 1994
Warnung: Vertraulicher Wert für Jahr 1995
Warnung: Vertraulicher Wert für Jahr 1996
Warnung: Vertraulicher Wert für Jahr 1997
Warnung: Vertraulicher Wert für Jahr 1998
Warnung: Vertraulicher Wert für Jahr 1999
Warnung: Vertraulicher Wert für Jahr 2000
Warnung: Vertraulicher Wert für Jahr 2001
Warnung: Vertraulicher Wert für Jahr 2002
Warnung: Vertraulicher Wert für Jahr 2003
Warnung: Vertraulicher Wert für Jahr 2004
Warnung: Vertraulicher Wert für Jahr 2005
Warnung: Vertraulicher Wert für Jahr 2006
Warnung: Vertraulicher Wert für Jahr 2007
Warnung: Vertraulicher Wert für Jahr 2008
Warnung: Vertraulicher Wert für Jahr 2009
Warnung: Vertraulicher Wert für Jahr 2010
Warnung: Vertraulicher Wert für Jahr 2011
Warnung: Vertraulicher Wert für Jahr 2012
Warnung: Vertraulicher Wert für Jahr 2013
Warnung: Vertraulicher Wert für Jahr 2014
Warnung: Vertraulicher Wert für Jahr 2015
Warnung: Vertraulicher Wert für Jahr 2016
Warnung: Vertraulicher Wert für Jahr 2017
Warnung: Vertraulicher Wert für Jahr 2018
Warnung: Vertraulicher Wert für Jahr 2019
Warnung: Vertraulicher Wert für Jahr 2020
Warnung: Vertraulicher Wert für Jahr 2021
Warnung: Vertraulicher Wert für Jahr 2022
Berechne Variable Magnesium Production, Ereignis #5813 (302/735)
Berechne Variable Magnesium Production, Ereignis #5814 (303/735)
Berechne Variable Magnesium Production, Ereignis #5815 (304/735)
Berechne Variable Magnesium Production, Ereignis #5816 (305/735)
Berechne Variable Magnesium Production, Ereignis #5817 (306/735)
Berechne Variable Magnesium Production, Ereignis #5818 (307/735)
Berechne Variable Magnesium Production, Ereignis #5819 (308/735)
Berechne Variable Magnesium Production, Ereignis #5820 (309/735)
Berechne Variable Magnesium Production, Ereignis #5821 (310/735)
Berechne Variable Magnesium Production, Ereignis #5822 (311/735)
Berechne Variable Magnesium Production, Ereignis #5823 (312/735)
Berechne Variable Magnesium Production, Ereignis #5824 (313/735)
Berechne Variable Magnesium Production, Ereignis #5825 (314/735)
Berechne Variable Magnesium Production, Ereignis #5826 (315/735)
Berechne Variable Magnesium Production, Ereignis #5827 (316/735)
Berechne Variable Magnesium Production, Ereignis #5828 (317/735)
Berechne Variable Magnesium Production, Ereignis #5829 (318/735)
Berechne Variable Magnesium Production, Ereignis #5830 (319/735)
Berechne Variable Magnesium Production, Ereignis #5831 (320/735)
Berechne Variable Magnesium Production, Ereignis #5832 (321/735)
Berechne Variable Magnesium Production, Ereignis #5833 (322/735)
Berechne Variable Magnesium Production, Ereignis #5834 (323/735)
Berechne Variable Magnesium Production, Ereignis #5835 (324/735)
Berechne Variable Magnesium Production, Ereignis #5836 (325/735)
Berechne Variable Magnesium Production, Ereignis #5837 (326/735)
Berechne Variable Magnesium Production, Ereignis #5838 (327/735)
Berechne Variable Magnesium Production, Ereignis #5839 (328/735)
Berechne Variable Magnesium Production, Ereignis #5840 (329/735)
Berechne Variable Magnesium Production, Ereignis #5841 (330/735)
Berechne Variable Magnesium Production, Ereignis #5842 (331/735)
Berechne Variable Magnesium Production, Ereignis #5843 (332/735)
Berechne Variable Magnesium Production, Ereignis #5844 (333/735)
Berechne Variable Magnesium Production, Ereignis #5845 (334/735)
Berechne Variable Magnesium Production, Ereignis #5846 (335/735)
Berechne Variable Magnesium Production, Ereignis #5847 (336/735)
Berechne Variable Magnesium Production, Ereignis #5848 (337/735)
Berechne Variable Magnesium Production, Ereignis #5849 (338/735)
Berechne Variable Magnesium Production, Ereignis #5850 (339/735)
Berechne Variable Magnesium Production, Ereignis #5851 (340/735)
Berechne Variable Magnesium Production, Ereignis #5852 (341/735)
Berechne Variable Magnesium Production, Ereignis #5853 (342/735)
Berechne Variable Magnesium Production, Ereignis #5854 (343/735)
Berechne Variable Magnesium Production, Ereignis #5855 (344/735)
Berechne Variable Magnesium Production, Ereignis #5856 (345/735)
Berechne Variable Magnesium Production, Ereignis #5857 (346/735)
Berechne Variable Magnesium Production, Ereignis #5858 (347/735)
Berechne Variable Magnesium Production, Ereignis #5859 (348/735)
Berechne Variable Magnesium Production, Ereignis #5860 (349/735)
Berechne Variable Magnesium Production, Ereignis #5861 (350/735)
Berechne Variable Magnesium Production, Ereignis #5862 (351/735)
Berechne Variable Magnesium Production, Ereignis #5863 (352/735)
Berechne Variable Magnesium Production, Ereignis #5864 (353/735)
Berechne Variable Magnesium Production, Ereignis #5865 (354/735)
Berechne Variable Magnesium Production, Ereignis #5866 (355/735)
Berechne Variable Magnesium Production, Ereignis #5867 (356/735)
Berechne Variable Magnesium Production, Ereignis #5871 (357/735)
Warnung: Vertraulicher Wert für Jahr 1990
Warnung: Vertraulicher Wert für Jahr 1991
Warnung: Vertraulicher Wert für Jahr 1992
Warnung: Vertraulicher Wert für Jahr 1993
Warnung: Vertraulicher Wert für Jahr 1994
Warnung: Vertraulicher Wert für Jahr 1995
Warnung: Vertraulicher Wert für Jahr 1996
Warnung: Vertraulicher Wert für Jahr 1997
Warnung: Vertraulicher Wert für Jahr 1998
Warnung: Vertraulicher Wert für Jahr 1999
Warnung: Vertraulicher Wert für Jahr 2000
Warnung: Vertraulicher Wert für Jahr 2001
Warnung: Vertraulicher Wert für Jahr 2002
Warnung: Vertraulicher Wert für Jahr 2003
Warnung: Vertraulicher Wert für Jahr 2004
Warnung: Vertraulicher Wert für Jahr 2005
Warnung: Vertraulicher Wert für Jahr 2006
Warnung: Vertraulicher Wert für Jahr 2007
Warnung: Vertraulicher Wert für Jahr 2008
Warnung: Vertraulicher Wert für Jahr 2009
Warnung: Vertraulicher Wert für Jahr 2010
Warnung: Vertraulicher Wert für Jahr 2011
Warnung: Vertraulicher Wert für Jahr 2012
Warnung: Vertraulicher Wert für Jahr 2013
Warnung: Vertraulicher Wert für Jahr 2014
Warnung: Vertraulicher Wert für Jahr 2015
Warnung: Vertraulicher Wert für Jahr 2016
Warnung: Vertraulicher Wert für Jahr 2017
Warnung: Vertraulicher Wert für Jahr 2018
Warnung: Vertraulicher Wert für Jahr 2019
Warnung: Vertraulicher Wert für Jahr 2020
Warnung: Vertraulicher Wert für Jahr 2021
Warnung: Vertraulicher Wert für Jahr 2022
Berechne Variable Magnesium Production, Ereignis #5873 (358/735)
Berechne Variable Magnesium Production, Ereignis #17532 (359/735)
Berechne Variable Magnesium Production, Ereignis #17533 (360/735)
Berechne Variable Magnesium Production, Ereignis #17534 (361/735)
Berechne Variable Magnesium Production, Ereignis #17535 (362/735)
Berechne Variable Magnesium Production, Ereignis #17536 (363/735)
Berechne Variable Magnesium Production, Ereignis #17537 (364/735)
Berechne Variable Magnesium Production, Ereignis #17538 (365/735)
Berechne Variable Magnesium Production, Ereignis #17539 (366/735)
Berechne Variable Magnesium Production, Ereignis #17540 (367/735)
Berechne Variable Magnesium Production, Ereignis #17541 (368/735)
Berechne Variable Magnesium Production, Ereignis #17542 (369/735)
Berechne Variable Magnesium Production, Ereignis #17543 (370/735)
Berechne Variable Magnesium Production, Ereignis #17544 (371/735)
Berechne Variable Magnesium Production, Ereignis #17545 (372/735)
Berechne Variable Magnesium Production, Ereignis #17546 (373/735)
Berechne Variable Magnesium Production, Ereignis #17547 (374/735)
Berechne Variable Magnesium Production, Ereignis #17548 (375/735)
Berechne Variable Magnesium Production, Ereignis #17549 (376/735)
Berechne Variable Magnesium Production, Ereignis #17550 (377/735)
Berechne Variable Magnesium Production, Ereignis #17551 (378/735)
Berechne Variable Magnesium Production, Ereignis #17552 (379/735)
Berechne Variable Magnesium Production, Ereignis #17553 (380/735)
Berechne Variable Magnesium Production, Ereignis #17554 (381/735)
Berechne Variable Magnesium Production, Ereignis #17555 (382/735)
Berechne Variable Magnesium Production, Ereignis #17556 (383/735)
Berechne Variable Magnesium Production, Ereignis #17557 (384/735)
Berechne Variable Magnesium Production, Ereignis #17558 (385/735)
Berechne Variable Magnesium Production, Ereignis #17559 (386/735)
Berechne Variable Magnesium Production, Ereignis #17560 (387/735)
Berechne Variable Magnesium Production, Ereignis #17561 (388/735)
Berechne Variable Lead Production, Ereignis #5874 (389/735)
Berechne Variable Lead Production, Ereignis #5875 (390/735)
Berechne Variable Lead Production, Ereignis #5876 (391/735)
Warnung: Vertraulicher Wert für Jahr 1990
Warnung: Vertraulicher Wert für Jahr 1991
Warnung: Vertraulicher Wert für Jahr 1992
Warnung: Vertraulicher Wert für Jahr 1993
Warnung: Vertraulicher Wert für Jahr 1994
Warnung: Vertraulicher Wert für Jahr 1995
Warnung: Vertraulicher Wert für Jahr 1996
Warnung: Vertraulicher Wert für Jahr 1997
Warnung: Vertraulicher Wert für Jahr 1998
Warnung: Vertraulicher Wert für Jahr 1999
Warnung: Vertraulicher Wert für Jahr 2000
Warnung: Vertraulicher Wert für Jahr 2001
Warnung: Vertraulicher Wert für Jahr 2002
Warnung: Vertraulicher Wert für Jahr 2003
Warnung: Vertraulicher Wert für Jahr 2004
Warnung: Vertraulicher Wert für Jahr 2005
Warnung: Vertraulicher Wert für Jahr 2006
Warnung: Vertraulicher Wert für Jahr 2007
Warnung: Vertraulicher Wert für Jahr 2008
Warnung: Vertraulicher Wert für Jahr 2009
Warnung: Vertraulicher Wert für Jahr 2010
Warnung: Vertraulicher Wert für Jahr 2011
Warnung: Vertraulicher Wert für Jahr 2012
Warnung: Vertraulicher Wert für Jahr 2013
Warnung: Vertraulicher Wert für Jahr 2014
Warnung: Vertraulicher Wert für Jahr 2015
Warnung: Vertraulicher Wert für Jahr 2016
Warnung: Vertraulicher Wert für Jahr 2017
Warnung: Vertraulicher Wert für Jahr 2018
Warnung: Vertraulicher Wert für Jahr 2019
Warnung: Vertraulicher Wert für Jahr 2020
Warnung: Vertraulicher Wert für Jahr 2021
Warnung: Vertraulicher Wert für Jahr 2022
Berechne Variable Lead Production, Ereignis #5877 (392/735)
Berechne Variable Lead Production, Ereignis #5878 (393/735)
Berechne Variable Lead Production, Ereignis #5879 (394/735)
Berechne Variable Lead Production, Ereignis #5880 (395/735)
Berechne Variable Lead Production, Ereignis #5881 (396/735)
Berechne Variable Lead Production, Ereignis #5882 (397/735)
Berechne Variable Lead Production, Ereignis #5883 (398/735)
Berechne Variable Lead Production, Ereignis #5884 (399/735)
Warnung: Vertraulicher Wert für Jahr 1990
Warnung: Vertraulicher Wert für Jahr 1991
Warnung: Vertraulicher Wert für Jahr 1992
Warnung: Vertraulicher Wert für Jahr 1993
Warnung: Vertraulicher Wert für Jahr 1994
Warnung: Vertraulicher Wert für Jahr 1995
Warnung: Vertraulicher Wert für Jahr 1996
Warnung: Vertraulicher Wert für Jahr 1997
Warnung: Vertraulicher Wert für Jahr 1998
Warnung: Vertraulicher Wert für Jahr 1999
Warnung: Vertraulicher Wert für Jahr 2000
Warnung: Vertraulicher Wert für Jahr 2001
Warnung: Vertraulicher Wert für Jahr 2002
Warnung: Vertraulicher Wert für Jahr 2003
Warnung: Vertraulicher Wert für Jahr 2004
Warnung: Vertraulicher Wert für Jahr 2005
Warnung: Vertraulicher Wert für Jahr 2006
Warnung: Vertraulicher Wert für Jahr 2007
Warnung: Vertraulicher Wert für Jahr 2008
Warnung: Vertraulicher Wert für Jahr 2009
Warnung: Vertraulicher Wert für Jahr 2010
Warnung: Vertraulicher Wert für Jahr 2011
Warnung: Vertraulicher Wert für Jahr 2012
Warnung: Vertraulicher Wert für Jahr 2013
Warnung: Vertraulicher Wert für Jahr 2014
Warnung: Vertraulicher Wert für Jahr 2015
Warnung: Vertraulicher Wert für Jahr 2016
Warnung: Vertraulicher Wert für Jahr 2017
Warnung: Vertraulicher Wert für Jahr 2018
Warnung: Vertraulicher Wert für Jahr 2019
Warnung: Vertraulicher Wert für Jahr 2020
Warnung: Vertraulicher Wert für Jahr 2021
Warnung: Vertraulicher Wert für Jahr 2022
Berechne Variable Zinc Production, Ereignis #5886 (400/735)
Berechne Variable Zinc Production, Ereignis #5887 (401/735)
Berechne Variable Zinc Production, Ereignis #5888 (402/735)
Berechne Variable Zinc Production, Ereignis #5889 (403/735)
Berechne Variable Zinc Production, Ereignis #5890 (404/735)
Berechne Variable Zinc Production, Ereignis #5891 (405/735)
Warnung: Vertraulicher Wert für Jahr 1990
Warnung: Vertraulicher Wert für Jahr 1991
Warnung: Vertraulicher Wert für Jahr 1992
Warnung: Vertraulicher Wert für Jahr 1993
Warnung: Vertraulicher Wert für Jahr 1994
Warnung: Vertraulicher Wert für Jahr 1995
Warnung: Vertraulicher Wert für Jahr 1996
Warnung: Vertraulicher Wert für Jahr 1997
Warnung: Vertraulicher Wert für Jahr 1998
Warnung: Vertraulicher Wert für Jahr 1999
Warnung: Vertraulicher Wert für Jahr 2000
Warnung: Vertraulicher Wert für Jahr 2001
Warnung: Vertraulicher Wert für Jahr 2002
Warnung: Vertraulicher Wert für Jahr 2003
Warnung: Vertraulicher Wert für Jahr 2004
Warnung: Vertraulicher Wert für Jahr 2005
Warnung: Vertraulicher Wert für Jahr 2006
Warnung: Vertraulicher Wert für Jahr 2007
Warnung: Vertraulicher Wert für Jahr 2008
Warnung: Vertraulicher Wert für Jahr 2009
Warnung: Vertraulicher Wert für Jahr 2010
Warnung: Vertraulicher Wert für Jahr 2011
Warnung: Vertraulicher Wert für Jahr 2012
Warnung: Vertraulicher Wert für Jahr 2013
Warnung: Vertraulicher Wert für Jahr 2014
Warnung: Vertraulicher Wert für Jahr 2015
Warnung: Vertraulicher Wert für Jahr 2016
Warnung: Vertraulicher Wert für Jahr 2017
Warnung: Vertraulicher Wert für Jahr 2018
Warnung: Vertraulicher Wert für Jahr 2019
Warnung: Vertraulicher Wert für Jahr 2020
Warnung: Vertraulicher Wert für Jahr 2021
Warnung: Vertraulicher Wert für Jahr 2022
Berechne Variable Zinc Production, Ereignis #5892 (406/735)
Berechne Variable Zinc Production, Ereignis #5893 (407/735)
Berechne Variable Zinc Production, Ereignis #5894 (408/735)
Berechne Variable Zinc Production, Ereignis #5895 (409/735)
Warnung: Vertraulicher Wert für Jahr 1990
Warnung: Vertraulicher Wert für Jahr 1991
Warnung: Vertraulicher Wert für Jahr 1992
Warnung: Vertraulicher Wert für Jahr 1993
Warnung: Vertraulicher Wert für Jahr 1994
Warnung: Vertraulicher Wert für Jahr 1995
Warnung: Vertraulicher Wert für Jahr 1996
Warnung: Vertraulicher Wert für Jahr 1997
Warnung: Vertraulicher Wert für Jahr 1998
Warnung: Vertraulicher Wert für Jahr 1999
Warnung: Vertraulicher Wert für Jahr 2000
Warnung: Vertraulicher Wert für Jahr 2001
Warnung: Vertraulicher Wert für Jahr 2002
Warnung: Vertraulicher Wert für Jahr 2003
Warnung: Vertraulicher Wert für Jahr 2004
Warnung: Vertraulicher Wert für Jahr 2005
Warnung: Vertraulicher Wert für Jahr 2006
Warnung: Vertraulicher Wert für Jahr 2007
Warnung: Vertraulicher Wert für Jahr 2008
Warnung: Vertraulicher Wert für Jahr 2009
Warnung: Vertraulicher Wert für Jahr 2010
Warnung: Vertraulicher Wert für Jahr 2011
Warnung: Vertraulicher Wert für Jahr 2012
Warnung: Vertraulicher Wert für Jahr 2013
Warnung: Vertraulicher Wert für Jahr 2014
Warnung: Vertraulicher Wert für Jahr 2015
Warnung: Vertraulicher Wert für Jahr 2016
Warnung: Vertraulicher Wert für Jahr 2017
Warnung: Vertraulicher Wert für Jahr 2018
Warnung: Vertraulicher Wert für Jahr 2019
Warnung: Vertraulicher Wert für Jahr 2020
Warnung: Vertraulicher Wert für Jahr 2021
Warnung: Vertraulicher Wert für Jahr 2022
Berechne Variable Other Metal Industry, Ereignis #5896 (410/735)
Berechne Variable Other Metal Industry, Ereignis #5897 (411/735)
Berechne Variable Other Metal Industry, Ereignis #5898 (412/735)
Berechne Variable Other Metal Industry, Ereignis #5899 (413/735)
Berechne Variable Other Metal Industry, Ereignis #5900 (414/735)
Berechne Variable Other Metal Industry, Ereignis #5901 (415/735)
Berechne Variable Other Metal Industry, Ereignis #5902 (416/735)
Berechne Variable Other Metal Industry, Ereignis #5903 (417/735)
Berechne Variable Other Metal Industry, Ereignis #5904 (418/735)
Berechne Variable Other Metal Industry, Ereignis #5905 (419/735)
Berechne Variable Other Metal Industry, Ereignis #5906 (420/735)
Berechne Variable Other Metal Industry, Ereignis #5907 (421/735)
Berechne Variable Other Metal Industry, Ereignis #5908 (422/735)
Berechne Variable Other Metal Industry, Ereignis #5909 (423/735)
Berechne Variable Other Metal Industry, Ereignis #5910 (424/735)
Berechne Variable Other Metal Industry, Ereignis #5911 (425/735)
Berechne Variable Other Metal Industry, Ereignis #5912 (426/735)
Berechne Variable Other Metal Industry, Ereignis #5913 (427/735)
Berechne Variable Other Metal Industry, Ereignis #5914 (428/735)
Berechne Variable Other Metal Industry, Ereignis #5915 (429/735)
Berechne Variable Other Metal Industry, Ereignis #5916 (430/735)
Berechne Variable Other Metal Industry, Ereignis #5917 (431/735)
Berechne Variable Other Metal Industry, Ereignis #5918 (432/735)
Berechne Variable Other Metal Industry, Ereignis #5919 (433/735)
Berechne Variable Other Metal Industry, Ereignis #5920 (434/735)
Berechne Variable Other Metal Industry, Ereignis #5921 (435/735)
Berechne Variable Other Metal Industry, Ereignis #5922 (436/735)
Berechne Variable Other Metal Industry, Ereignis #5923 (437/735)
Berechne Variable Other Metal Industry, Ereignis #5924 (438/735)
Berechne Variable Other Metal Industry, Ereignis #5925 (439/735)
Berechne Variable Other Metal Industry, Ereignis #5926 (440/735)
Berechne Variable Other Metal Industry, Ereignis #5927 (441/735)
Berechne Variable Other Metal Industry, Ereignis #5928 (442/735)
Berechne Variable Other Metal Industry, Ereignis #5929 (443/735)
Berechne Variable Other Metal Industry, Ereignis #5930 (444/735)
Berechne Variable Other Metal Industry, Ereignis #5931 (445/735)
Berechne Variable Other Metal Industry, Ereignis #5932 (446/735)
Berechne Variable Other Metal Industry, Ereignis #5933 (447/735)
Berechne Variable Other Metal Industry, Ereignis #5934 (448/735)
Berechne Variable Other Metal Industry, Ereignis #5935 (449/735)
Berechne Variable Other Metal Industry, Ereignis #5936 (450/735)
Berechne Variable Other Metal Industry, Ereignis #5937 (451/735)
Berechne Variable Other Metal Industry, Ereignis #5938 (452/735)
Berechne Variable Other Metal Industry, Ereignis #5939 (453/735)
Berechne Variable Other Metal Industry, Ereignis #5940 (454/735)
Berechne Variable Other Metal Industry, Ereignis #5941 (455/735)
Berechne Variable Other Metal Industry, Ereignis #5942 (456/735)
Berechne Variable Other Metal Industry, Ereignis #5943 (457/735)
Berechne Variable Other Metal Industry, Ereignis #5944 (458/735)
Berechne Variable Other Metal Industry, Ereignis #5945 (459/735)
Berechne Variable Other Metal Industry, Ereignis #5946 (460/735)
Berechne Variable Other Metal Industry, Ereignis #5947 (461/735)
Berechne Variable Other Metal Industry, Ereignis #5948 (462/735)
Berechne Variable Other Metal Industry, Ereignis #5949 (463/735)
Berechne Variable Other Metal Industry, Ereignis #5950 (464/735)
Berechne Variable Other Metal Industry, Ereignis #5951 (465/735)
Berechne Variable Other Metal Industry, Ereignis #5952 (466/735)
Berechne Variable Other Metal Industry, Ereignis #5953 (467/735)
Berechne Variable Other Metal Industry, Ereignis #5954 (468/735)
Berechne Variable Other Metal Industry, Ereignis #5955 (469/735)
Berechne Variable Other Metal Industry, Ereignis #5956 (470/735)
Berechne Variable Other Metal Industry, Ereignis #5957 (471/735)
Berechne Variable Other Metal Industry, Ereignis #5958 (472/735)
Berechne Variable Other Metal Industry, Ereignis #5959 (473/735)
Berechne Variable Other Metal Industry, Ereignis #5960 (474/735)
Berechne Variable Other Metal Industry, Ereignis #5961 (475/735)
Berechne Variable Other Metal Industry, Ereignis #5962 (476/735)
Berechne Variable Other Metal Industry, Ereignis #5963 (477/735)
Berechne Variable Other Metal Industry, Ereignis #5964 (478/735)
Berechne Variable Other Metal Industry, Ereignis #5965 (479/735)
Berechne Variable Other Metal Industry, Ereignis #5966 (480/735)
Berechne Variable Other Metal Industry, Ereignis #5967 (481/735)
Berechne Variable Other Metal Industry, Ereignis #5968 (482/735)
Berechne Variable Other Metal Industry, Ereignis #5969 (483/735)
Berechne Variable Other Metal Industry, Ereignis #5970 (484/735)
Berechne Variable Other Metal Industry, Ereignis #5971 (485/735)
Berechne Variable Other Metal Industry, Ereignis #5972 (486/735)
Berechne Variable Other Metal Industry, Ereignis #5973 (487/735)
Berechne Variable Other Metal Industry, Ereignis #5974 (488/735)
Berechne Variable Other Metal Industry, Ereignis #5975 (489/735)
Berechne Variable Other Metal Industry, Ereignis #5976 (490/735)
Berechne Variable Other Metal Industry, Ereignis #5977 (491/735)
Berechne Variable Other Metal Industry, Ereignis #5978 (492/735)
Berechne Variable Other Metal Industry, Ereignis #5979 (493/735)
Berechne Variable Other Metal Industry, Ereignis #5980 (494/735)
Berechne Variable Other Metal Industry, Ereignis #5981 (495/735)
Berechne Variable Other Metal Industry, Ereignis #5982 (496/735)
Berechne Variable Other Metal Industry, Ereignis #5983 (497/735)
Berechne Variable Other Metal Industry, Ereignis #5984 (498/735)
Berechne Variable Other Metal Industry, Ereignis #5985 (499/735)
Berechne Variable Other Metal Industry, Ereignis #5986 (500/735)
Berechne Variable Other Metal Industry, Ereignis #5987 (501/735)
Berechne Variable Other Metal Industry, Ereignis #5988 (502/735)
Berechne Variable Other Metal Industry, Ereignis #5990 (503/735)
Berechne Variable Other Metal Industry, Ereignis #5991 (504/735)
Berechne Variable Other Metal Industry, Ereignis #5992 (505/735)
Berechne Variable Copper Production, Ereignis #5993 (506/735)
Berechne Variable Copper Production, Ereignis #5994 (507/735)
Berechne Variable Copper Production, Ereignis #5995 (508/735)
Berechne Variable Copper Production, Ereignis #5997 (509/735)
Berechne Variable Copper Production, Ereignis #5998 (510/735)
Warnung: Vertraulicher Wert für Jahr 1990
Warnung: Vertraulicher Wert für Jahr 1991
Warnung: Vertraulicher Wert für Jahr 1992
Warnung: Vertraulicher Wert für Jahr 1993
Warnung: Vertraulicher Wert für Jahr 1994
Warnung: Vertraulicher Wert für Jahr 1995
Warnung: Vertraulicher Wert für Jahr 1996
Warnung: Vertraulicher Wert für Jahr 1997
Warnung: Vertraulicher Wert für Jahr 1998
Warnung: Vertraulicher Wert für Jahr 1999
Warnung: Vertraulicher Wert für Jahr 2000
Warnung: Vertraulicher Wert für Jahr 2001
Warnung: Vertraulicher Wert für Jahr 2002
Warnung: Vertraulicher Wert für Jahr 2003
Warnung: Vertraulicher Wert für Jahr 2004
Warnung: Vertraulicher Wert für Jahr 2005
Warnung: Vertraulicher Wert für Jahr 2006
Warnung: Vertraulicher Wert für Jahr 2007
Warnung: Vertraulicher Wert für Jahr 2008
Warnung: Vertraulicher Wert für Jahr 2009
Warnung: Vertraulicher Wert für Jahr 2010
Warnung: Vertraulicher Wert für Jahr 2011
Warnung: Vertraulicher Wert für Jahr 2012
Warnung: Vertraulicher Wert für Jahr 2013
Warnung: Vertraulicher Wert für Jahr 2014
Warnung: Vertraulicher Wert für Jahr 2015
Warnung: Vertraulicher Wert für Jahr 2016
Warnung: Vertraulicher Wert für Jahr 2017
Warnung: Vertraulicher Wert für Jahr 2018
Warnung: Vertraulicher Wert für Jahr 2019
Warnung: Vertraulicher Wert für Jahr 2020
Warnung: Vertraulicher Wert für Jahr 2021
Warnung: Vertraulicher Wert für Jahr 2022
Berechne Variable Copper Production, Ereignis #5999 (511/735)
Berechne Variable Copper Production, Ereignis #6000 (512/735)
Berechne Variable Copper Production, Ereignis #6001 (513/735)
Berechne Variable Copper Production, Ereignis #6002 (514/735)
Berechne Variable Copper Production, Ereignis #6003 (515/735)
Berechne Variable Copper Production, Ereignis #6004 (516/735)
Berechne Variable Copper Production, Ereignis #6005 (517/735)
Berechne Variable Copper Production, Ereignis #6006 (518/735)
Berechne Variable Copper Production, Ereignis #6007 (519/735)
Berechne Variable Copper Production, Ereignis #6008 (520/735)
Berechne Variable Copper Production, Ereignis #6009 (521/735)
Berechne Variable Copper Production, Ereignis #6010 (522/735)
Berechne Variable Copper Production, Ereignis #6011 (523/735)
Berechne Variable Copper Production, Ereignis #6012 (524/735)
Berechne Variable Copper Production, Ereignis #6013 (525/735)
Berechne Variable Copper Production, Ereignis #17801 (526/735)
Berechne Variable Copper Production, Ereignis #17802 (527/735)
Berechne Variable Copper Production, Ereignis #17803 (528/735)
Berechne Variable Copper Production, Ereignis #17804 (529/735)
Berechne Variable Copper Production, Ereignis #17805 (530/735)
Berechne Variable Copper Production, Ereignis #17806 (531/735)
Berechne Variable Copper Production, Ereignis #17807 (532/735)
Berechne Variable Copper Production, Ereignis #17808 (533/735)
Berechne Variable Copper Production, Ereignis #17809 (534/735)
Berechne Variable Copper Production, Ereignis #17810 (535/735)
Berechne Variable Copper Production, Ereignis #17811 (536/735)
Berechne Variable Copper Production, Ereignis #17812 (537/735)
Berechne Variable Copper Production, Ereignis #17813 (538/735)
Berechne Variable Copper Production, Ereignis #17814 (539/735)
Berechne Variable Copper Production, Ereignis #17815 (540/735)
Berechne Variable Copper Production, Ereignis #17816 (541/735)
Berechne Variable Copper Production, Ereignis #17817 (542/735)
Berechne Variable Copper Production, Ereignis #17818 (543/735)
Berechne Variable Copper Production, Ereignis #17819 (544/735)
Berechne Variable Copper Production, Ereignis #17820 (545/735)
Berechne Variable Copper Production, Ereignis #17821 (546/735)
Berechne Variable Copper Production, Ereignis #17822 (547/735)
Berechne Variable Copper Production, Ereignis #17823 (548/735)
Berechne Variable Copper Production, Ereignis #17824 (549/735)
Berechne Variable Copper Production, Ereignis #17825 (550/735)
Berechne Variable Copper Production, Ereignis #17826 (551/735)
Berechne Variable Copper Production, Ereignis #17827 (552/735)
Berechne Variable Copper Production, Ereignis #17828 (553/735)
Berechne Variable Copper Production, Ereignis #17829 (554/735)
Berechne Variable Copper Production, Ereignis #17830 (555/735)
Berechne Variable Copper Production, Ereignis #17831 (556/735)
Berechne Variable Copper Production, Ereignis #17832 (557/735)
Berechne Variable Copper Production, Ereignis #17833 (558/735)
Berechne Variable Copper Production, Ereignis #17834 (559/735)
Berechne Variable Copper Production, Ereignis #17835 (560/735)
Berechne Variable Copper Production, Ereignis #17836 (561/735)
Berechne Variable Copper Production, Ereignis #17837 (562/735)
Berechne Variable Copper Production, Ereignis #17838 (563/735)
Berechne Variable Copper Production, Ereignis #17839 (564/735)
Berechne Variable Copper Production, Ereignis #17840 (565/735)
Berechne Variable Copper Production, Ereignis #17841 (566/735)
Berechne Variable Copper Production, Ereignis #17842 (567/735)
Berechne Variable Copper Production, Ereignis #17843 (568/735)
Berechne Variable Copper Production, Ereignis #17844 (569/735)
Berechne Variable Copper Production, Ereignis #17845 (570/735)
Berechne Variable Copper Production, Ereignis #17846 (571/735)
Berechne Variable Copper Production, Ereignis #17847 (572/735)
Berechne Variable Copper Production, Ereignis #17848 (573/735)
Berechne Variable Copper Production, Ereignis #17849 (574/735)
Berechne Variable Copper Production, Ereignis #17850 (575/735)
Berechne Variable Copper Production, Ereignis #17851 (576/735)
Berechne Variable Copper Production, Ereignis #17852 (577/735)
Berechne Variable Copper Production, Ereignis #17853 (578/735)
Berechne Variable Copper Production, Ereignis #17854 (579/735)
Berechne Variable Copper Production, Ereignis #17855 (580/735)
Berechne Variable Copper Production, Ereignis #17856 (581/735)
Berechne Variable Copper Production, Ereignis #17857 (582/735)
Berechne Variable Copper Production, Ereignis #17858 (583/735)
Berechne Variable Copper Production, Ereignis #17859 (584/735)
Berechne Variable Copper Production, Ereignis #17860 (585/735)
Berechne Variable Copper Production, Ereignis #17861 (586/735)
Berechne Variable Copper Production, Ereignis #17862 (587/735)
Berechne Variable Copper Production, Ereignis #17863 (588/735)
Berechne Variable Copper Production, Ereignis #17864 (589/735)
Berechne Variable Copper Production, Ereignis #17865 (590/735)
Berechne Variable Copper Production, Ereignis #17866 (591/735)
Berechne Variable Copper Production, Ereignis #17867 (592/735)
Berechne Variable Copper Production, Ereignis #17868 (593/735)
Berechne Variable Copper Production, Ereignis #17869 (594/735)
Berechne Variable Copper Production, Ereignis #17870 (595/735)
Berechne Variable Copper Production, Ereignis #17871 (596/735)
Berechne Variable Copper Production, Ereignis #17872 (597/735)
Berechne Variable Copper Production, Ereignis #17873 (598/735)
Berechne Variable Copper Production, Ereignis #17874 (599/735)
Berechne Variable Copper Production, Ereignis #17875 (600/735)
Berechne Variable Copper Production, Ereignis #17876 (601/735)
Berechne Variable Copper Production, Ereignis #17877 (602/735)
Berechne Variable Copper Production, Ereignis #17878 (603/735)
Berechne Variable Copper Production, Ereignis #17879 (604/735)
Berechne Variable Copper Production, Ereignis #17880 (605/735)
Berechne Variable Nickel Production, Ereignis #6014 (606/735)
Berechne Variable Nickel Production, Ereignis #6015 (607/735)
Berechne Variable Nickel Production, Ereignis #6016 (608/735)
Berechne Variable Nickel Production, Ereignis #6018 (609/735)
Berechne Variable Nickel Production, Ereignis #6019 (610/735)
Berechne Variable Nickel Production, Ereignis #6020 (611/735)
Berechne Variable Nickel Production, Ereignis #6021 (612/735)
Berechne Variable Nickel Production, Ereignis #6022 (613/735)
Berechne Variable Nickel Production, Ereignis #6023 (614/735)
Berechne Variable Nickel Production, Ereignis #6026 (615/735)
Berechne Variable Nickel Production, Ereignis #6027 (616/735)
Berechne Variable Nickel Production, Ereignis #6028 (617/735)
Berechne Variable Nickel Production, Ereignis #6030 (618/735)
Berechne Variable Nickel Production, Ereignis #6031 (619/735)
Berechne Variable Nickel Production, Ereignis #6032 (620/735)
Berechne Variable Nickel Production, Ereignis #6033 (621/735)
Berechne Variable Nickel Production, Ereignis #6034 (622/735)
Berechne Variable Nickel Production, Ereignis #17655 (623/735)
Berechne Variable Nickel Production, Ereignis #17656 (624/735)
Berechne Variable Nickel Production, Ereignis #17657 (625/735)
Berechne Variable Nickel Production, Ereignis #17658 (626/735)
Berechne Variable Nickel Production, Ereignis #17659 (627/735)
Berechne Variable Nickel Production, Ereignis #17660 (628/735)
Berechne Variable Nickel Production, Ereignis #17661 (629/735)
Berechne Variable Nickel Production, Ereignis #17662 (630/735)
Berechne Variable Nickel Production, Ereignis #17663 (631/735)
Berechne Variable Nickel Production, Ereignis #17664 (632/735)
Berechne Variable Nickel Production, Ereignis #17665 (633/735)
Berechne Variable Nickel Production, Ereignis #17666 (634/735)
Berechne Variable Nickel Production, Ereignis #17667 (635/735)
Berechne Variable Nickel Production, Ereignis #17668 (636/735)
Berechne Variable Nickel Production, Ereignis #17669 (637/735)
Berechne Variable Nickel Production, Ereignis #17670 (638/735)
Berechne Variable Nickel Production, Ereignis #17671 (639/735)
Berechne Variable Nickel Production, Ereignis #17672 (640/735)
Berechne Variable Nickel Production, Ereignis #17673 (641/735)
Berechne Variable Nickel Production, Ereignis #17674 (642/735)
Berechne Variable Nickel Production, Ereignis #17675 (643/735)
Berechne Variable Nickel Production, Ereignis #17676 (644/735)
Berechne Variable Nickel Production, Ereignis #17677 (645/735)
Berechne Variable Nickel Production, Ereignis #17678 (646/735)
Berechne Variable Nickel Production, Ereignis #17679 (647/735)
Berechne Variable Nickel Production, Ereignis #17680 (648/735)
Berechne Variable Nickel Production, Ereignis #17681 (649/735)
Berechne Variable Nickel Production, Ereignis #17682 (650/735)
Berechne Variable Nickel Production, Ereignis #17683 (651/735)
Berechne Variable Nickel Production, Ereignis #17684 (652/735)
Berechne Variable Nickel Production, Ereignis #17685 (653/735)
Berechne Variable Nickel Production, Ereignis #17686 (654/735)
Berechne Variable Nickel Production, Ereignis #17687 (655/735)
Berechne Variable Nickel Production, Ereignis #17688 (656/735)
Berechne Variable Nickel Production, Ereignis #17689 (657/735)
Berechne Variable Nickel Production, Ereignis #17690 (658/735)
Berechne Variable Nickel Production, Ereignis #17691 (659/735)
Berechne Variable Nickel Production, Ereignis #17692 (660/735)
Berechne Variable Nickel Production, Ereignis #17693 (661/735)
Berechne Variable Nickel Production, Ereignis #17694 (662/735)
Berechne Variable Nickel Production, Ereignis #17728 (663/735)
Berechne Variable Nickel Production, Ereignis #17729 (664/735)
Berechne Variable Nickel Production, Ereignis #17730 (665/735)
Berechne Variable Nickel Production, Ereignis #17731 (666/735)
Berechne Variable Nickel Production, Ereignis #17732 (667/735)
Berechne Variable Nickel Production, Ereignis #17733 (668/735)
Berechne Variable Nickel Production, Ereignis #17734 (669/735)
Berechne Variable Nickel Production, Ereignis #17735 (670/735)
Berechne Variable Nickel Production, Ereignis #17736 (671/735)
Berechne Variable Nickel Production, Ereignis #17737 (672/735)
Berechne Variable Nickel Production, Ereignis #17738 (673/735)
Berechne Variable Nickel Production, Ereignis #17739 (674/735)
Berechne Variable Nickel Production, Ereignis #17740 (675/735)
Berechne Variable Nickel Production, Ereignis #17741 (676/735)
Berechne Variable Nickel Production, Ereignis #17742 (677/735)
Berechne Variable Nickel Production, Ereignis #17743 (678/735)
Berechne Variable Nickel Production, Ereignis #17744 (679/735)
Berechne Variable Nickel Production, Ereignis #17745 (680/735)
Berechne Variable Nickel Production, Ereignis #17746 (681/735)
Berechne Variable Nickel Production, Ereignis #17747 (682/735)
Berechne Variable Nickel Production, Ereignis #17748 (683/735)
Berechne Variable Nickel Production, Ereignis #17749 (684/735)
Berechne Variable Nickel Production, Ereignis #17750 (685/735)
Berechne Variable Nickel Production, Ereignis #17751 (686/735)
Berechne Variable Nickel Production, Ereignis #17752 (687/735)
Berechne Variable Nickel Production, Ereignis #17753 (688/735)
Berechne Variable Nickel Production, Ereignis #17754 (689/735)
Berechne Variable Nickel Production, Ereignis #17755 (690/735)
Berechne Variable Nickel Production, Ereignis #17756 (691/735)
Berechne Variable Nickel Production, Ereignis #17757 (692/735)
Berechne Variable Nickel Production, Ereignis #17758 (693/735)
Berechne Variable Nickel Production, Ereignis #17759 (694/735)
Berechne Variable Nickel Production, Ereignis #17760 (695/735)
Berechne Variable Nickel Production, Ereignis #17761 (696/735)
Berechne Variable Nickel Production, Ereignis #17762 (697/735)
Berechne Variable Nickel Production, Ereignis #17763 (698/735)
Berechne Variable Nickel Production, Ereignis #17764 (699/735)
Berechne Variable Nickel Production, Ereignis #17765 (700/735)
Berechne Variable Nickel Production, Ereignis #17766 (701/735)
Berechne Variable Nickel Production, Ereignis #17767 (702/735)
Berechne Variable Nickel Production, Ereignis #17768 (703/735)
Berechne Variable Nickel Production, Ereignis #17769 (704/735)
Berechne Variable Nickel Production, Ereignis #17770 (705/735)
Berechne Variable Nickel Production, Ereignis #17771 (706/735)
Berechne Variable Nickel Production, Ereignis #17772 (707/735)
Berechne Variable Nickel Production, Ereignis #17773 (708/735)
Berechne Variable Nickel Production, Ereignis #17774 (709/735)
Berechne Variable Nickel Production, Ereignis #17775 (710/735)
Berechne Variable Nickel Production, Ereignis #17776 (711/735)
Berechne Variable Nickel Production, Ereignis #17777 (712/735)
Berechne Variable Nickel Production, Ereignis #17778 (713/735)
Berechne Variable Nickel Production, Ereignis #17779 (714/735)
Berechne Variable Nickel Production, Ereignis #17780 (715/735)
Berechne Variable Nickel Production, Ereignis #17781 (716/735)
Berechne Variable Nickel Production, Ereignis #17782 (717/735)
Berechne Variable Nickel Production, Ereignis #17783 (718/735)
Berechne Variable Nickel Production, Ereignis #17784 (719/735)
Berechne Variable Nickel Production, Ereignis #17785 (720/735)
Berechne Variable Nickel Production, Ereignis #17786 (721/735)
Berechne Variable Nickel Production, Ereignis #17787 (722/735)
Berechne Variable Nickel Production, Ereignis #17788 (723/735)
Berechne Variable Nickel Production, Ereignis #17789 (724/735)
Berechne Variable Nickel Production, Ereignis #17790 (725/735)
Berechne Variable Nickel Production, Ereignis #17791 (726/735)
Berechne Variable Nickel Production, Ereignis #17792 (727/735)
Berechne Variable Nickel Production, Ereignis #17793 (728/735)
Berechne Variable Nickel Production, Ereignis #17794 (729/735)
Berechne Variable Nickel Production, Ereignis #17795 (730/735)
Berechne Variable Nickel Production, Ereignis #17796 (731/735)
Berechne Variable Nickel Production, Ereignis #17797 (732/735)
Berechne Variable Nickel Production, Ereignis #17798 (733/735)
Berechne Variable Nickel Production, Ereignis #17799 (734/735)
Berechne Variable Nickel Production, Ereignis #17800 (735/735)
Datei '\\tsclient\c\Program Files\Housesoft\Zentrales System Emissionen\tables\data\crf_exporter\reporter_import_files\Submission 2024\import files\2 Industry\2C.xml' wurde geschrieben (24255 Werte).
Vorgang beendet (00:01:25.6392981)
