"ObjNr","ID","parent","label_en","label_de"
"53863","GHG","","Greenhouse gases","Treibhausgase"
"53864","CO2","GHG","Carbon dioxide","Kohlendioxid"
"53865","CH4","GHG","Methane","Methan"
"53866","N2O","GHG","Nitrous oxide","Lachgas"
"53867","FGAS_IPCC","GHG","Fluorinated gases (IPCC)","Fluorierte Gase (IPCC)"
"53868","PFC","FGAS_IPCC","Perfluorinated fluorocarbons","Perfluorierte Fluorkohlenwasserstoffe"
"53869","CF4","PFC","CF4","CF4"
"53870","C2F6","PFC","C2F6","C2F6"
"53871","C3F8","PFC","C3F8","C3F8"
"53872","cC4F8","PFC","c-C4F8","c-C4F8"
"53873","C5F12","PFC","C5F12","C5F12"
"53874","C6F14","PFC","C6F14","C6F14"
"53875","C10F18","PFC","C10F18","C10F18"
"53876","HFC","FGAS_IPCC","Hydrogenated fluorocarbons","Wasserstoffhaltige Fluorkohlenwasserstoffe"
"53877","HFC23","HFC","HFC-23","HFC-23"
"53878","HFC32","HFC","HFC-32","HFC-32"
"64332","HFC41","HFC","HFC-41","HFC-41"
"53879","HFC4310mee","HFC","HFC-43-10mee","HFC-43-10mee"
"53880","HFC125","HFC","HFC-125","HFC-125"
"53881","HFC134a","HFC","HFC-134a","HFC-134a"
"53882","HFC143a","HFC","HFC-143a","HFC-143a"
"53883","HFC152a","HFC","HFC-152a","HFC-152a"
"53884","HFC227ea","HFC","HFC-227ea","HFC-227ea"
"53885","HFC236fa","HFC","HFC-236fa","HFC-236fa"
"53886","HFC245fa","HFC","HFC-245fa","HFC-245fa"
"53887","HFC365mfc","HFC","HFC-365mfc","HFC-365mfc"
"53888","SF6","FGAS_IPCC","SF6","Schwefelhexafluorid"
"53889","NF3","FGAS_IPCC","NF3","Stickstofftrifluorid"
"53890","FGAS_OTHER","GHG","Fluorinated gases (other)","Fluorierte Gase (weitere)"
"53891","HCFC1233zd","FGAS_OTHER","HCFC-1233zd","HCFC-1233zd"
"53892","HCFC22","FGAS_OTHER","HCFC-22","HCFC-22"
"53893","HCFE235da2","FGAS_OTHER","HCFE-235da2","HCFE-235da2"
"53894","HFC1234yf","FGAS_OTHER","HFC-1234yf","HFC-1234yf"
"53895","HFC1234ze","FGAS_OTHER","HFC-1234ze","HFC-1234ze"
"64334","HFC1336mzz","FGAS_OTHER","HFC-1336mzz","HFC-1336mzz"
"53896","HFE4310pccc124","FGAS_OTHER","HFE-43-10pccc124","HFE-43-10pccc124"
"53897","HFE236ea2","FGAS_OTHER","HFE-236ea2","HFE-236ea2"
"53898","HFE347mcc3","FGAS_OTHER","HFE-347mcc3","HFE-347mcc3"
"53899","HFE347mmz1","FGAS_OTHER","HFE-347mmz1","HFE-347mmz1"
"53900","HFE449sl","FGAS_OTHER","HFE-449sl","HFE-449sl"
"53901","HFE569sf2","FGAS_OTHER","HFE-569sf2","HFE-569sf2"
"53902","HFE7300","FGAS_OTHER","HFE-7300","HFE-7300"
"53903","HFE7500","FGAS_OTHER","HFE-7500","HFE-7500"
"53904","CFC11","FGAS_OTHER","CFC 11","CFC-11"
"53905","CFC12","FGAS_OTHER","CFC 12","CFC-12"
"53906","R290","FGAS_OTHER","R290","R290 (Propan)"
"53907","R404A","FGAS_OTHER","R404A","R404A"
"53908","R407C","FGAS_OTHER","R407C","R407C"
"53909","R410A","FGAS_OTHER","R410A","R410A"
"53910","R422","FGAS_OTHER","R422","R422"
"53911","R448A","FGAS_OTHER","R448A","R448A"
"53912","R449A","FGAS_OTHER","R449A","R449A"
"53913","R450A","FGAS_OTHER","R450A","R450A"
"53914","R452A","FGAS_OTHER","R452A","R452A"
"64353","R454B","FGAS_OTHER","R454B","R454B"
"53915","R454C","FGAS_OTHER","R454C","R454C"
"53916","R455A","FGAS_OTHER","R455A","R455A"
"53917","R508B","FGAS_OTHER","R508B","R508B"
"53918","R513A","FGAS_OTHER","R513A","R513A"
"64354","R515B","FGAS_OTHER","R515B","R515B"
"53919","R600a","FGAS_OTHER","R600a","R600a (Butan)"
"64452","R744","FGAS_OTHER","R744 (CO2)","R744 (CO2)"
"53920","PFPMIE","FGAS_OTHER","PFPMIE","PFPMIE"
"53921","SF5CF3","FGAS_OTHER","SF5CF3","SF5CF3"
"53922","SO2F2","FGAS_OTHER","SO2F2","Sulfuryldifluorid"
"53923","AP","","Air pollutants","Luftschadstoffe"
"53924","NOx","AP","Nitrogen oxides","Stickoxide"
"53925","SO2","AP","Sulphur dioxide","Schwefeldioxid"
"53926","NH3","AP","Ammonia","Ammoniak"
"53927","NMVOC","AP","NMVOC","NMVOC"
"53928","CO","AP","Carbon monoxide","Kohlenmonoxid"
"53932","TSP","AP","TSP","Staub"
"53931","PM10","AP","PM 10","Feinstaub 10"
"53930","PM2.5","AP","PM 2.5","Feinstaub 2.5"
"53933","BC","AP","Black Carbon","Black Carbon"
"53934","HM","AP","Heavy metals","Schwermetalle"
"53935","Pb","HM","Lead","Blei"
"53936","Hg","HM","Mercury","Quecksilber"
"53937","Cd","HM","Cadmium","Cadmium"
"53938","As","HM","Arsenic","Arsen"
"53939","Cr","HM","Chrome","Chrom"
"53940","Cu","HM","Copper","Kupfer"
"53941","Ni","HM","Nickel","Nickel"
"53942","Se","HM","Selenium","Selen"
"53943","Zn","HM","Zinc","Zink"
"53944","POP","AP","Persistent organic pollutants","Persistente organische Schadstoffe"
"53945","PCB","POP","PCB","PCB gesamt"
"53946","PCDD/F","POP","Dioxin","Dioxine"
"53947","BaP","POP","BaP","Benzo(a)pyren"
"53948","BbF","POP","BbF","Benzo(b)fluoranthen"
"53949","BkF","POP","BkF","Benzo(k)fluoranthen"
"53950","IxP","POP","IxP","Indeno(1,2,3-cd)pyren"
"53951","PAH4","POP","PAH-4","Polyzyklische Aromatische Kohlenwasserstoffe (UNECE, PAH 4)"
"53952","PAH6","POP","PAH-6","Polyzyklische Aromatische Kohlenwasserstoffe (Borneff, PAH 6)"
"53953","PAH9","POP","PAH-9","Polyzyklische Aromatische Kohlenwasserstoffe (VDI 3467 Iron and Steel, PAH 9)"
"53954","PAH10","POP","PAH-10","Polyzyklische Aromatische Kohlenwasserstoffe (Small combustion/Struschka, PAH 10)"
"53955","PAH16","POP","PAH-16","Polyzyklische Aromatische Kohlenwasserstoffe (US EPA, PAH 16)"
"53956","PAHX","POP","PAH-X","Polyzyklische Aromatische Kohlenwasserstoffe (unbekanntes Gemisch)"
"53957","HCB","POP","HCB","HCB"
"53958","OTHER","","Other pollutants","Weitere Schadstoffe"
"53959","Benzen","OTHER","Benzen","Benzen"
"53960","Toluen","OTHER","Toluen","Toluen"
"53961","Xylen","OTHER","Xylen","Xylen"
"53962","C","OTHER","Carbon","Kohlenstoff"
