"ObjNr","ID","parent","label_en","label_de"
"64640","COKE_OVEN_COKE","","Hard coal coke","Steinkohlenkoks"
"64535","GLASS","","Glass","Glas"
"64536","LIME","","Lime","Kalk"
"64537","CEMENT","","Cement","Zement"
"64538","CEMENT_CLINKER","","Cement clinker","Zementklinker"
"64539","CERAMICS","","Ceramics","Keramische Produkte"
"64526","IRON_STEEL_PRODUCT","","Iron and steel product","Produkte im Bereich Eisen und Stahl"
"64527","OXYGEN_STEEL","IRON_STEEL_PRODUCT","Oxygen steel","Aufblas-Stahl (Oxygenstahl)"
"64528","CASTING","IRON_STEEL_PRODUCT","Iron and steel castings and malleable cast iron","Eisen-, Stahl- und Temperguss"
"64529","ELECTRIC_STEEL","IRON_STEEL_PRODUCT","Electric steel","Elektro-Stahl"
"64530","NON_FERROUS_METAL","IRON_STEEL_PRODUCT","Non-ferrous metals","Nichteisenmetalle"
"64531","PRIMARY_STEEL","IRON_STEEL_PRODUCT","Primary steel","Primärstahl"
"64532","PIG_IRON","IRON_STEEL_PRODUCT","Pig iron","Roheisen"
"64533","SINTER","IRON_STEEL_PRODUCT","Sinter","Sinter"
"64534","ROLLED_STEEL","IRON_STEEL_PRODUCT","Rolled steel","Walzstahl"
"64729","OPEN_HEARTH_STEEL","IRON_STEEL_PRODUCT","Open-hearth steel","Siemens-Martin-Stahl"
"64541","SUGAR","","Sugar","Zucker"
"64542","BEVERAGE","","Beverages","Getränke"
"64543","FOOD","","Foods","Nahrungsmittel"
"64544","PULP_PAPER","","Pulp and paper","Zellstoff und Papier"
