Vorgang gestartet
Berechne Variable Oil, Ereignis #4295 (1/217)
Berechne Variable Oil, Ereignis #4296 (2/217)
Berechne Variable Oil, Ereignis #4297 (3/217)
Berechne Variable Oil, Ereignis #4298 (4/217)
Berechne Variable Oil, Ereignis #4306 (5/217)
Berechne Variable Oil, Ereignis #4309 (6/217)
Berechne Variable Oil, Ereignis #4311 (7/217)
Berechne Variable Oil, Ereignis #4312 (8/217)
Berechne Variable Oil, Ereignis #4314 (9/217)
Berechne Variable Oil, Ereignis #4315 (10/217)
Berechne Variable Oil, Ereignis #4317 (11/217)
Berechne Variable Oil, Ereignis #4318 (12/217)
Berechne Variable Oil, Ereignis #4319 (13/217)
Berechne Variable Oil, Ereignis #4320 (14/217)
Berechne Variable Oil, Ereignis #4321 (15/217)
Berechne Variable Oil, Ereignis #4323 (16/217)
Berechne Variable Oil, Ereignis #4324 (17/217)
Berechne Variable Oil, Ereignis #4325 (18/217)
Berechne Variable Oil, Ereignis #4326 (19/217)
Berechne Variable Oil, Ereignis #4327 (20/217)
Berechne Variable Oil, Ereignis #4328 (21/217)
Berechne Variable Oil, Ereignis #4329 (22/217)
Berechne Variable Oil, Ereignis #4330 (23/217)
Berechne Variable Oil, Ereignis #4332 (24/217)
Berechne Variable Oil, Ereignis #4333 (25/217)
Berechne Variable Oil, Ereignis #4334 (26/217)
Berechne Variable Oil, Ereignis #4336 (27/217)
Berechne Variable Oil, Ereignis #4339 (28/217)
Berechne Variable Oil, Ereignis #4340 (29/217)
Berechne Variable Oil, Ereignis #4342 (30/217)
Berechne Variable Oil, Ereignis #4344 (31/217)
Berechne Variable Oil, Ereignis #4345 (32/217)
Berechne Variable Oil, Ereignis #4346 (33/217)
Berechne Variable Oil, Ereignis #4347 (34/217)
Berechne Variable Oil, Ereignis #4348 (35/217)
Berechne Variable Oil, Ereignis #4349 (36/217)
Berechne Variable Oil, Ereignis #4351 (37/217)
Berechne Variable Oil, Ereignis #4352 (38/217)
Berechne Variable Oil, Ereignis #4353 (39/217)
Berechne Variable Oil, Ereignis #4354 (40/217)
Berechne Variable Oil, Ereignis #4355 (41/217)
Berechne Variable Oil, Ereignis #4357 (42/217)
Berechne Variable Oil, Ereignis #4359 (43/217)
Berechne Variable Oil, Ereignis #4360 (44/217)
Berechne Variable Oil, Ereignis #4361 (45/217)
Berechne Variable Oil, Ereignis #4362 (46/217)
Berechne Variable Oil, Ereignis #4363 (47/217)
Berechne Variable Oil, Ereignis #4364 (48/217)
Berechne Variable Oil, Ereignis #4366 (49/217)
Berechne Variable Oil, Ereignis #4367 (50/217)
Berechne Variable Oil, Ereignis #4368 (51/217)
Berechne Variable Oil, Ereignis #4370 (52/217)
Berechne Variable Oil, Ereignis #4371 (53/217)
Berechne Variable Oil, Ereignis #4375 (54/217)
Berechne Variable Oil, Ereignis #4376 (55/217)
Berechne Variable Oil, Ereignis #4377 (56/217)
Berechne Variable Oil, Ereignis #4378 (57/217)
Berechne Variable Oil, Ereignis #4379 (58/217)
Berechne Variable Oil, Ereignis #4381 (59/217)
Berechne Variable Oil, Ereignis #4382 (60/217)
Berechne Variable Oil, Ereignis #4384 (61/217)
Berechne Variable Oil, Ereignis #4385 (62/217)
Berechne Variable Oil, Ereignis #4386 (63/217)
Berechne Variable Oil, Ereignis #4387 (64/217)
Berechne Variable Oil, Ereignis #4388 (65/217)
Berechne Variable Natural Gas, Ereignis #4391 (66/217)
Berechne Variable Natural Gas, Ereignis #4393 (67/217)
Berechne Variable Natural Gas, Ereignis #4394 (68/217)
Berechne Variable Natural Gas, Ereignis #4396 (69/217)
Berechne Variable Natural Gas, Ereignis #4397 (70/217)
Berechne Variable Natural Gas, Ereignis #4398 (71/217)
Berechne Variable Natural Gas, Ereignis #4399 (72/217)
Berechne Variable Natural Gas, Ereignis #4400 (73/217)
Berechne Variable Natural Gas, Ereignis #4402 (74/217)
Berechne Variable Natural Gas, Ereignis #4403 (75/217)
Berechne Variable Natural Gas, Ereignis #4404 (76/217)
Berechne Variable Natural Gas, Ereignis #4405 (77/217)
Berechne Variable Natural Gas, Ereignis #4406 (78/217)
Berechne Variable Natural Gas, Ereignis #4407 (79/217)
Berechne Variable Natural Gas, Ereignis #4408 (80/217)
Berechne Variable Natural Gas, Ereignis #4411 (81/217)
Berechne Variable Natural Gas, Ereignis #4412 (82/217)
Berechne Variable Natural Gas, Ereignis #4413 (83/217)
Berechne Variable Natural Gas, Ereignis #4414 (84/217)
Berechne Variable Natural Gas, Ereignis #4415 (85/217)
Berechne Variable Natural Gas, Ereignis #4416 (86/217)
Berechne Variable Natural Gas, Ereignis #4417 (87/217)
Berechne Variable Natural Gas, Ereignis #4418 (88/217)
Berechne Variable Natural Gas, Ereignis #4420 (89/217)
Berechne Variable Natural Gas, Ereignis #4423 (90/217)
Berechne Variable Natural Gas, Ereignis #4424 (91/217)
Berechne Variable Natural Gas, Ereignis #4425 (92/217)
Berechne Variable Natural Gas, Ereignis #4426 (93/217)
Berechne Variable Natural Gas, Ereignis #4429 (94/217)
Berechne Variable Natural Gas, Ereignis #4430 (95/217)
Berechne Variable Natural Gas, Ereignis #4431 (96/217)
Berechne Variable Natural Gas, Ereignis #4432 (97/217)
Berechne Variable Natural Gas, Ereignis #4433 (98/217)
Berechne Variable Natural Gas, Ereignis #4435 (99/217)
Berechne Variable Natural Gas, Ereignis #4437 (100/217)
Berechne Variable Natural Gas, Ereignis #4439 (101/217)
Berechne Variable Natural Gas, Ereignis #4440 (102/217)
Berechne Variable Natural Gas, Ereignis #4441 (103/217)
Berechne Variable Natural Gas, Ereignis #4442 (104/217)
Berechne Variable Natural Gas, Ereignis #4443 (105/217)
Berechne Variable Natural Gas, Ereignis #4444 (106/217)
Berechne Variable Natural Gas, Ereignis #4445 (107/217)
Berechne Variable Natural Gas, Ereignis #4446 (108/217)
Berechne Variable Natural Gas, Ereignis #4448 (109/217)
Berechne Variable Natural Gas, Ereignis #4449 (110/217)
Berechne Variable Natural Gas, Ereignis #4451 (111/217)
Berechne Variable Natural Gas, Ereignis #4452 (112/217)
Berechne Variable Natural Gas, Ereignis #4454 (113/217)
Berechne Variable Natural Gas, Ereignis #4455 (114/217)
Berechne Variable Natural Gas, Ereignis #4456 (115/217)
Berechne Variable Natural Gas, Ereignis #4457 (116/217)
Berechne Variable Natural Gas, Ereignis #4458 (117/217)
Berechne Variable Natural Gas, Ereignis #4461 (118/217)
Berechne Variable Natural Gas, Ereignis #4462 (119/217)
Berechne Variable Natural Gas, Ereignis #4464 (120/217)
Berechne Variable Natural Gas, Ereignis #4465 (121/217)
Berechne Variable Natural Gas, Ereignis #4466 (122/217)
Berechne Variable Natural Gas, Ereignis #4468 (123/217)
Berechne Variable Natural Gas, Ereignis #4469 (124/217)
Berechne Variable Natural Gas, Ereignis #4470 (125/217)
Berechne Variable Natural Gas, Ereignis #4471 (126/217)
Berechne Variable Venting and Flaring, Ereignis #4477 (127/217)
Berechne Variable Venting and Flaring, Ereignis #4480 (128/217)
Berechne Variable Venting and Flaring, Ereignis #4481 (129/217)
Berechne Variable Venting and Flaring, Ereignis #4482 (130/217)
Berechne Variable Venting and Flaring, Ereignis #4484 (131/217)
Berechne Variable Venting, Ereignis #4487 (132/217)
Berechne Variable Venting, Ereignis #10817 (133/217)
Berechne Variable Venting, Ereignis #10818 (134/217)
Berechne Variable Venting, Ereignis #10820 (135/217)
Berechne Variable Venting, Ereignis #10821 (136/217)
Berechne Variable Venting, Ereignis #10822 (137/217)
Berechne Variable Venting, Ereignis #10823 (138/217)
Berechne Variable Venting, Ereignis #10826 (139/217)
Berechne Variable Venting, Ereignis #10827 (140/217)
Berechne Variable Venting, Ereignis #10873 (141/217)
Berechne Variable Venting, Ereignis #4507 (142/217)
Berechne Variable Venting, Ereignis #4508 (143/217)
Berechne Variable Venting, Ereignis #4509 (144/217)
Berechne Variable Venting, Ereignis #4510 (145/217)
Berechne Variable Venting, Ereignis #4511 (146/217)
Berechne Variable Venting, Ereignis #4513 (147/217)
Berechne Variable Venting, Ereignis #4516 (148/217)
Berechne Variable Venting, Ereignis #4517 (149/217)
Berechne Variable Venting, Ereignis #4518 (150/217)
Berechne Variable Venting, Ereignis #10829 (151/217)
Berechne Variable Venting, Ereignis #10830 (152/217)
Berechne Variable Venting, Ereignis #10833 (153/217)
Berechne Variable Venting, Ereignis #10834 (154/217)
Berechne Variable Venting, Ereignis #10835 (155/217)
Berechne Variable Venting, Ereignis #10836 (156/217)
Berechne Variable Venting, Ereignis #10837 (157/217)
Berechne Variable Venting, Ereignis #10838 (158/217)
Berechne Variable Flaring, Ereignis #4539 (159/217)
Berechne Variable Flaring, Ereignis #10841 (160/217)
Berechne Variable Flaring, Ereignis #10842 (161/217)
Berechne Variable Flaring, Ereignis #10843 (162/217)
Berechne Variable Flaring, Ereignis #10844 (163/217)
Berechne Variable Flaring, Ereignis #10845 (164/217)
Berechne Variable Flaring, Ereignis #10847 (165/217)
Berechne Variable Flaring, Ereignis #10848 (166/217)
Berechne Variable Flaring, Ereignis #10849 (167/217)
Berechne Variable Flaring, Ereignis #10852 (168/217)
Berechne Variable Flaring, Ereignis #10854 (169/217)
Berechne Variable Flaring, Ereignis #10855 (170/217)
Berechne Variable Flaring, Ereignis #10856 (171/217)
Berechne Variable Flaring, Ereignis #4558 (172/217)
Berechne Variable Flaring, Ereignis #4561 (173/217)
Berechne Variable Flaring, Ereignis #4562 (174/217)
Berechne Variable Flaring, Ereignis #4563 (175/217)
Berechne Variable Flaring, Ereignis #4565 (176/217)
Berechne Variable Flaring, Ereignis #4566 (177/217)
Berechne Variable Flaring, Ereignis #4568 (178/217)
Berechne Variable Flaring, Ereignis #4569 (179/217)
Berechne Variable Flaring, Ereignis #4570 (180/217)
Berechne Variable Flaring, Ereignis #4571 (181/217)
Berechne Variable Flaring, Ereignis #4572 (182/217)
Berechne Variable Flaring, Ereignis #4573 (183/217)
Berechne Variable Flaring, Ereignis #10857 (184/217)
Berechne Variable Flaring, Ereignis #10858 (185/217)
Berechne Variable Flaring, Ereignis #10861 (186/217)
Berechne Variable Flaring, Ereignis #10862 (187/217)
Berechne Variable Flaring, Ereignis #10865 (188/217)
Berechne Variable Flaring, Ereignis #10866 (189/217)
Berechne Variable Flaring, Ereignis #10869 (190/217)
Berechne Variable Flaring, Ereignis #10872 (191/217)
Berechne Variable Other emissions from energy production, Ereignis #17093 (192/217)
Berechne Variable Other emissions from energy production, Ereignis #17095 (193/217)
Berechne Variable Other emissions from energy production, Ereignis #17096 (194/217)
Berechne Variable Other emissions from energy production, Ereignis #17097 (195/217)
Berechne Variable Other emissions from energy production, Ereignis #17098 (196/217)
Berechne Variable Other emissions from energy production, Ereignis #17099 (197/217)
Berechne Variable Other emissions from energy production, Ereignis #17100 (198/217)
Berechne Variable Other emissions from energy production, Ereignis #17101 (199/217)
Berechne Variable Other emissions from energy production, Ereignis #17102 (200/217)
Berechne Variable Other emissions from energy production, Ereignis #17103 (201/217)
Berechne Variable Other emissions from energy production, Ereignis #17104 (202/217)
Berechne Variable Other emissions from energy production, Ereignis #17105 (203/217)
Berechne Variable Other emissions from energy production, Ereignis #17106 (204/217)
Berechne Variable Other emissions from energy production, Ereignis #17107 (205/217)
Berechne Variable Other emissions from energy production, Ereignis #17108 (206/217)
Berechne Variable Other emissions from energy production, Ereignis #17109 (207/217)
Berechne Variable Other emissions from energy production, Ereignis #17111 (208/217)
Berechne Variable Other emissions from energy production, Ereignis #17112 (209/217)
Berechne Variable Other emissions from energy production, Ereignis #17113 (210/217)
Berechne Variable Other emissions from energy production, Ereignis #17114 (211/217)
Berechne Variable Other emissions from energy production, Ereignis #17115 (212/217)
Berechne Variable Other emissions from energy production, Ereignis #17116 (213/217)
Berechne Variable Other emissions from energy production, Ereignis #17120 (214/217)
Berechne Variable Other emissions from energy production, Ereignis #17121 (215/217)
Berechne Variable Other emissions from energy production, Ereignis #17122 (216/217)
Berechne Variable Other emissions from energy production, Ereignis #17123 (217/217)
Datei '\\tsclient\C\Program Files\Housesoft\ZSEnext\tables\data\crf_exporter\reporter_import_files\Submission 2024\import files\1 Energy\1B2.xml' wurde geschrieben (7161 Werte).
Vorgang beendet (00:03:09.9192306)
