from_UNFCCC;for_Mesap
AUS;AU
AUT;AT
BEL;BE
BGR;BG
BLR;BY
CAN;CA
CHE;CH
CYP;CY
CZE;CZ
DEU;DE
DNK;DK
ESP;ES
EST;EE
EUA;EU
FIN;FI
FRA;FR
GBR;GB
GRC;GR
HRV;HR
HUN;HU
IRL;IE
ISL;IS
ITA;IT
JPN;JP
KAZ;KZ
LIE;LI
LTU;LT
LUX;LU
LVA;LV
MCO;MC
MLT;MT
NLD;NL
NOR;NO
NZL;NZ
POL;PL
PRT;PT
ROU;RO
RUS;RU
SVK;SK
SVN;SI
SWE;SE
TUR;TR
UKR;UA
USA;US
