Vorgang gestartet
Berechne Variable 1.A.5.a  Stationary - Military, Ereignis #4087 (1/224)
Berechne Variable 1.A.5.a  Stationary - Military, Ereignis #4088 (2/224)
Berechne Variable 1.A.5.a  Stationary - Military, Ereignis #4089 (3/224)
Berechne Variable 1.A.5.a  Stationary - Military, Ereignis #4090 (4/224)
Berechne Variable 1.A.5.a  Stationary - Military, Ereignis #4091 (5/224)
Berechne Variable 1.A.5.a  Stationary, Ereignis #4095 (6/224)
Berechne Variable 1.A.5.a  Stationary, Ereignis #4096 (7/224)
Berechne Variable 1.A.5.a  Stationary, Ereignis #4106 (8/224)
Berechne Variable 1.A.5.a  Stationary, Ereignis #4108 (9/224)
Berechne Variable 1.A.5.a  Stationary - Military, Ereignis #4109 (10/224)
Berechne Variable 1.A.5.a  Stationary - Military, Ereignis #4111 (11/224)
Berechne Variable 1.A.5.a  Stationary - Military, Ereignis #4112 (12/224)
Berechne Variable 1.A.5.a  Stationary - Military, Ereignis #4113 (13/224)
Berechne Variable 1.A.5.a  Stationary - Military, Ereignis #4114 (14/224)
Berechne Variable 1.A.5.a  Stationary - Military, Ereignis #4115 (15/224)
Berechne Variable 1.A.5.a  Stationary - Military, Ereignis #4116 (16/224)
Berechne Variable 1.A.5.a  Stationary - Military, Ereignis #4117 (17/224)
Berechne Variable 1.A.5.a  Stationary - Military, Ereignis #4118 (18/224)
Berechne Variable 1.A.5.a  Stationary - Military, Ereignis #4120 (19/224)
Berechne Variable 1.A.5.a  Stationary - Military, Ereignis #4121 (20/224)
Berechne Variable 1.A.5.a  Stationary - Military, Ereignis #4122 (21/224)
Berechne Variable 1.A.5.a  Stationary - Military, Ereignis #4124 (22/224)
Berechne Variable 1.A.5.a  Stationary - Military, Ereignis #4125 (23/224)
Berechne Variable 1.A.5.a  Stationary - Military, Ereignis #4126 (24/224)
Berechne Variable 1.A.5.a  Stationary - Military, Ereignis #4127 (25/224)
Berechne Variable 1.A.5.a  Stationary - Military, Ereignis #4128 (26/224)
Berechne Variable 1.A.5.a  Stationary - Military, Ereignis #4129 (27/224)
Berechne Variable 1.A.5.a  Stationary - Military, Ereignis #4130 (28/224)
Berechne Variable 1.A.5.a  Stationary - Military, Ereignis #4131 (29/224)
Berechne Variable 1.A.5.a  Stationary - Military, Ereignis #4133 (30/224)
Berechne Variable 1.A.5.a  Stationary - Military, Ereignis #4134 (31/224)
Berechne Variable 1.A.5.a  Stationary - Military, Ereignis #4136 (32/224)
Berechne Variable 1.A.5.a  Stationary - Military, Ereignis #4137 (33/224)
Berechne Variable 1.A.5.a  Stationary - Military, Ereignis #4138 (34/224)
Berechne Variable 1.A.5.a  Stationary - Military, Ereignis #32168 (35/224)
Berechne Variable 1.A.5.a  Stationary - Military, Ereignis #32169 (36/224)
Berechne Variable 1.A.5.a  Stationary - Military, Ereignis #32170 (37/224)
Berechne Variable 1.A.5.a  Stationary - Military, Ereignis #32171 (38/224)
Berechne Variable 1.A.5.a  Stationary - Military, Ereignis #32172 (39/224)
Berechne Variable 1.A.5.a  Stationary - Military, Ereignis #32173 (40/224)
Berechne Variable 1.A.5.a  Stationary - Military, Ereignis #32174 (41/224)
Berechne Variable 1.A.5.a  Stationary - Military, Ereignis #32175 (42/224)
Berechne Variable 1.A.5.a  Stationary - Military, Ereignis #32176 (43/224)
Berechne Variable 1.A.5.a  Stationary - Military, Ereignis #32177 (44/224)
Berechne Variable 1.A.5.a  Stationary - Military, Ereignis #32178 (45/224)
Berechne Variable 1.A.5.a  Stationary - Military, Ereignis #32179 (46/224)
Berechne Variable 1.A.5.a  Stationary - Military, Ereignis #32180 (47/224)
Berechne Variable 1.A.5.a  Stationary - Military, Ereignis #32181 (48/224)
Berechne Variable 1.A.5.a  Stationary - Military, Ereignis #32182 (49/224)
Berechne Variable 1.A.5.a  Stationary - Military, Ereignis #32183 (50/224)
Berechne Variable 1.A.5.a  Stationary - Military, Ereignis #32184 (51/224)
Berechne Variable 1.A.5.a  Stationary - Military, Ereignis #32185 (52/224)
Berechne Variable 1.A.5.a  Stationary - Military, Ereignis #32186 (53/224)
Berechne Variable 1.A.5.a  Stationary - Military, Ereignis #32187 (54/224)
Berechne Variable 1.A.5.a  Stationary - Military, Ereignis #32188 (55/224)
Berechne Variable 1.A.5.a  Stationary - Military, Ereignis #32189 (56/224)
Berechne Variable 1.A.5.a  Stationary - Military, Ereignis #32190 (57/224)
Berechne Variable 1.A.5.a  Stationary - Military, Ereignis #32191 (58/224)
Berechne Variable 1.A.5.a  Stationary - Military, Ereignis #32192 (59/224)
Berechne Variable 1.A.5.a  Stationary - Military, Ereignis #32193 (60/224)
Berechne Variable 1.A.5.a  Stationary - Military, Ereignis #32194 (61/224)
Berechne Variable 1.A.5.a  Stationary - Military, Ereignis #32195 (62/224)
Berechne Variable 1.A.5.a  Stationary - Military, Ereignis #32196 (63/224)
Berechne Variable 1.A.5.a  Stationary - Military, Ereignis #32197 (64/224)
Berechne Variable 1.A.5.a  Stationary - Military, Ereignis #32198 (65/224)
Berechne Variable 1.A.5.a  Stationary - Military, Ereignis #32199 (66/224)
Berechne Variable 1.A.5.a  Stationary - Military, Ereignis #32200 (67/224)
Berechne Variable 1.A.5.a  Stationary - Military, Ereignis #32201 (68/224)
Berechne Variable 1.A.5.a  Stationary - Military, Ereignis #32202 (69/224)
Berechne Variable 1.A.5.a  Stationary - Military, Ereignis #32203 (70/224)
Berechne Variable 1.A.5.b  Mobile, Ereignis #4144 (71/224)
Berechne Variable 1.A.5.b  Mobile, Ereignis #4147 (72/224)
Berechne Variable 1.A.5.b  Mobile, Ereignis #4149 (73/224)
Berechne Variable 1.A.5.b  Mobile, Ereignis #4157 (74/224)
Berechne Variable 1.A.5.b  Mobile - Land-based military, Ereignis #32204 (75/224)
Berechne Variable 1.A.5.b  Mobile - Land-based military, Ereignis #32205 (76/224)
Berechne Variable 1.A.5.b  Mobile - Land-based military, Ereignis #32206 (77/224)
Berechne Variable 1.A.5.b  Mobile - Land-based military, Ereignis #32207 (78/224)
Berechne Variable 1.A.5.b  Mobile - Land-based military, Ereignis #32208 (79/224)
Berechne Variable 1.A.5.b  Mobile - Land-based military, Ereignis #32209 (80/224)
Berechne Variable 1.A.5.b  Mobile - Land-based military, Ereignis #32210 (81/224)
Berechne Variable 1.A.5.b  Mobile - Land-based military, Ereignis #32211 (82/224)
Berechne Variable 1.A.5.b  Mobile - Land-based military, Ereignis #32212 (83/224)
Berechne Variable 1.A.5.b  Mobile - Land-based military, Ereignis #32213 (84/224)
Berechne Variable 1.A.5.b  Mobile - Land-based military, Ereignis #32214 (85/224)
Berechne Variable 1.A.5.b  Mobile - Land-based military, Ereignis #32215 (86/224)
Berechne Variable 1.A.5.b  Mobile - Land-based military, Ereignis #32216 (87/224)
Berechne Variable 1.A.5.b  Mobile - Land-based military, Ereignis #32217 (88/224)
Berechne Variable 1.A.5.b  Mobile - Land-based military, Ereignis #32218 (89/224)
Berechne Variable 1.A.5.b  Mobile - Land-based military, Ereignis #32219 (90/224)
Berechne Variable 1.A.5.b  Mobile - Land-based military, Ereignis #32220 (91/224)
Berechne Variable 1.A.5.b  Mobile - Land-based military, Ereignis #32221 (92/224)
Berechne Variable 1.A.5.b  Mobile - Land-based military, Ereignis #32222 (93/224)
Berechne Variable 1.A.5.b  Mobile - Land-based military, Ereignis #32223 (94/224)
Berechne Variable 1.A.5.b  Mobile - Land-based military, Ereignis #32224 (95/224)
Berechne Variable 1.A.5.b  Mobile - Land-based military, Ereignis #32225 (96/224)
Berechne Variable 1.A.5.b  Mobile - Land-based military, Ereignis #32226 (97/224)
Berechne Variable 1.A.5.b  Mobile - Land-based military, Ereignis #32227 (98/224)
Berechne Variable 1.A.5.b  Mobile - Land-based military, Ereignis #32228 (99/224)
Berechne Variable 1.A.5.b  Mobile - Land-based military, Ereignis #32229 (100/224)
Berechne Variable 1.A.5.b  Mobile - Land-based military, Ereignis #32230 (101/224)
Berechne Variable 1.A.5.b  Mobile - Land-based military, Ereignis #32231 (102/224)
Berechne Variable 1.A.5.b  Mobile - Land-based military, Ereignis #32232 (103/224)
Berechne Variable 1.A.5.b  Mobile - Land-based military, Ereignis #32233 (104/224)
Berechne Variable 1.A.5.b  Mobile - Land-based military, Ereignis #32234 (105/224)
Berechne Variable 1.A.5.b  Mobile - Land-based military, Ereignis #32235 (106/224)
Berechne Variable 1.A.5.b  Mobile - Land-based military, Ereignis #32236 (107/224)
Berechne Variable 1.A.5.b  Mobile - Land-based military, Ereignis #32237 (108/224)
Berechne Variable 1.A.5.b  Mobile - Land-based military, Ereignis #32238 (109/224)
Berechne Variable 1.A.5.b  Mobile - Land-based military, Ereignis #32239 (110/224)
Berechne Variable 1.A.5.b  Mobile - Land-based military, Ereignis #32240 (111/224)
Berechne Variable 1.A.5.b  Mobile - Land-based military, Ereignis #32241 (112/224)
Berechne Variable 1.A.5.b  Mobile - Land-based military, Ereignis #32242 (113/224)
Berechne Variable 1.A.5.b  Mobile - Land-based military, Ereignis #32243 (114/224)
Berechne Variable 1.A.5.b  Mobile - Land-based military, Ereignis #32244 (115/224)
Berechne Variable 1.A.5.b  Mobile - Land-based military, Ereignis #32245 (116/224)
Berechne Variable 1.A.5.b  Mobile - Land-based military, Ereignis #32246 (117/224)
Berechne Variable 1.A.5.b  Mobile - Land-based military, Ereignis #32247 (118/224)
Berechne Variable 1.A.5.b  Mobile - Land-based military, Ereignis #32248 (119/224)
Berechne Variable 1.A.5.b  Mobile - Land-based military, Ereignis #32249 (120/224)
Berechne Variable 1.A.5.b  Mobile - Land-based military, Ereignis #32250 (121/224)
Berechne Variable 1.A.5.b  Mobile - Land-based military, Ereignis #32251 (122/224)
Berechne Variable 1.A.5.b  Mobile - Land-based military, Ereignis #32252 (123/224)
Berechne Variable 1.A.5.b  Mobile - Land-based military, Ereignis #32253 (124/224)
Berechne Variable 1.A.5.b  Mobile - Military aviation, Ereignis #32254 (125/224)
Berechne Variable 1.A.5.b  Mobile - Military aviation, Ereignis #32255 (126/224)
Berechne Variable 1.A.5.b  Mobile - Military aviation, Ereignis #32256 (127/224)
Berechne Variable 1.A.5.b  Mobile - Military aviation, Ereignis #32257 (128/224)
Berechne Variable 1.A.5.b  Mobile - Military aviation, Ereignis #32258 (129/224)
Berechne Variable 1.A.5.b  Mobile - Military aviation, Ereignis #32259 (130/224)
Berechne Variable 1.A.5.b  Mobile - Military aviation, Ereignis #32260 (131/224)
Berechne Variable 1.A.5.b  Mobile - Military aviation, Ereignis #32261 (132/224)
Berechne Variable 1.A.5.b  Mobile - Military aviation, Ereignis #32262 (133/224)
Berechne Variable 1.A.5.b  Mobile - Military aviation, Ereignis #32263 (134/224)
Berechne Variable 1.A.5.b  Mobile - Military aviation, Ereignis #32264 (135/224)
Berechne Variable 1.A.5.b  Mobile - Military aviation, Ereignis #32265 (136/224)
Berechne Variable 1.A.5.b  Mobile - Military aviation, Ereignis #32266 (137/224)
Berechne Variable 1.A.5.b  Mobile - Military aviation, Ereignis #32267 (138/224)
Berechne Variable 1.A.5.b  Mobile - Military aviation, Ereignis #32268 (139/224)
Berechne Variable 1.A.5.b  Mobile - Military aviation, Ereignis #32269 (140/224)
Berechne Variable 1.A.5.b  Mobile - Military aviation, Ereignis #32270 (141/224)
Berechne Variable 1.A.5.b  Mobile - Military aviation, Ereignis #32271 (142/224)
Berechne Variable 1.A.5.b  Mobile - Military aviation, Ereignis #32272 (143/224)
Berechne Variable 1.A.5.b  Mobile - Military aviation, Ereignis #32273 (144/224)
Berechne Variable 1.A.5.b  Mobile - Military aviation, Ereignis #32274 (145/224)
Berechne Variable 1.A.5.b  Mobile - Military aviation, Ereignis #32275 (146/224)
Berechne Variable 1.A.5.b  Mobile - Military aviation, Ereignis #32276 (147/224)
Berechne Variable 1.A.5.b  Mobile - Military aviation, Ereignis #32277 (148/224)
Berechne Variable 1.A.5.b  Mobile - Military aviation, Ereignis #32278 (149/224)
Berechne Variable 1.A.5.b  Mobile - Military aviation, Ereignis #32279 (150/224)
Berechne Variable 1.A.5.b  Mobile - Military aviation, Ereignis #32280 (151/224)
Berechne Variable 1.A.5.b  Mobile - Military aviation, Ereignis #32281 (152/224)
Berechne Variable 1.A.5.b  Mobile - Military aviation, Ereignis #32282 (153/224)
Berechne Variable 1.A.5.b  Mobile - Military aviation, Ereignis #32283 (154/224)
Berechne Variable 1.A.5.b  Mobile - Military aviation, Ereignis #32284 (155/224)
Berechne Variable 1.A.5.b  Mobile - Military aviation, Ereignis #32285 (156/224)
Berechne Variable 1.A.5.b  Mobile - Military aviation, Ereignis #32286 (157/224)
Berechne Variable 1.A.5.b  Mobile - Military aviation, Ereignis #32287 (158/224)
Berechne Variable 1.A.5.b  Mobile - Military aviation, Ereignis #32288 (159/224)
Berechne Variable 1.A.5.b  Mobile - Military aviation, Ereignis #32289 (160/224)
Berechne Variable 1.A.5.b  Mobile - Military aviation, Ereignis #32290 (161/224)
Berechne Variable 1.A.5.b  Mobile - Military aviation, Ereignis #32291 (162/224)
Berechne Variable 1.A.5.b  Mobile - Military aviation, Ereignis #32292 (163/224)
Berechne Variable 1.A.5.b  Mobile - Military aviation, Ereignis #32293 (164/224)
Berechne Variable 1.A.5.b  Mobile - Military aviation, Ereignis #32294 (165/224)
Berechne Variable 1.A.5.b  Mobile - Military aviation, Ereignis #32295 (166/224)
Berechne Variable 1.A.5.b  Mobile - Military aviation, Ereignis #32296 (167/224)
Berechne Variable 1.A.5.b  Mobile - Military aviation, Ereignis #32297 (168/224)
Berechne Variable 1.A.5.b  Mobile - Military aviation, Ereignis #32298 (169/224)
Berechne Variable 1.A.5.b  Mobile - Military aviation, Ereignis #32299 (170/224)
Berechne Variable 1.A.5.b  Mobile - Military aviation, Ereignis #32300 (171/224)
Berechne Variable 1.A.5.b  Mobile - Military aviation, Ereignis #32301 (172/224)
Berechne Variable 1.A.5.b  Mobile - Military aviation, Ereignis #32302 (173/224)
Berechne Variable 1.A.5.b  Mobile - Military aviation, Ereignis #32303 (174/224)
Berechne Variable 1.A.5.b  Mobile - Military navigation, Ereignis #32304 (175/224)
Berechne Variable 1.A.5.b  Mobile - Military navigation, Ereignis #32305 (176/224)
Berechne Variable 1.A.5.b  Mobile - Military navigation, Ereignis #32306 (177/224)
Berechne Variable 1.A.5.b  Mobile - Military navigation, Ereignis #32307 (178/224)
Berechne Variable 1.A.5.b  Mobile - Military navigation, Ereignis #32308 (179/224)
Berechne Variable 1.A.5.b  Mobile - Military navigation, Ereignis #32309 (180/224)
Berechne Variable 1.A.5.b  Mobile - Military navigation, Ereignis #32310 (181/224)
Berechne Variable 1.A.5.b  Mobile - Military navigation, Ereignis #32311 (182/224)
Berechne Variable 1.A.5.b  Mobile - Military navigation, Ereignis #32312 (183/224)
Berechne Variable 1.A.5.b  Mobile - Military navigation, Ereignis #32313 (184/224)
Berechne Variable 1.A.5.b  Mobile - Military navigation, Ereignis #32314 (185/224)
Berechne Variable 1.A.5.b  Mobile - Military navigation, Ereignis #32315 (186/224)
Berechne Variable 1.A.5.b  Mobile - Military navigation, Ereignis #32316 (187/224)
Berechne Variable 1.A.5.b  Mobile - Military navigation, Ereignis #32317 (188/224)
Berechne Variable 1.A.5.b  Mobile - Military navigation, Ereignis #32318 (189/224)
Berechne Variable 1.A.5.b  Mobile - Military navigation, Ereignis #32319 (190/224)
Berechne Variable 1.A.5.b  Mobile - Military navigation, Ereignis #32320 (191/224)
Berechne Variable 1.A.5.b  Mobile - Military navigation, Ereignis #32321 (192/224)
Berechne Variable 1.A.5.b  Mobile - Military navigation, Ereignis #32322 (193/224)
Berechne Variable 1.A.5.b  Mobile - Military navigation, Ereignis #32323 (194/224)
Berechne Variable 1.A.5.b  Mobile - Military navigation, Ereignis #32324 (195/224)
Berechne Variable 1.A.5.b  Mobile - Military navigation, Ereignis #32325 (196/224)
Berechne Variable 1.A.5.b  Mobile - Military navigation, Ereignis #32326 (197/224)
Berechne Variable 1.A.5.b  Mobile - Military navigation, Ereignis #32327 (198/224)
Berechne Variable 1.A.5.b  Mobile - Military navigation, Ereignis #32328 (199/224)
Berechne Variable 1.A.5.b  Mobile - Military navigation, Ereignis #32329 (200/224)
Berechne Variable 1.A.5.b  Mobile - Military navigation, Ereignis #32330 (201/224)
Berechne Variable 1.A.5.b  Mobile - Military navigation, Ereignis #32331 (202/224)
Berechne Variable 1.A.5.b  Mobile - Military navigation, Ereignis #32332 (203/224)
Berechne Variable 1.A.5.b  Mobile - Military navigation, Ereignis #32333 (204/224)
Berechne Variable 1.A.5.b  Mobile - Military navigation, Ereignis #32334 (205/224)
Berechne Variable 1.A.5.b  Mobile - Military navigation, Ereignis #32335 (206/224)
Berechne Variable 1.A.5.b  Mobile - Military navigation, Ereignis #32336 (207/224)
Berechne Variable 1.A.5.b  Mobile - Military navigation, Ereignis #32337 (208/224)
Berechne Variable 1.A.5.b  Mobile - Military navigation, Ereignis #32338 (209/224)
Berechne Variable 1.A.5.b  Mobile - Military navigation, Ereignis #32339 (210/224)
Berechne Variable 1.A.5.b  Mobile - Military navigation, Ereignis #32340 (211/224)
Berechne Variable 1.A.5.b  Mobile - Military navigation, Ereignis #32341 (212/224)
Berechne Variable 1.A.5.b  Mobile - Military navigation, Ereignis #32342 (213/224)
Berechne Variable 1.A.5.b  Mobile - Military navigation, Ereignis #32343 (214/224)
Berechne Variable 1.A.5.b  Mobile - Military navigation, Ereignis #32344 (215/224)
Berechne Variable 1.A.5.b  Mobile - Military navigation, Ereignis #32345 (216/224)
Berechne Variable 1.A.5.b  Mobile - Military navigation, Ereignis #32346 (217/224)
Berechne Variable 1.A.5.b  Mobile - Military navigation, Ereignis #32347 (218/224)
Berechne Variable 1.A.5.b  Mobile - Military navigation, Ereignis #32348 (219/224)
Berechne Variable 1.A.5.b  Mobile - Military navigation, Ereignis #32349 (220/224)
Berechne Variable 1.A.5.b  Mobile - Military navigation, Ereignis #32350 (221/224)
Berechne Variable 1.A.5.b  Mobile - Military navigation, Ereignis #32351 (222/224)
Berechne Variable 1.A.5.b  Mobile - Military navigation, Ereignis #32352 (223/224)
Berechne Variable 1.A.5.b  Mobile - Military navigation, Ereignis #32353 (224/224)
Datei '\\tsclient\C\Program Files\Housesoft\Zentrales System Emissionen\export\UNFCCC CRT Reporting Tool\files\Submission 2025\1 Energy\1A5.xml' wurde geschrieben (7616 Werte).
Vorgang beendet (00:05:34.2430467)
