{
    "version": {
        "metadata_ver": "1.29.8",
        "country": "DEU",
        "metadata_type": "CRT"
    },
    "data": {
        "values": [
            {
                "inventory_year": "1990",
                "values": [
                    {
                        "variable_uid": "004e14ec-f26a-449c-a75b-b1b40dcd26f6",
                        "value": {
                            "type": "text",
                            "value": null
                        },
                        "comments": [
                            {
                                "comment": "solid fuels used: lignite, lignite briquettes, hard coal, hard-coal coke",
                                "type": "official_comment"
                            }
                        ]
                    },
                    {
                        "variable_uid": "003dc20b-96c9-4d0a-8617-e2fed3727178",
                        "value": {
                            "type": "NK",
                            "value": 32
                        },
                        "comments": [
                            {
                                "comment": "solid fuels used: lignite, lignite briquettes, hard coal, hard-coal coke",
                                "type": "official_comment"
                            },
                            {
                                "comment": "recovery already regarded under emissions",
                                "type": "NK_explanation"
                            }
                        ]
                    },
                    {
                        "variable_uid": "fcf03955-9688-4dab-a27b-3b6a52203afc",
                        "value": {
                            "type": "NK",
                            "value": 32
                        },
                        "comments": [
                            {
                                "comment": "AD and EM included in 1.A.3.b i: LPG ",
                                "type": "Allocation_by_Party"
                            }
                        ]
                    }
                ]
            },
            {
                "inventory_year": "1991",
                "values": [
                    {
                        "variable_uid": "004e14ec-f26a-449c-a75b-b1b40dcd26f6",
                        "value": {
                            "type": "text",
                            "value": null
                        },
                        "comments": [
                            {
                                "comment": "solid fuels used: lignite, lignite briquettes, hard coal, hard-coal coke",
                                "type": "official_comment"
                            }
                        ]
                    },
                    {
                        "variable_uid": "003dc20b-96c9-4d0a-8617-e2fed3727178",
                        "value": {
                            "type": "NK",
                            "value": 32
                        },
                        "comments": [
                            {
                                "comment": "solid fuels used: lignite, lignite briquettes, hard coal, hard-coal coke",
                                "type": "official_comment"
                            },
                            {
                                "comment": "recovery already regarded under emissions",
                                "type": "NK_explanation"
                            }
                        ]
                    },
                    {
                        "variable_uid": "fcf03955-9688-4dab-a27b-3b6a52203afc",
                        "value": {
                            "type": "NK",
                            "value": 32
                        },
                        "comments": [
                            {
                                "comment": "AD and EM included in 1.A.3.b i: LPG ",
                                "type": "Allocation_by_Party"
                            }
                        ]
                    }
                ]
            },
            {
                "inventory_year": "1992",
                "values": [
                    {
                        "variable_uid": "004e14ec-f26a-449c-a75b-b1b40dcd26f6",
                        "value": {
                            "type": "text",
                            "value": null
                        },
                        "comments": [
                            {
                                "comment": "solid fuels used: lignite, lignite briquettes, hard coal, hard-coal coke",
                                "type": "official_comment"
                            }
                        ]
                    },
                    {
                        "variable_uid": "003dc20b-96c9-4d0a-8617-e2fed3727178",
                        "value": {
                            "type": "NK",
                            "value": 32
                        },
                        "comments": [
                            {
                                "comment": "solid fuels used: lignite, lignite briquettes, hard coal, hard-coal coke",
                                "type": "official_comment"
                            },
                            {
                                "comment": "recovery already regarded under emissions",
                                "type": "NK_explanation"
                            }
                        ]
                    },
                    {
                        "variable_uid": "fcf03955-9688-4dab-a27b-3b6a52203afc",
                        "value": {
                            "type": "NK",
                            "value": 32
                        },
                        "comments": [
                            {
                                "comment": "AD and EM included in 1.A.3.b i: LPG ",
                                "type": "Allocation_by_Party"
                            }
                        ]
                    }
                ]
            },
            {
                "inventory_year": "1993",
                "values": [
                    {
                        "variable_uid": "004e14ec-f26a-449c-a75b-b1b40dcd26f6",
                        "value": {
                            "type": "text",
                            "value": null
                        },
                        "comments": [
                            {
                                "comment": "solid fuels used: lignite, lignite briquettes, hard coal, hard-coal coke",
                                "type": "official_comment"
                            }
                        ]
                    },
                    {
                        "variable_uid": "003dc20b-96c9-4d0a-8617-e2fed3727178",
                        "value": {
                            "type": "NK",
                            "value": 32
                        },
                        "comments": [
                            {
                                "comment": "solid fuels used: lignite, lignite briquettes, hard coal, hard-coal coke",
                                "type": "official_comment"
                            },
                            {
                                "comment": "recovery already regarded under emissions",
                                "type": "NK_explanation"
                            }
                        ]
                    },
                    {
                        "variable_uid": "fcf03955-9688-4dab-a27b-3b6a52203afc",
                        "value": {
                            "type": "NK",
                            "value": 32
                        },
                        "comments": [
                            {
                                "comment": "AD and EM included in 1.A.3.b i: LPG ",
                                "type": "Allocation_by_Party"
                            }
                        ]
                    }
                ]
            },
            {
                "inventory_year": "1994",
                "values": [
                    {
                        "variable_uid": "004e14ec-f26a-449c-a75b-b1b40dcd26f6",
                        "value": {
                            "type": "text",
                            "value": null
                        },
                        "comments": [
                            {
                                "comment": "solid fuels used: lignite, lignite briquettes, hard coal, hard-coal coke",
                                "type": "official_comment"
                            }
                        ]
                    },
                    {
                        "variable_uid": "003dc20b-96c9-4d0a-8617-e2fed3727178",
                        "value": {
                            "type": "NK",
                            "value": 32
                        },
                        "comments": [
                            {
                                "comment": "solid fuels used: lignite, lignite briquettes, hard coal, hard-coal coke",
                                "type": "official_comment"
                            },
                            {
                                "comment": "recovery already regarded under emissions",
                                "type": "NK_explanation"
                            }
                        ]
                    },
                    {
                        "variable_uid": "fcf03955-9688-4dab-a27b-3b6a52203afc",
                        "value": {
                            "type": "NK",
                            "value": 32
                        },
                        "comments": [
                            {
                                "comment": "AD and EM included in 1.A.3.b i: LPG ",
                                "type": "Allocation_by_Party"
                            }
                        ]
                    }
                ]
            },
            {
                "inventory_year": "1995",
                "values": [
                    {
                        "variable_uid": "004e14ec-f26a-449c-a75b-b1b40dcd26f6",
                        "value": {
                            "type": "text",
                            "value": null
                        },
                        "comments": [
                            {
                                "comment": "solid fuels used: lignite, lignite briquettes, hard coal, hard-coal coke",
                                "type": "official_comment"
                            }
                        ]
                    },
                    {
                        "variable_uid": "003dc20b-96c9-4d0a-8617-e2fed3727178",
                        "value": {
                            "type": "NK",
                            "value": 32
                        },
                        "comments": [
                            {
                                "comment": "solid fuels used: lignite, lignite briquettes, hard coal, hard-coal coke",
                                "type": "official_comment"
                            },
                            {
                                "comment": "recovery already regarded under emissions",
                                "type": "NK_explanation"
                            }
                        ]
                    },
                    {
                        "variable_uid": "fcf03955-9688-4dab-a27b-3b6a52203afc",
                        "value": {
                            "type": "NK",
                            "value": 32
                        },
                        "comments": [
                            {
                                "comment": "AD and EM included in 1.A.3.b i: LPG ",
                                "type": "Allocation_by_Party"
                            }
                        ]
                    }
                ]
            },
            {
                "inventory_year": "1996",
                "values": [
                    {
                        "variable_uid": "004e14ec-f26a-449c-a75b-b1b40dcd26f6",
                        "value": {
                            "type": "text",
                            "value": null
                        },
                        "comments": [
                            {
                                "comment": "solid fuels used: lignite, lignite briquettes, hard coal, hard-coal coke",
                                "type": "official_comment"
                            }
                        ]
                    },
                    {
                        "variable_uid": "003dc20b-96c9-4d0a-8617-e2fed3727178",
                        "value": {
                            "type": "NK",
                            "value": 32
                        },
                        "comments": [
                            {
                                "comment": "solid fuels used: lignite, lignite briquettes, hard coal, hard-coal coke",
                                "type": "official_comment"
                            },
                            {
                                "comment": "recovery already regarded under emissions",
                                "type": "NK_explanation"
                            }
                        ]
                    },
                    {
                        "variable_uid": "fcf03955-9688-4dab-a27b-3b6a52203afc",
                        "value": {
                            "type": "NK",
                            "value": 32
                        },
                        "comments": [
                            {
                                "comment": "AD and EM included in 1.A.3.b i: LPG ",
                                "type": "Allocation_by_Party"
                            }
                        ]
                    }
                ]
            },
            {
                "inventory_year": "1997",
                "values": [
                    {
                        "variable_uid": "004e14ec-f26a-449c-a75b-b1b40dcd26f6",
                        "value": {
                            "type": "text",
                            "value": null
                        },
                        "comments": [
                            {
                                "comment": "solid fuels used: lignite, lignite briquettes, hard coal, hard-coal coke",
                                "type": "official_comment"
                            }
                        ]
                    },
                    {
                        "variable_uid": "003dc20b-96c9-4d0a-8617-e2fed3727178",
                        "value": {
                            "type": "NK",
                            "value": 32
                        },
                        "comments": [
                            {
                                "comment": "solid fuels used: lignite, lignite briquettes, hard coal, hard-coal coke",
                                "type": "official_comment"
                            },
                            {
                                "comment": "recovery already regarded under emissions",
                                "type": "NK_explanation"
                            }
                        ]
                    },
                    {
                        "variable_uid": "fcf03955-9688-4dab-a27b-3b6a52203afc",
                        "value": {
                            "type": "NK",
                            "value": 32
                        },
                        "comments": [
                            {
                                "comment": "AD and EM included in 1.A.3.b i: LPG ",
                                "type": "Allocation_by_Party"
                            }
                        ]
                    }
                ]
            },
            {
                "inventory_year": "1998",
                "values": [
                    {
                        "variable_uid": "004e14ec-f26a-449c-a75b-b1b40dcd26f6",
                        "value": {
                            "type": "text",
                            "value": null
                        },
                        "comments": [
                            {
                                "comment": "solid fuels used: lignite, lignite briquettes, hard coal, hard-coal coke",
                                "type": "official_comment"
                            }
                        ]
                    },
                    {
                        "variable_uid": "003dc20b-96c9-4d0a-8617-e2fed3727178",
                        "value": {
                            "type": "NK",
                            "value": 32
                        },
                        "comments": [
                            {
                                "comment": "solid fuels used: lignite, lignite briquettes, hard coal, hard-coal coke",
                                "type": "official_comment"
                            },
                            {
                                "comment": "recovery already regarded under emissions",
                                "type": "NK_explanation"
                            }
                        ]
                    },
                    {
                        "variable_uid": "fcf03955-9688-4dab-a27b-3b6a52203afc",
                        "value": {
                            "type": "NK",
                            "value": 32
                        },
                        "comments": [
                            {
                                "comment": "AD and EM included in 1.A.3.b i: LPG ",
                                "type": "Allocation_by_Party"
                            }
                        ]
                    }
                ]
            },
            {
                "inventory_year": "1999",
                "values": [
                    {
                        "variable_uid": "004e14ec-f26a-449c-a75b-b1b40dcd26f6",
                        "value": {
                            "type": "text",
                            "value": null
                        },
                        "comments": [
                            {
                                "comment": "solid fuels used: lignite, lignite briquettes, hard coal, hard-coal coke",
                                "type": "official_comment"
                            }
                        ]
                    },
                    {
                        "variable_uid": "003dc20b-96c9-4d0a-8617-e2fed3727178",
                        "value": {
                            "type": "NK",
                            "value": 32
                        },
                        "comments": [
                            {
                                "comment": "solid fuels used: lignite, lignite briquettes, hard coal, hard-coal coke",
                                "type": "official_comment"
                            },
                            {
                                "comment": "recovery already regarded under emissions",
                                "type": "NK_explanation"
                            }
                        ]
                    },
                    {
                        "variable_uid": "fcf03955-9688-4dab-a27b-3b6a52203afc",
                        "value": {
                            "type": "NK",
                            "value": 32
                        },
                        "comments": [
                            {
                                "comment": "AD and EM included in 1.A.3.b i: LPG ",
                                "type": "Allocation_by_Party"
                            }
                        ]
                    }
                ]
            },
            {
                "inventory_year": "2000",
                "values": [
                    {
                        "variable_uid": "004e14ec-f26a-449c-a75b-b1b40dcd26f6",
                        "value": {
                            "type": "text",
                            "value": null
                        },
                        "comments": [
                            {
                                "comment": "solid fuels used: lignite, lignite briquettes, hard coal, hard-coal coke",
                                "type": "official_comment"
                            }
                        ]
                    },
                    {
                        "variable_uid": "003dc20b-96c9-4d0a-8617-e2fed3727178",
                        "value": {
                            "type": "NK",
                            "value": 32
                        },
                        "comments": [
                            {
                                "comment": "solid fuels used: lignite, lignite briquettes, hard coal, hard-coal coke",
                                "type": "official_comment"
                            },
                            {
                                "comment": "recovery already regarded under emissions",
                                "type": "NK_explanation"
                            }
                        ]
                    },
                    {
                        "variable_uid": "fcf03955-9688-4dab-a27b-3b6a52203afc",
                        "value": {
                            "type": "NK",
                            "value": 32
                        },
                        "comments": [
                            {
                                "comment": "AD and EM included in 1.A.3.b i: LPG ",
                                "type": "Allocation_by_Party"
                            }
                        ]
                    }
                ]
            },
            {
                "inventory_year": "2001",
                "values": [
                    {
                        "variable_uid": "004e14ec-f26a-449c-a75b-b1b40dcd26f6",
                        "value": {
                            "type": "text",
                            "value": null
                        },
                        "comments": [
                            {
                                "comment": "solid fuels used: lignite, lignite briquettes, hard coal, hard-coal coke",
                                "type": "official_comment"
                            }
                        ]
                    },
                    {
                        "variable_uid": "003dc20b-96c9-4d0a-8617-e2fed3727178",
                        "value": {
                            "type": "NK",
                            "value": 32
                        },
                        "comments": [
                            {
                                "comment": "solid fuels used: lignite, lignite briquettes, hard coal, hard-coal coke",
                                "type": "official_comment"
                            },
                            {
                                "comment": "recovery already regarded under emissions",
                                "type": "NK_explanation"
                            }
                        ]
                    },
                    {
                        "variable_uid": "fcf03955-9688-4dab-a27b-3b6a52203afc",
                        "value": {
                            "type": "NK",
                            "value": 32
                        },
                        "comments": [
                            {
                                "comment": "AD and EM included in 1.A.3.b i: LPG ",
                                "type": "Allocation_by_Party"
                            }
                        ]
                    }
                ]
            },
            {
                "inventory_year": "2002",
                "values": [
                    {
                        "variable_uid": "004e14ec-f26a-449c-a75b-b1b40dcd26f6",
                        "value": {
                            "type": "text",
                            "value": null
                        },
                        "comments": [
                            {
                                "comment": "solid fuels used: lignite, lignite briquettes, hard coal, hard-coal coke",
                                "type": "official_comment"
                            }
                        ]
                    },
                    {
                        "variable_uid": "003dc20b-96c9-4d0a-8617-e2fed3727178",
                        "value": {
                            "type": "NK",
                            "value": 32
                        },
                        "comments": [
                            {
                                "comment": "solid fuels used: lignite, lignite briquettes, hard coal, hard-coal coke",
                                "type": "official_comment"
                            },
                            {
                                "comment": "recovery already regarded under emissions",
                                "type": "NK_explanation"
                            }
                        ]
                    },
                    {
                        "variable_uid": "fcf03955-9688-4dab-a27b-3b6a52203afc",
                        "value": {
                            "type": "NK",
                            "value": 32
                        },
                        "comments": [
                            {
                                "comment": "AD and EM included in 1.A.3.b i: LPG ",
                                "type": "Allocation_by_Party"
                            }
                        ]
                    }
                ]
            },
            {
                "inventory_year": "2003",
                "values": [
                    {
                        "variable_uid": "004e14ec-f26a-449c-a75b-b1b40dcd26f6",
                        "value": {
                            "type": "text",
                            "value": null
                        },
                        "comments": [
                            {
                                "comment": "solid fuels used: lignite, lignite briquettes, hard coal, hard-coal coke",
                                "type": "official_comment"
                            }
                        ]
                    },
                    {
                        "variable_uid": "003dc20b-96c9-4d0a-8617-e2fed3727178",
                        "value": {
                            "type": "NK",
                            "value": 32
                        },
                        "comments": [
                            {
                                "comment": "solid fuels used: lignite, lignite briquettes, hard coal, hard-coal coke",
                                "type": "official_comment"
                            },
                            {
                                "comment": "recovery already regarded under emissions",
                                "type": "NK_explanation"
                            }
                        ]
                    },
                    {
                        "variable_uid": "fcf03955-9688-4dab-a27b-3b6a52203afc",
                        "value": {
                            "type": "NK",
                            "value": 32
                        },
                        "comments": [
                            {
                                "comment": "AD and EM included in 1.A.3.b i: LPG ",
                                "type": "Allocation_by_Party"
                            }
                        ]
                    }
                ]
            },
            {
                "inventory_year": "2004",
                "values": [
                    {
                        "variable_uid": "004e14ec-f26a-449c-a75b-b1b40dcd26f6",
                        "value": {
                            "type": "text",
                            "value": null
                        },
                        "comments": [
                            {
                                "comment": "solid fuels used: lignite, lignite briquettes, hard coal, hard-coal coke",
                                "type": "official_comment"
                            }
                        ]
                    },
                    {
                        "variable_uid": "003dc20b-96c9-4d0a-8617-e2fed3727178",
                        "value": {
                            "type": "NK",
                            "value": 32
                        },
                        "comments": [
                            {
                                "comment": "solid fuels used: lignite, lignite briquettes, hard coal, hard-coal coke",
                                "type": "official_comment"
                            },
                            {
                                "comment": "recovery already regarded under emissions",
                                "type": "NK_explanation"
                            }
                        ]
                    },
                    {
                        "variable_uid": "fcf03955-9688-4dab-a27b-3b6a52203afc",
                        "value": {
                            "type": "NK",
                            "value": 32
                        },
                        "comments": [
                            {
                                "comment": "AD and EM included in 1.A.3.b i: LPG ",
                                "type": "Allocation_by_Party"
                            }
                        ]
                    }
                ]
            },
            {
                "inventory_year": "2005",
                "values": [
                    {
                        "variable_uid": "004e14ec-f26a-449c-a75b-b1b40dcd26f6",
                        "value": {
                            "type": "text",
                            "value": null
                        },
                        "comments": [
                            {
                                "comment": "solid fuels used: lignite, lignite briquettes, hard coal, hard-coal coke",
                                "type": "official_comment"
                            }
                        ]
                    },
                    {
                        "variable_uid": "003dc20b-96c9-4d0a-8617-e2fed3727178",
                        "value": {
                            "type": "NK",
                            "value": 32
                        },
                        "comments": [
                            {
                                "comment": "solid fuels used: lignite, lignite briquettes, hard coal, hard-coal coke",
                                "type": "official_comment"
                            },
                            {
                                "comment": "recovery already regarded under emissions",
                                "type": "NK_explanation"
                            }
                        ]
                    },
                    {
                        "variable_uid": "fcf03955-9688-4dab-a27b-3b6a52203afc",
                        "value": {
                            "type": "NK",
                            "value": 32
                        },
                        "comments": [
                            {
                                "comment": "AD and EM included in 1.A.3.b i: LPG ",
                                "type": "Allocation_by_Party"
                            }
                        ]
                    }
                ]
            },
            {
                "inventory_year": "2006",
                "values": [
                    {
                        "variable_uid": "004e14ec-f26a-449c-a75b-b1b40dcd26f6",
                        "value": {
                            "type": "text",
                            "value": null
                        },
                        "comments": [
                            {
                                "comment": "solid fuels used: lignite, lignite briquettes, hard coal, hard-coal coke",
                                "type": "official_comment"
                            }
                        ]
                    },
                    {
                        "variable_uid": "003dc20b-96c9-4d0a-8617-e2fed3727178",
                        "value": {
                            "type": "NK",
                            "value": 32
                        },
                        "comments": [
                            {
                                "comment": "solid fuels used: lignite, lignite briquettes, hard coal, hard-coal coke",
                                "type": "official_comment"
                            },
                            {
                                "comment": "recovery already regarded under emissions",
                                "type": "NK_explanation"
                            }
                        ]
                    },
                    {
                        "variable_uid": "fcf03955-9688-4dab-a27b-3b6a52203afc",
                        "value": {
                            "type": "NK",
                            "value": 32
                        },
                        "comments": [
                            {
                                "comment": "AD and EM included in 1.A.3.b i: LPG ",
                                "type": "Allocation_by_Party"
                            }
                        ]
                    }
                ]
            },
            {
                "inventory_year": "2007",
                "values": [
                    {
                        "variable_uid": "004e14ec-f26a-449c-a75b-b1b40dcd26f6",
                        "value": {
                            "type": "text",
                            "value": null
                        },
                        "comments": [
                            {
                                "comment": "solid fuels used: lignite, lignite briquettes, hard coal, hard-coal coke",
                                "type": "official_comment"
                            }
                        ]
                    },
                    {
                        "variable_uid": "003dc20b-96c9-4d0a-8617-e2fed3727178",
                        "value": {
                            "type": "NK",
                            "value": 32
                        },
                        "comments": [
                            {
                                "comment": "solid fuels used: lignite, lignite briquettes, hard coal, hard-coal coke",
                                "type": "official_comment"
                            },
                            {
                                "comment": "recovery already regarded under emissions",
                                "type": "NK_explanation"
                            }
                        ]
                    },
                    {
                        "variable_uid": "fcf03955-9688-4dab-a27b-3b6a52203afc",
                        "value": {
                            "type": "NK",
                            "value": 32
                        },
                        "comments": [
                            {
                                "comment": "AD and EM included in 1.A.3.b i: LPG ",
                                "type": "Allocation_by_Party"
                            }
                        ]
                    }
                ]
            },
            {
                "inventory_year": "2008",
                "values": [
                    {
                        "variable_uid": "004e14ec-f26a-449c-a75b-b1b40dcd26f6",
                        "value": {
                            "type": "text",
                            "value": null
                        },
                        "comments": [
                            {
                                "comment": "solid fuels used: lignite, lignite briquettes, hard coal, hard-coal coke",
                                "type": "official_comment"
                            }
                        ]
                    },
                    {
                        "variable_uid": "003dc20b-96c9-4d0a-8617-e2fed3727178",
                        "value": {
                            "type": "NK",
                            "value": 32
                        },
                        "comments": [
                            {
                                "comment": "solid fuels used: lignite, lignite briquettes, hard coal, hard-coal coke",
                                "type": "official_comment"
                            },
                            {
                                "comment": "recovery already regarded under emissions",
                                "type": "NK_explanation"
                            }
                        ]
                    },
                    {
                        "variable_uid": "fcf03955-9688-4dab-a27b-3b6a52203afc",
                        "value": {
                            "type": "NK",
                            "value": 32
                        },
                        "comments": [
                            {
                                "comment": "AD and EM included in 1.A.3.b i: LPG ",
                                "type": "Allocation_by_Party"
                            }
                        ]
                    }
                ]
            },
            {
                "inventory_year": "2009",
                "values": [
                    {
                        "variable_uid": "004e14ec-f26a-449c-a75b-b1b40dcd26f6",
                        "value": {
                            "type": "text",
                            "value": null
                        },
                        "comments": [
                            {
                                "comment": "solid fuels used: lignite, lignite briquettes, hard coal, hard-coal coke",
                                "type": "official_comment"
                            }
                        ]
                    },
                    {
                        "variable_uid": "003dc20b-96c9-4d0a-8617-e2fed3727178",
                        "value": {
                            "type": "NK",
                            "value": 32
                        },
                        "comments": [
                            {
                                "comment": "solid fuels used: lignite, lignite briquettes, hard coal, hard-coal coke",
                                "type": "official_comment"
                            },
                            {
                                "comment": "recovery already regarded under emissions",
                                "type": "NK_explanation"
                            }
                        ]
                    },
                    {
                        "variable_uid": "fcf03955-9688-4dab-a27b-3b6a52203afc",
                        "value": {
                            "type": "NK",
                            "value": 32
                        },
                        "comments": [
                            {
                                "comment": "AD and EM included in 1.A.3.b i: LPG ",
                                "type": "Allocation_by_Party"
                            }
                        ]
                    }
                ]
            },
            {
                "inventory_year": "2010",
                "values": [
                    {
                        "variable_uid": "004e14ec-f26a-449c-a75b-b1b40dcd26f6",
                        "value": {
                            "type": "text",
                            "value": null
                        },
                        "comments": [
                            {
                                "comment": "solid fuels used: lignite, lignite briquettes, hard coal, hard-coal coke",
                                "type": "official_comment"
                            }
                        ]
                    },
                    {
                        "variable_uid": "003dc20b-96c9-4d0a-8617-e2fed3727178",
                        "value": {
                            "type": "NK",
                            "value": 32
                        },
                        "comments": [
                            {
                                "comment": "solid fuels used: lignite, lignite briquettes, hard coal, hard-coal coke",
                                "type": "official_comment"
                            },
                            {
                                "comment": "recovery already regarded under emissions",
                                "type": "NK_explanation"
                            }
                        ]
                    },
                    {
                        "variable_uid": "fcf03955-9688-4dab-a27b-3b6a52203afc",
                        "value": {
                            "type": "NK",
                            "value": 32
                        },
                        "comments": [
                            {
                                "comment": "AD and EM included in 1.A.3.b i: LPG ",
                                "type": "Allocation_by_Party"
                            }
                        ]
                    }
                ]
            },
            {
                "inventory_year": "2011",
                "values": [
                    {
                        "variable_uid": "004e14ec-f26a-449c-a75b-b1b40dcd26f6",
                        "value": {
                            "type": "text",
                            "value": null
                        },
                        "comments": [
                            {
                                "comment": "solid fuels used: lignite, lignite briquettes, hard coal, hard-coal coke",
                                "type": "official_comment"
                            }
                        ]
                    },
                    {
                        "variable_uid": "003dc20b-96c9-4d0a-8617-e2fed3727178",
                        "value": {
                            "type": "NK",
                            "value": 32
                        },
                        "comments": [
                            {
                                "comment": "solid fuels used: lignite, lignite briquettes, hard coal, hard-coal coke",
                                "type": "official_comment"
                            },
                            {
                                "comment": "recovery already regarded under emissions",
                                "type": "NK_explanation"
                            }
                        ]
                    },
                    {
                        "variable_uid": "fcf03955-9688-4dab-a27b-3b6a52203afc",
                        "value": {
                            "type": "NK",
                            "value": 32
                        },
                        "comments": [
                            {
                                "comment": "AD and EM included in 1.A.3.b i: LPG ",
                                "type": "Allocation_by_Party"
                            }
                        ]
                    }
                ]
            },
            {
                "inventory_year": "2012",
                "values": [
                    {
                        "variable_uid": "004e14ec-f26a-449c-a75b-b1b40dcd26f6",
                        "value": {
                            "type": "text",
                            "value": null
                        },
                        "comments": [
                            {
                                "comment": "solid fuels used: lignite, lignite briquettes, hard coal, hard-coal coke",
                                "type": "official_comment"
                            }
                        ]
                    },
                    {
                        "variable_uid": "003dc20b-96c9-4d0a-8617-e2fed3727178",
                        "value": {
                            "type": "NK",
                            "value": 32
                        },
                        "comments": [
                            {
                                "comment": "solid fuels used: lignite, lignite briquettes, hard coal, hard-coal coke",
                                "type": "official_comment"
                            },
                            {
                                "comment": "recovery already regarded under emissions",
                                "type": "NK_explanation"
                            }
                        ]
                    },
                    {
                        "variable_uid": "fcf03955-9688-4dab-a27b-3b6a52203afc",
                        "value": {
                            "type": "NK",
                            "value": 32
                        },
                        "comments": [
                            {
                                "comment": "AD and EM included in 1.A.3.b i: LPG ",
                                "type": "Allocation_by_Party"
                            }
                        ]
                    }
                ]
            },
            {
                "inventory_year": "2013",
                "values": [
                    {
                        "variable_uid": "004e14ec-f26a-449c-a75b-b1b40dcd26f6",
                        "value": {
                            "type": "text",
                            "value": null
                        },
                        "comments": [
                            {
                                "comment": "solid fuels used: lignite, lignite briquettes, hard coal, hard-coal coke",
                                "type": "official_comment"
                            }
                        ]
                    },
                    {
                        "variable_uid": "003dc20b-96c9-4d0a-8617-e2fed3727178",
                        "value": {
                            "type": "NK",
                            "value": 32
                        },
                        "comments": [
                            {
                                "comment": "solid fuels used: lignite, lignite briquettes, hard coal, hard-coal coke",
                                "type": "official_comment"
                            },
                            {
                                "comment": "recovery already regarded under emissions",
                                "type": "NK_explanation"
                            }
                        ]
                    },
                    {
                        "variable_uid": "fcf03955-9688-4dab-a27b-3b6a52203afc",
                        "value": {
                            "type": "NK",
                            "value": 32
                        },
                        "comments": [
                            {
                                "comment": "AD and EM included in 1.A.3.b i: LPG ",
                                "type": "Allocation_by_Party"
                            }
                        ]
                    }
                ]
            },
            {
                "inventory_year": "2014",
                "values": [
                    {
                        "variable_uid": "004e14ec-f26a-449c-a75b-b1b40dcd26f6",
                        "value": {
                            "type": "text",
                            "value": null
                        },
                        "comments": [
                            {
                                "comment": "solid fuels used: lignite, lignite briquettes, hard coal, hard-coal coke",
                                "type": "official_comment"
                            }
                        ]
                    },
                    {
                        "variable_uid": "003dc20b-96c9-4d0a-8617-e2fed3727178",
                        "value": {
                            "type": "NK",
                            "value": 32
                        },
                        "comments": [
                            {
                                "comment": "solid fuels used: lignite, lignite briquettes, hard coal, hard-coal coke",
                                "type": "official_comment"
                            },
                            {
                                "comment": "recovery already regarded under emissions",
                                "type": "NK_explanation"
                            }
                        ]
                    },
                    {
                        "variable_uid": "fcf03955-9688-4dab-a27b-3b6a52203afc",
                        "value": {
                            "type": "NK",
                            "value": 32
                        },
                        "comments": [
                            {
                                "comment": "AD and EM included in 1.A.3.b i: LPG ",
                                "type": "Allocation_by_Party"
                            }
                        ]
                    }
                ]
            },
            {
                "inventory_year": "2015",
                "values": [
                    {
                        "variable_uid": "004e14ec-f26a-449c-a75b-b1b40dcd26f6",
                        "value": {
                            "type": "text",
                            "value": null
                        },
                        "comments": [
                            {
                                "comment": "solid fuels used: lignite, lignite briquettes, hard coal, hard-coal coke",
                                "type": "official_comment"
                            }
                        ]
                    },
                    {
                        "variable_uid": "003dc20b-96c9-4d0a-8617-e2fed3727178",
                        "value": {
                            "type": "NK",
                            "value": 32
                        },
                        "comments": [
                            {
                                "comment": "solid fuels used: lignite, lignite briquettes, hard coal, hard-coal coke",
                                "type": "official_comment"
                            },
                            {
                                "comment": "recovery already regarded under emissions",
                                "type": "NK_explanation"
                            }
                        ]
                    },
                    {
                        "variable_uid": "fcf03955-9688-4dab-a27b-3b6a52203afc",
                        "value": {
                            "type": "NK",
                            "value": 32
                        },
                        "comments": [
                            {
                                "comment": "AD and EM included in 1.A.3.b i: LPG ",
                                "type": "Allocation_by_Party"
                            }
                        ]
                    }
                ]
            },
            {
                "inventory_year": "2016",
                "values": [
                    {
                        "variable_uid": "004e14ec-f26a-449c-a75b-b1b40dcd26f6",
                        "value": {
                            "type": "text",
                            "value": null
                        },
                        "comments": [
                            {
                                "comment": "solid fuels used: lignite, lignite briquettes, hard coal, hard-coal coke",
                                "type": "official_comment"
                            }
                        ]
                    },
                    {
                        "variable_uid": "003dc20b-96c9-4d0a-8617-e2fed3727178",
                        "value": {
                            "type": "NK",
                            "value": 32
                        },
                        "comments": [
                            {
                                "comment": "solid fuels used: lignite, lignite briquettes, hard coal, hard-coal coke",
                                "type": "official_comment"
                            },
                            {
                                "comment": "recovery already regarded under emissions",
                                "type": "NK_explanation"
                            }
                        ]
                    },
                    {
                        "variable_uid": "fcf03955-9688-4dab-a27b-3b6a52203afc",
                        "value": {
                            "type": "NK",
                            "value": 32
                        },
                        "comments": [
                            {
                                "comment": "AD and EM included in 1.A.3.b i: LPG ",
                                "type": "Allocation_by_Party"
                            }
                        ]
                    }
                ]
            },
            {
                "inventory_year": "2017",
                "values": [
                    {
                        "variable_uid": "004e14ec-f26a-449c-a75b-b1b40dcd26f6",
                        "value": {
                            "type": "text",
                            "value": null
                        },
                        "comments": [
                            {
                                "comment": "solid fuels used: lignite, lignite briquettes, hard coal, hard-coal coke",
                                "type": "official_comment"
                            }
                        ]
                    },
                    {
                        "variable_uid": "003dc20b-96c9-4d0a-8617-e2fed3727178",
                        "value": {
                            "type": "NK",
                            "value": 32
                        },
                        "comments": [
                            {
                                "comment": "solid fuels used: lignite, lignite briquettes, hard coal, hard-coal coke",
                                "type": "official_comment"
                            },
                            {
                                "comment": "recovery already regarded under emissions",
                                "type": "NK_explanation"
                            }
                        ]
                    },
                    {
                        "variable_uid": "fcf03955-9688-4dab-a27b-3b6a52203afc",
                        "value": {
                            "type": "NK",
                            "value": 32
                        },
                        "comments": [
                            {
                                "comment": "AD and EM included in 1.A.3.b i: LPG ",
                                "type": "Allocation_by_Party"
                            }
                        ]
                    }
                ]
            },
            {
                "inventory_year": "2018",
                "values": [
                    {
                        "variable_uid": "004e14ec-f26a-449c-a75b-b1b40dcd26f6",
                        "value": {
                            "type": "text",
                            "value": null
                        },
                        "comments": [
                            {
                                "comment": "solid fuels used: lignite, lignite briquettes, hard coal, hard-coal coke",
                                "type": "official_comment"
                            }
                        ]
                    },
                    {
                        "variable_uid": "003dc20b-96c9-4d0a-8617-e2fed3727178",
                        "value": {
                            "type": "NK",
                            "value": 32
                        },
                        "comments": [
                            {
                                "comment": "solid fuels used: lignite, lignite briquettes, hard coal, hard-coal coke",
                                "type": "official_comment"
                            },
                            {
                                "comment": "recovery already regarded under emissions",
                                "type": "NK_explanation"
                            }
                        ]
                    },
                    {
                        "variable_uid": "fcf03955-9688-4dab-a27b-3b6a52203afc",
                        "value": {
                            "type": "NK",
                            "value": 32
                        },
                        "comments": [
                            {
                                "comment": "AD and EM included in 1.A.3.b i: LPG ",
                                "type": "Allocation_by_Party"
                            }
                        ]
                    }
                ]
            },
            {
                "inventory_year": "2019",
                "values": [
                    {
                        "variable_uid": "004e14ec-f26a-449c-a75b-b1b40dcd26f6",
                        "value": {
                            "type": "text",
                            "value": null
                        },
                        "comments": [
                            {
                                "comment": "solid fuels used: lignite, lignite briquettes, hard coal, hard-coal coke",
                                "type": "official_comment"
                            }
                        ]
                    },
                    {
                        "variable_uid": "003dc20b-96c9-4d0a-8617-e2fed3727178",
                        "value": {
                            "type": "NK",
                            "value": 32
                        },
                        "comments": [
                            {
                                "comment": "solid fuels used: lignite, lignite briquettes, hard coal, hard-coal coke",
                                "type": "official_comment"
                            },
                            {
                                "comment": "recovery already regarded under emissions",
                                "type": "NK_explanation"
                            }
                        ]
                    },
                    {
                        "variable_uid": "fcf03955-9688-4dab-a27b-3b6a52203afc",
                        "value": {
                            "type": "NK",
                            "value": 32
                        },
                        "comments": [
                            {
                                "comment": "AD and EM included in 1.A.3.b i: LPG ",
                                "type": "Allocation_by_Party"
                            }
                        ]
                    }
                ]
            },
            {
                "inventory_year": "2020",
                "values": [
                    {
                        "variable_uid": "004e14ec-f26a-449c-a75b-b1b40dcd26f6",
                        "value": {
                            "type": "text",
                            "value": null
                        },
                        "comments": [
                            {
                                "comment": "solid fuels used: lignite, lignite briquettes, hard coal, hard-coal coke",
                                "type": "official_comment"
                            }
                        ]
                    },
                    {
                        "variable_uid": "003dc20b-96c9-4d0a-8617-e2fed3727178",
                        "value": {
                            "type": "NK",
                            "value": 32
                        },
                        "comments": [
                            {
                                "comment": "solid fuels used: lignite, lignite briquettes, hard coal, hard-coal coke",
                                "type": "official_comment"
                            },
                            {
                                "comment": "recovery already regarded under emissions",
                                "type": "NK_explanation"
                            }
                        ]
                    },
                    {
                        "variable_uid": "fcf03955-9688-4dab-a27b-3b6a52203afc",
                        "value": {
                            "type": "NK",
                            "value": 32
                        },
                        "comments": [
                            {
                                "comment": "AD and EM included in 1.A.3.b i: LPG ",
                                "type": "Allocation_by_Party"
                            }
                        ]
                    }
                ]
            },
            {
                "inventory_year": "2021",
                "values": [
                    {
                        "variable_uid": "004e14ec-f26a-449c-a75b-b1b40dcd26f6",
                        "value": {
                            "type": "text",
                            "value": null
                        },
                        "comments": [
                            {
                                "comment": "solid fuels used: lignite, lignite briquettes, hard coal, hard-coal coke",
                                "type": "official_comment"
                            }
                        ]
                    },
                    {
                        "variable_uid": "003dc20b-96c9-4d0a-8617-e2fed3727178",
                        "value": {
                            "type": "NK",
                            "value": 32
                        },
                        "comments": [
                            {
                                "comment": "solid fuels used: lignite, lignite briquettes, hard coal, hard-coal coke",
                                "type": "official_comment"
                            },
                            {
                                "comment": "recovery already regarded under emissions",
                                "type": "NK_explanation"
                            }
                        ]
                    },
                    {
                        "variable_uid": "fcf03955-9688-4dab-a27b-3b6a52203afc",
                        "value": {
                            "type": "NK",
                            "value": 32
                        },
                        "comments": [
                            {
                                "comment": "AD and EM included in 1.A.3.b i: LPG ",
                                "type": "Allocation_by_Party"
                            }
                        ]
                    }
                ]
            },
            {
                "inventory_year": "2022",
                "values": [
                    {
                        "variable_uid": "004e14ec-f26a-449c-a75b-b1b40dcd26f6",
                        "value": {
                            "type": "text",
                            "value": null
                        },
                        "comments": [
                            {
                                "comment": "solid fuels used: lignite, lignite briquettes, hard coal, hard-coal coke",
                                "type": "official_comment"
                            }
                        ]
                    },
                    {
                        "variable_uid": "003dc20b-96c9-4d0a-8617-e2fed3727178",
                        "value": {
                            "type": "NK",
                            "value": 32
                        },
                        "comments": [
                            {
                                "comment": "solid fuels used: lignite, lignite briquettes, hard coal, hard-coal coke",
                                "type": "official_comment"
                            },
                            {
                                "comment": "recovery already regarded under emissions",
                                "type": "NK_explanation"
                            }
                        ]
                    },
                    {
                        "variable_uid": "fcf03955-9688-4dab-a27b-3b6a52203afc",
                        "value": {
                            "type": "NK",
                            "value": 32
                        },
                        "comments": [
                            {
                                "comment": "AD and EM included in 1.A.3.b i: LPG ",
                                "type": "Allocation_by_Party"
                            }
                        ]
                    }
                ]
            },
            {
                "inventory_year": "2023",
                "values": []
            }
        ],
        "node_comments": [
            {
                "id": "5EBA303F-F2D0-4DA5-94AA-3744561E79D0",
                "comments": [
                    {
                        "text": "2A4c: Considered insignificant according to new definition of NE",
                        "years": [
                            1990,
                            1991,
                            1992,
                            1993,
                            1994,
                            1995,
                            1996,
                            1997,
                            1998,
                            1999,
                            2000,
                            2001,
                            2002,
                            2003,
                            2004,
                            2005,
                            2006,
                            2007,
                            2008,
                            2009,
                            2010,
                            2011,
                            2012,
                            2013,
                            2014,
                            2015,
                            2016,
                            2017,
                            2018,
                            2019,
                            2020,
                            2021,
                            2022,
                            2023
                        ]
                    }
                ]
            },
            {
                "id": "5763120D-1568-4DAB-AE4A-569C0CC7EDAC",
                "comments": [
                    {
                        "text": "additionally here are allocated following emissions: NOx and NMVOC of 2.A.1 to 2.A.3, CO and SO2 of 2.A.2 and 2.A.3 with a common figure  for SO2 related to 'neue Laender' in year of reunification 1990",
                        "years": [
                            1990,
                            1991,
                            1992,
                            1993,
                            1994,
                            1995,
                            1996,
                            1997,
                            1998,
                            1999,
                            2000,
                            2001,
                            2002,
                            2003,
                            2004,
                            2005,
                            2006,
                            2007,
                            2008,
                            2009,
                            2010,
                            2011,
                            2012,
                            2013,
                            2014,
                            2015,
                            2016,
                            2017,
                            2018,
                            2019,
                            2020,
                            2021,
                            2022,
                            2023
                        ]
                    }
                ]
            }
        ]
    }
}