{
  "version": {
    "metadata_ver": "1.29.8",
    "country": "DEU",
    "metadata_type": "CRT"
  },
  "country_specific_data": {
    "variables": [],
    "nodes": [],
    "grids": [],
    "drop_downs": [],
    "line_description": [],
    "dimension_instances": []    
  },
  "data": {
    "values": [],
    "node_comments": []
  }
}