"ObjNr","ID","parent","label_en","label_de"
"64458","FOREST","","Forest land","Wald"
"64459","CROPLAND","","Cropland","Ackerland"
"64460","CROPLAND_ANNUELL","CROPLAND","Cropland annuell","Einjähriges Ackerland"
"64461","HOP","CROPLAND","Hop-growing land","Hopfenanbaufläche"
"64462","VINEYARD","CROPLAND","Vineyard","Weinanbaufläche"
"64463","ORCHARD","CROPLAND","Orchard","Obstanbaufläche"
"64464","SRC","CROPLAND","Short rotation coppice","Kurzumtriebsplantage"
"64465","TREE_NURSERY","CROPLAND","Tree nursery","Baumschulfläche"
"64466","CHRISTMAS_TREE","CROPLAND","Christmas tree nursery","Weihnachtsbaumfläche"
"64467","GRASSLAND","","Grassland","Grünland, Gehölze und Hecken"
"64468","OTHER_GRASSLAND","GRASSLAND","Other grassland","Grünland"
"64469","WOODY_GRASSLAND","GRASSLAND","Woody grassland","Gehölz"
"64470","HEDGE","GRASSLAND","Hedge","Hecke"
"64471","WETLAND","","Wetland","Feuchtgebiete, Gewässer und Torfabbau"
"64472","OTHER_WETLAND","WETLAND","Other wetland","Feuchtgebiet"
"64473","FLOODED_LAND","WETLAND","Flooded land","Gewässer"
"64474","RESERVOIR","FLOODED_LAND","Reservoir","Stehende, künstliche Gewässer"
"64475","ARTIFICIAL_FLOWING_WATER","FLOODED_LAND","Artificial flowing water body","Fließende, künstliche Gewässer"
"64476","CANAL_DOCK","FLOODED_LAND","Canal and dock","Kanal und Hafenbecken"
"64477","PEAT_EXTRACTION","WETLAND","Peat extraction land","Torfabbaugebiet"
"64478","SETTLEMENT","","Settlement","Siedlung"
"64479","BUILDING_OPEN_AREA","SETTLEMENT","Buildings and open area","Haus und Grund"
"64480","STREET","SETTLEMENT","Street","Straße"
"64508","RAILWAY","SETTLEMENT","Railways","Bahnkörper"
"64481","OTHER_LAND","","Other Land","Weiteres Land"
