Vorgang gestartet
Berechne Variable Comparison of CO2 Emissions from Fuel Combustion, Ereignis #16981 (1/5)
Berechne Variable Comparison of CO2 Emissions from Fuel Combustion, Ereignis #16985 (2/5)
Berechne Variable Comparison of CO2 Emissions from Fuel Combustion, Ereignis #16989 (3/5)
Berechne Variable Comparison of CO2 Emissions from Fuel Combustion, Ereignis #16993 (4/5)
Berechne Variable Comparison of CO2 Emissions from Fuel Combustion, Ereignis #16997 (5/5)
Datei '\\tsclient\C\Program Files\Housesoft\ZSEnext\tables\data\crf_exporter\reporter_import_files\Submission 2024\import files\1 Energy\1A(c).xml' wurde geschrieben (165 Werte).
Vorgang beendet (00:00:14.0759359)
