REGION;CATEGORY;TYPE;SUBSTANCE;TS:ID;TS:NAME;UNIT;1990;1991;1992;1993;1994;1995;1996;1997;1998;1999;2000;2001;2002;2003;2004;2005;2006;2007;2008;2009;2010;2011;2012;2013;2014;2015;2016;2017;2018;2019;2020;2021;1988;1989
PL;1A1a;EM;CO2;PL_EM_1A1a_CO2;;kt;227279,46094871455;223117,49085598093;214502,32397824462;199847,0054636124;194329,77624304808;177729,3222935221;184150,32870062938;178796,4153446348;172344,61348194655;168103,76424662373;166239,43894456915;168389,3854745078;163761,05865627152;172032,06741642638;170915,06526539594;170316,29453551536;176082,5490044689;170564,207999963;165382,71767783622;159217,41325452933;165013,54238807203;165933,258822228;161202,11657815127;162500,53570141038;153378,16583975672;154920,01605737474;155103,88745756063;156836,46227616668;155143,04957834256;141949,3060666051;131217,04926561116;151554,673644768;247984,60273886024;244579,53950337964
PL;1A1b;EM;CO2;PL_EM_1A1b_CO2;;kt;2169,1308654759537;1401,1675126263933;1906,8084727560076;1650,3173429792298;1671,8210086196834;3715,5001856693075;4015,624827367275;3484,0758027997026;3471,620493414934;3213,595264119067;3528,422928098711;3610,551640394519;3582,364820323392;3595,798990789271;3794,3658752935053;3560,9146530473063;3574,572674010294;4313,826047722303;4304,523852006935;4187,210240079112;4779,621255477479;5018,482366765631;5038,096320769035;4275,962406858741;3991,950422208629;4426,562829555607;4503,062741602177;4653,864603402919;4351,299349735107;4598,153105434255;4585,171046404927;4403,43395335691;2903,656879715692;2818,0881114134727
PL;1A1c;EM;CO2;PL_EM_1A1c_CO2;;kt;4845,867366353171;3911,2524213673632;3741,360036181823;5534,000766035365;9310,993759359639;9010,700030448812;9551,136373764597;8799,828249750279;8159,105333780876;6896,908369402033;6126,802822586922;5285,157572484745;3871,4561716654935;4153,243723870928;4425,404637962059;3774,1406406938017;3716,464280971831;4713,982001635189;4386,879578406946;3150,695004610692;3002,741807221531;3151,8345934020176;2756,907317159538;2827,808860413837;2867,6052770808824;3643,584773677593;3232,211408628755;3080,0522274521413;3131,0953994761103;3357,0449156918708;3190,840519279299;3573,6170898488326;6029,182637586602;5477,353947611354
PL;1A2a;EM;CO2;PL_EM_1A2a_CO2;;kt;16247,490219953515;13979,630533407257;13098,604678075993;13818,10528618009;15072,466893327171;18244,008789731273;16969,800972202196;17722,710548702507;14724,434429290033;12348,491800582422;14382,04699945558;11950,228160692011;11120,740461595464;11662,965351849225;12779,738238950817;9250,17888081969;9229,627829638936;10890,80401539813;7359,957095754762;4480,804386486432;5023,066961522674;5324,552765355227;5525,621504811258;5403,639633720594;5655,343976679395;5155,572568041046;5031,477115438815;5911,66225813684;5452,17612380994;4537,483381236794;3703,2303083840943;4102,953355236233;20493,110118856694;18047,86611931784
PL;1A2b;EM;CO2;PL_EM_1A2b_CO2;;kt;1052,8234238804835;982,591840903944;531,3625220375957;734,5388369305831;1300,0242632016125;1707,5196407582916;1781,35849832027;1741,599419669894;1422,781092515841;1389,4562795214945;1429,2213451597183;1499,3593888441756;1375,7410814782806;1309,7915766309668;1208,1764133403565;1055,5635392302968;1103,120426880998;1168,6422725264456;1137,7793339093223;1050,7014070116095;1038,7322695458824;1102,7307561122002;1125,528796857103;1112,7083766462947;1154,6937965258464;1187,8907194122764;1085,4046603599686;1043,94989966437;1100,924065081574;1148,2652837543942;1068,7755543248713;1095,2491370525008;1703,4204264410703;1561,1714038006078
PL;1A2c;EM;CO2;PL_EM_1A2c_CO2;;kt;4002,8258278185203;4173,206981301931;3915,6278629081244;5157,278481702311;4798,320653212207;11325,042549942462;11329,793100784236;10483,73883857288;8819,85452682734;8184,41123754972;8026,518405126652;7465,675520995059;7097,5964568733625;5467,475521484336;5465,432172927601;4925,734936085497;5161,191485930992;5198,663934160491;6239,401037011104;6354,161102088993;6710,347418072918;6596,831116631559;6480,6595983889265;6836,2523810418;6520,988654345991;5992,170125288271;5971,095578029569;6561,069475794714;6582,98880076434;6808,451789240001;6613,092338912272;6845,197344457084;4283,053319989446;4886,346975020673
PL;1A2d;EM;CO2;PL_EM_1A2d_CO2;;kt;284,4089558704218;300,868128725555;267,06757865645415;592,1220432121374;524,6051144598614;2355,1041400602066;2284,2812718188816;2503,5078140022724;2028,4800656690018;1882,3550540260337;1714,5205459897747;1711,079159737235;1593,872542926066;1618,8075640052116;1626,928289919567;1551,5309429844967;1424,330965848832;1299,3574105434484;1166,9815797518497;1235,1827029193478;1393,2915795216106;1475,6731946958116;1448,933628181091;1581,9656264215466;1591,9174317440581;1585,8032299589038;1525,8842873391732;1484,8431735107065;1304,274220091774;1473,9867005083506;1335,119813869121;1435,7413935903685;301,530954141043;318,03913860601165
PL;1A2e;EM;CO2;PL_EM_1A2e_CO2;;kt;3715,4111304105713;4021,9398107925017;3688,062328303368;6201,682755430511;6203,5641969157305;7994,506820316308;10248,966569598308;9021,384017995564;7692,177350743405;5856,834914117018;5667,215194961732;5377,577051189514;5662,155896152885;5522,442517399891;5264,582347191731;5194,489555391374;4679,4743021235645;4756,907499116564;4312,159843486116;4084,74802807176;4078,0544284985062;4035,038526608622;4189,135605753556;4025,406180227801;4000,9995687932187;3798,325887936001;3973,979398033795;4154,025395566153;4525,536601204553;4436,800005495231;4177,418501347668;4149,046120869563;3239,1152611895154;3770,129057656637
PL;1A2f;EM;CO2;PL_EM_1A2f_CO2;;kt;10339,729398507172;9822,337508103514;9456,949191031013;10209,253853292592;10881,959121397305;10739,943299674567;11388,796460820618;10736,782485781272;9705,456072702129;8588,905833880064;7842,454783290144;6778,491509437638;6242,808475252789;6633,300197494511;6968,980764075349;7093,162173700363;7245,990949670915;8528,515000786843;7641,763637044321;7201,138082183804;7780,05424315916;8567,52846130984;7645,120053866517;7215,452033615098;7560,095907895394;7334,443942987856;8147,690004251166;8724,899766783352;9374,779638553227;9573,237033079318;8977,110128520966;9200,594866620471;14287,950786891473;13855,837900439423
PL;1A2g;EM;CO2;PL_EM_1A2g_CO2;;kt;6978,703249075495;6163,551074035181;5564,846826366086;10745,221238687824;9701,15069987101;10566,71804398779;13446,356948336976;11452,094777993178;9083,81111381514;7397,648641138795;6644,936148565165;5609,815111892981;5150,557327986278;5161,033599929071;4748,0547601995295;4598,988119943518;4756,545599634658;4036,017261176286;3904,069830700137;3431,6179168279314;3379,060371545565;3222,7772039552024;2833,1607967509813;2867,4514098395302;2685,943773767633;2649,5711321046033;2643,999006841915;2853,5029529423696;2908,8168745399516;2898,341751068101;2721,975095182181;3000,627568240882;10646,733705263376;9466,178211168939
PL;1A3a;EM;CO2;PL_EM_1A3a_CO2;;kt;63,09780590699191;55,04145075047538;49,12220103993048;55,14610891943284;74,28638528092574;68,36713557038084;67,25637311327213;67,75942525734774;62,44788585983595;54,00412224490684;56,85359617286904;56,14122769087848;58,3517670883903;62,09170161884067;58,10024101635249;75,20342860285753;88,6752057267419;88,45482899130373;88,12830628728587;85,3605910280129;97,59922483311924;106,40009682331171;153,88888507668736;110,63795604695942;133,1502500201364;120,49487990451588;113,26213424848682;84,35891858313448;86,52452458393195;87,08191835069923;51,2371077067468;53,63677160229562;122,20241978022756;141,8733584369892
PL;1A3b;EM;CO2;PL_EM_1A3b_CO2;;kt;18439,909369612764;19974,623648679724;20758,006744164435;20333,03186736145;21306,276407578713;22077,078759874334;25290,721604839928;26902,828891597543;28449,605562922003;31089,77903415584;27188,34182503923;26970,28029680026;26050,229979339434;28368,389527758613;32142,6827273598;34473,16922968064;38163,79240570005;42347,59340560999;44320,9627004336;45151,92934550157;47788,504395122996;48360,03252408657;46339,17660537136;43327,15637331742;43696,39871272739;46250,32989631018;52836,928704362486;61227,111263475614;62944,237270096906;64080,973198522115;61284,43943615659;66460,49782434;20926,23168355798;22353,554981045832
PL;1A3c;EM;CO2;PL_EM_1A3c_CO2;;kt;1623,6690999999998;1168,8953999999999;820,6510999999999;802,4282;891,2240999999998;866,6135999999999;735,3687;661,0266999999999;618,6587999999999;573,534;525,7394999999999;512,9943;487,50389999999993;512,9943;512,9943;503,43539999999996;462,01349999999996;455,6409;398,28749999999997;385,02359999999993;356,14682999999997;368,98094999999995;343,31271000000004;317,64446999999996;285,55917;261,2766;261,2766;267,840378;322,3452258;267,9327807;258,30696839999996;279,92920019999997;2803,2245669999998;1266,146418
PL;1A3d;EM;CO2;PL_EM_1A3d_CO2;;kt;150,69069059582813;128,47815140060314;111,66708052045342;83,42426472668835;62,50064156646994;91,05318687913415;87,25657090886001;59,76666724179018;42,8408469870723;35,21970451879613;31,67485336928424;30,93846751995393;27,70674493310946;38,74089442096918;27,42111783298912;22,87228759823046;27,66225131065567;22,77393709157417;22,86087489212717;13,80482017453649;11,29820427633787;11,54487775373599;11,23328251612167;12,42249568926622;11,1015245720729;11,45829015654867;21,7643020062342;21,58026945657951;11,45622458334609;9,72189212941178;15,33925453821556;28,24964716407975;158,76639258136987;136,0500008589098
PL;1A3e;EM;CO2;PL_EM_1A3e_CO2;;kt;;;;;0,05023755;0,4019004;1,35641385;1,45688895;1,3061763;1,15546365;142,59550125;188,36740875;198,54429704999998;299,69381954999994;418,25443755;556,9603131000001;723,94442985;666,4781721;742,797884797962;619,1494537393081;513,4943213727421;515,2942298869036;600,6001191842529;864,02894925;848,5055463;805,7873071359444;854,3489204521665;862,0834830448172;946,9770866031844;858,3843619461402;765,4353235078703;737,1172832829267;;
PL;1A4a;EM;CO2;PL_EM_1A4a_CO2;;kt;9714,77052728191;9572,744547559967;10052,032723167184;9158,0023062384;6965,36051514854;6932,6600116189675;6364,824315773091;6637,723510001851;5269,715246192702;5617,992192363621;5520,146928098121;6005,01491400501;7969,321664323271;8359,38396186111;8117,3294587284145;7700,090836156771;8603,536319317307;8272,207287493726;8846,58617549091;9239,367456502472;10485,648773660363;9629,414287847067;9316,399974549493;8611,802467462152;7679,083041988165;7838,27343841948;8491,969544545109;7360,516677340645;6912,349825860659;6327,7249918597645;5925,614736252364;7608,877730721102;30053,43915736614;24781,652232804914
PL;1A4b;EM;CO2;PL_EM_1A4b_CO2;;kt;35222,49615577164;43376,72095062835;44529,825650798484;47375,658062784445;41929,81797481313;42073,90272171866;43277,560885857805;39482,74766254745;31881,784198263773;32788,52317568579;26762,010976054018;29290,055266002553;31090,113245436423;31109,356414459646;31805,664369194496;34390,729375844705;37856,576443177764;34603,03523331216;36044,069091187856;36813,763269333176;41245,906414734796;36208,25670630995;37946,843004294155;36958,54112430325;33921,784739859766;33478,456492224825;35649,50979301819;35916,20282403753;34305,931554995266;29887,245602728235;31113,116669914492;31457,184101399755;64057,63761927901;57679,406083364134
PL;1A4c;EM;CO2;PL_EM_1A4c_CO2;;kt;8505,032194124553;10194,766657717084;11194,56561653774;13104,037251513948;14227,255059323628;13730,189495057502;14307,521178455832;14842,617207133653;13347,222128639934;13762,00312664146;12836,420547291435;12704,303512022036;11898,262181532846;12024,082580982125;12354,531329244475;12861,91914993103;10982,07201702553;9982,45264778992;10411,296406434896;10289,702489017145;10666,323682289552;10188,63454240554;10395,79622979965;10139,400002524475;9719,928680467085;9288,796723740354;9861,781012309584;10915,979887722051;11003,412494104652;10619,988304693981;10749,786483153875;10238,652203895761;8912,638094408754;8631,113460665005
PL;1A5a;EM;CO2;PL_EM_1A5a_CO2;;kt;IE;IE;IE;IE;IE;IE;IE;IE;IE;IE;IE;IE;IE;IE;IE;IE;IE;IE;IE;IE;IE;IE;IE;IE;IE;IE;IE;IE;IE;IE;IE;IE;IE;IE
PL;1B1a;EM;CO2;PL_EM_1B1a_CO2;;kt;NE;NE;NE;NE;NE;NE;NE;NE;NE;NE;NE;NE;NE;NE;NE;NE;NE;NE;NE;NE;NE;NE;NE;NE;NE;NE;NE;NE;NE;NE;NE;NE;NE;NE
PL;1B1b;EM;CO2;PL_EM_1B1b_CO2;;kt;4186,596814473337;2786,249406724662;2786,8846526546677;2643,2273710846607;1678,4239612506644;2863,3558983040007;2444,8737747866667;3150,552903006657;2655,128204226669;3479,398512890661;3323,97106301332;2809,067016271989;2951,764751473998;3498,200330239988;2643,852602819997;2224,8276121133217;2754,1102172466576;2578,3839710419966;2409,193415639987;1709,5787365946642;2423,440643865997;2393,28921566532;2460,932022420664;2978,930649463988;2948,226557048669;2710,7837842800054;2546,217294397324;2741,3653081393345;2977,2518374793253;2627,296141220659;2339,7175335893157;2447,7003246666736;4023,194527733341;4145,096516879999
PL;1B1c;EM;CO2;PL_EM_1B1c_CO2;;kt;1,6079619384;1,4286930471;1,2176824869;1,183291263;1,0776800007;1,1915048835;0,9984583062;1,0867944699;0,8972453052;1,0287692154;1,1111703759;1,140368472;1,103804613;1,3622951988;0,9985112973;0,8135193672;1,1110114026;1,1469923595;1,1445547689;0,9238468374;1,2434361615;1,1783630907;1,0936303218;1,191239928;1,2107406528;1,3839155676;1,5067489374;1,406564081498;1,413955456763;1,360496209834;1,17226056261404;1,3811705756289;3,55871447085;3,26755840464
PL;1B2a;EM;CO2;PL_EM_1B2a_CO2;;kt;1,74728703832753;1,72458778164924;2,18219916376307;2,5631381068525;3,09541469221836;3,18253984901278;3,45499462253194;3,15091763066203;3,92333360046458;4,72837170731708;7,11087299651568;8,35023989547038;7,92637804878048;8,24642747355421;9,56563551427488;9,15804489326795;8,58533137246887;7,7925705531177;8,14208151500421;7,42660621686997;7,42519100399102;6,67649563950574;7,3609268885859;10,42828898920118;10,3044911112213;10,05539354391571;10,82369233770891;10,77800486732707;10,93893411405096;10,5290915230818;10,13722692750209;9,59408047496367;1,69930082180543;1,67396929539296
PL;1B2b;EM;CO2;PL_EM_1B2b_CO2;;kt;1,92258820125065;2,03830467830963;1,94970616974196;2,37560915522567;2,2744179077756;2,36150289893193;2,36558378917244;2,39900312899223;2,42165538683483;2,33473843917448;2,47554586047218;2,59166004039578;2,62533054458449;2,7060139078478;2,88581348066817;2,91205224130466;2,92340596299818;2,93498223261124;2,82130178830588;2,80755986632173;2,89130128914664;2,96193808856964;3,04055752512184;2,98835612178482;2,92419247380627;2,92024397833987;2,86182024466229;2,88644178440218;2,89828369470618;2,88511626183322;2,93757139880557;2,95598824315207;2,62397835965329;2,46031628621627
PL;1B2c;EM;CO2;PL_EM_1B2c_CO2;;kt;43,60349740025627;40,77289460751583;38,09334362292303;40,17314122505058;40,28146873628568;43,98010621949055;45,95531114926676;45,83165788694625;46,1556626376311;45,1400077748289;48,11854059137337;49,96736143266297;48,89546462182515;54,02515735612924;56,39702124758967;58,55661142951838;60,02172056326918;59,7527888317656;59,92866612308796;58,06932596081541;62,15612837569166;61,96060049045231;65,81097464201477;65,85643200254681;64,5029288969986;66,14494779918839;69,1096079415732;72,70012646037785;75,58737228398232;76,1168776181325;81,40797725141844;84,92989730225942;40,87440734605065;39,97196874872684
PL;1B2d;EM;CO2;PL_EM_1B2d_CO2;;kt;NA;NA;NA;NA;NA;NA;NA;NA;NA;NA;NA;NA;NA;NA;NA;1090,83;1148,86;960,93;1094,27;1093,46;991,64;1555,46;1673,65;1742,26;1674,85;1955,57;1922,99;1833,89;1767,35;1625,52;1789,68;1736,5457574999998;NA;NA
PL;2A1;EM;CO2;PL_EM_2A1_CO2;;kt;5453,461;5414,315;5538,101;5147,17;6643,182;6666,458;6218,924;6738,931;6334,246;6177,662;6114,182;4956,9381;4670,148;4565,827200000001;5070,0562;5057,14221;5983,742;7050,407;6692,9931;5757,2379;6221,4942;7379,39438;6384,3007099999995;5874,227905000001;6456,416302128734;6341,8083;6529,68473;6996,48789;7655,328031700001;7692,452490000001;7690,636449299998;7365,51782;7081,723;7267,402
PL;2A2;EM;CO2;PL_EM_2A2_CO2;;kt;2461,0296631250208;1917,4455229767732;1979,8465292803548;1973,4922831942874;1944,3103564216308;1964,8119659470215;1890,681341531982;1926,433893921631;1812,8503466423333;1729,399244220653;1725,2563866666667;1544,1355916666669;1470,318210833333;1512,1336741666667;1637,4105125;1310,1547508333333;1468,6361900000002;1605,2509708333337;1471,8623383333334;1255,4728866666667;1349,6413558333334;1542,432095;1351,7651741666666;1274,4869766666666;1372,0506216666665;1495,2414641666667;1448,0510583333335;1479,6387283333333;1426,5042816666667;1407,2155566666665;1325,5471783333332;1457,5161733333334;3471,6623455814088;3435,169421008557
PL;2A3;EM;CO2;PL_EM_2A3_CO2;;kt;169,28;163,68;155,00848000000002;162,42512;173,25248;184,09552;190,41632;217,82304000000002;244,40991999999997;238,62320000000003;256,85488;252,66912;267,71952000000005;282,51248;316,20671999999996;305,73552;330,07519999999994;347,46976;364,116;345,6;380,32;396,48;424,32;425,008;437,09449936000004;434,41148624;471,1029056;494,38774399999994;486,1681782399999;558,5163415999999;597,90526416;626,9886612799999;202,72;205,92
PL;2A4;EM;CO2;PL_EM_2A4_CO2;;kt;771,2900020172993;748,4984280754122;769,7629077116701;815,2871151934452;866,9427419774167;923,1998695233189;1014,2535113069167;1124,4105085725603;1173,8265809935333;1187,6269133922208;1348,417004062023;1354,9199568831066;1423,4000830001944;1578,2544175062294;1646,212195419027;1682,7593583697872;1750,9468670274916;1800,6111352894036;1851,1665010157283;1741,9738565824932;1898,0833646279577;2072,3193332950627;1859,6745593710718;1842,7684972282339;1835,352461119693;1817,1272494018262;1945,4826189815267;1982,6279891887666;2082,624892203861;2190,652800251907;2124,8937991093226;2464,8241210877563;849,1164732451872;844,1053123981105
PL;2B1;EM;CO2;PL_EM_2B1_CO2;;kt;2344,2565122030487;2402,200208460685;2223,1770551589098;2380,178277743375;2856,2653628453404;3270,508205907254;3260,489759111682;3432,021165327073;3204,3863712470857;2790,0813604292935;3504,9274456194144;3467,1045493333336;2546,2561813333336;3773,040656;3889,1409920000006;4095,5077034666674;3866,290014400001;3822,2905365333336;3857,891699200001;2983,5091909333337;3223,1504271999997;3393,590006400001;3681,568569066666;3643,1808922666673;3741,5386957523315;3870,484623103796;3813,59934673951;4006,8343257174415;3484,5151066443195;3349,1244137138933;3700,1072842097165;3665,4238008629145;3930,8853592705996;3943,317073304728
PL;2B3;EM;CO2;PL_EM_2B3_CO2;;kt;NA;NA;NA;NA;NA;;;;;;;;;;;;;;;;;;;NA;NA;NA;NA;NA;NA;NA;NA;NA;NA;NA
PL;2B5;EM;CO2;PL_EM_2B5_CO2;;kt;651,306;619,77;483,552;395,076;380,403;389,82;317,55;264,114;152,424;116,508;106,5654;84,096;60,663;65,043;57,34296;54,10176;46,14768;35,34878999999999;;;;;;;;;;;;;;;904,251;866,145
PL;2B7;EM;CO2;PL_EM_2B7_CO2;;kt;IE;IE;IE;IE;IE;IE;IE;IE;IE;IE;IE;IE;IE;IE;IE;IE;IE;IE;IE;IE;IE;IE;IE;IE;IE;IE;IE;IE;IE;IE;IE;IE;IE;IE
PL;2B8;EM;CO2;PL_EM_2B8_CO2;;kt;806,240131;681,6918290000001;698,845713;692,3732270000002;574,2515930000001;654,5625778000001;739,212693;779,1265670000001;782,6414170000002;682,1916280000002;799,28093;692,7073010000001;831,1490130000001;797,9550045000001;842,110227;737,1697174000001;1298,3313383000002;1388,059913;1194,0401825000001;1141,0417340000001;1112,266713;1264,9806770000002;1012,792587;1113,9814192000001;1096,5571295000002;1270,6488718;1089,2112944;1167,7450666;1135,5058153;1147,0465725000001;1166,8524689;888,050466;922,4678570000001;909,1646629999999
PL;2C1;EM;CO2;PL_EM_2C1_CO2;;kt;4958,8257335512835;3514,2284155634225;3037,413697943096;2854,005428537856;3114,766806363744;3209,826772043122;2730,5626094743925;2848,685418785674;2142,9239321836203;1901,6636978299043;2487,2080734560986;2005,1278559135562;1903,5461736070552;2081,6147806330273;2283,681511561343;1656,1887285298187;1946,983573642903;2194,110052011046;1723,283686107508;1191,9652615007242;1210,4636584171371;1570,6090032075213;1511,7681547327313;1665,2718897195448;2012,8980104089212;1875,7744588775433;1886,209314114669;1662,715936600374;2151,524972232142;1897,1496311321519;1368,4629534311655;1566,2386130637085;6816,1312325987055;5762,241093796877
PL;2C2;EM;CO2;PL_EM_2C2_CO2;;kt;354,4;240,4;144,4;172,4;216,8;281,6;287,2;309,2;300,0;250,0;223,876;194,432;167,036;370,8;334,208;260,472;52,136;234,152;224,124;38,692;212,824;290,672;312,46;294,356;251,512;311,016;310,728;262,928;254,472;262,092;246,836;293,48;328,4;332,8
PL;2C3;EM;CO2;PL_EM_2C3_CO2;;kt;78,15579999999999;77,8481;74,16760000000001;79,8014;84,1653;94,7376;88,27080000000001;91,14379999999998;92,0856;86,65579999999999;88,9695;92,82;99,96;97,308;100,1827;91,0894;95,0963;90,74430000000001;79,441;;;;;;;;;;;;;;81,124;81,26169999999999
PL;2C4;EM;CO2;PL_EM_2C4_CO2;;kt;NA;NA;NA;NA;NA;NA;NA;NA;NA;NA;NA;NA;NA;NA;NA;NA;NA;NA;NA;NA;NA;NA;NA;NA;NA;NA;NA;NA;NA;NA;NA;NA;NA;NA
PL;2C5;EM;CO2;PL_EM_2C5_CO2;;kt;33,70224;26,40352;27,92036;32,3986;31,84896;34,528;34,32;33,644;33,436;33,28;23,61424;14,98796;17,68;17,68;29,55004;32,4766;34,99496;41,63120000000001;44,67164;41,16008;47,41048;43,6982;49,81652;47,63772;44,8682;35,7708;34,18012;32,19164;33,54728;31,6368;33,75008;38,5632;47,17336;40,66347999999999
PL;2C6;EM;CO2;PL_EM_2C6_CO2;;kt;227,26532;216,83524;231,50168;256,46404;271,10295999999994;285,52;283,8;297,56;306,16;306,16;278,3562;275,45284;250,647;250,647;225,89103999999998;195,77384;189,716;218,49848;222,17584;189,66096;168,46024;188,06135999999998;229,73352000000003;230,73456;211,66320000000002;197,39924;184,2894;172,21844000000002;168,50323999999998;185,97844;175,3196;174,46820000000002;298,53352;281,61044
PL;2C7;EM;CO2;PL_EM_2C7_CO2;;kt;NA;NA;NA;NA;NA;NA;NA;NA;NA;NA;NA;NA;NA;NA;NA;NA;NA;NA;NA;NA;NA;NA;NA;NA;NA;NA;NA;NA;NA;NA;NA;NA;NA;NA
PL;2D1;EM;CO2;PL_EM_2D1_CO2;;kt;201,64320000000004;138,556;132,0704;130,3016;137,9664;136,78719999999998;117,92;127,35360000000001;181,59680000000003;173,932;205,7704;221,1;183,9552;171,5736;152,70640000000003;143,27280000000002;131,48080000000002;148,5792;140,3248;129,36;144,76;142,912;136,136;133,056;138,6;140,448;143,528;148,266888;150,109344;149,69847199999998;147,118664;148,364832;321,55214666666666;298,144
PL;2D2;EM;CO2;PL_EM_2D2_CO2;;kt;11,792;12,3816;11,792;11,2024;11,792;64,856;67,804;54,24320000000001;54,24320000000001;58,3704;56,6016;48,34720000000002;44,8096;50,11600000000001;56,01200000000001;43,6304;51,2952;68,9832;78,41680000000001;83,30666666666667;70,4;72,74666666666667;71,57333333333332;78,61333333333333;70,98666666666666;84,48;91,52;88,52976;90,76082400000003;94,727864;97,84297600000002;99,03000800000001;24,64;22,88
PL;2D3;EM;CO2;PL_EM_2D3_CO2;;kt;;;;;;;;;;;;;;;;;1,81619054210252;5,14089458519207;12,38985286326897;14,07051312310697;17,59762165777562;22,09622179862289;22,63417829771892;25,4865675469233;28,15014169014084;32,66393082036502;40,60989958453022;59,56376939489012;66,83300725352395;69,76949177984358;70,85754118340463;93,6283675687683;;
PL;2G4;EM;CO2;PL_EM_2G4_CO2;;kt;NA;NA;NA;NA;NA;NA;NA;NA;NA;NA;NA;NA;NA;NA;NA;NA;NA;NA;NA;NA;NA;NA;NA;NA;NA;NA;NA;NA;NA;NA;NA;NA;NA;NA
PL;3G;EM;CO2;PL_EM_3G_CO2;;kt;2099,375097500668;1593,2764007432995;1334,4257626844553;1305,478320573709;1197,974749414995;1503,5864785250615;1410,089329053549;1571,7501565014798;1488,5191830421056;1198,7875547462354;1095,0260062175448;1084,3499432482627;1031,7872380408126;991,9182595830862;992,4520458687168;944,896336194009;584,2783756385663;401,3564291317517;410,31124918880585;351,3824382036441;391,55241688855205;376,223082737283;336,6729721158717;419,88756958194006;467,55464933370774;373,8396743135959;663,3447847050038;504,3533198764764;526,9272186404994;541,3522003615378;836,2957087130414;871,0786034554354;1950,863825877269;2337,296915987143
PL;3H;EM;CO2;PL_EM_3H_CO2;;kt;571,1102394156636;218,2622950819672;236,81398208326019;226,2857142857143;243,57142857142858;275,0;282,8571428571429;261,27158555729983;321,7125313034989;388,1428571428571;457,1264367816093;349,4885548506392;314,38971256673443;314,7775542141739;362,5091150149155;394,1784112748239;408,5714285714286;447,85714285714283;463,5714285714286;467,22163265306114;467,17484276729556;498,6455701179554;505,8613698630138;547,8808319886094;503,0655217278168;471,24075128059195;476,14285714285717;502,46411512933446;503,1986417657046;411,40666340694855;431,32604479650377;399,1428571428571;548,7355848434926;648,3242616815327
PL;3I;EM;CO2;PL_EM_3I_CO2;;kt;236,13472203435688;154,57377049180326;122,8493889739279;163,42857142857142;205,85714285714286;240,42857142857142;259,2857142857143;261,27158555729983;300,9121521243934;368,1857142857143;296,89655172413796;232,10308604584438;252,48346308325486;267,08875475072654;253,78604574080205;252,2741832158872;259,2857142857143;286,0;282,8571428571428;270,49673469387756;262,4594070080862;314,60288335517686;298,4896281800391;315,4931757237778;298,6951535258912;263,8948207171315;273,4285714285714;298,33806835804234;314,4991511035653;169,9094667644582;191,13115951925704;141,89999999999998;217,2634737585314;259,83794515212827
PL;4A;EM;CO2;PL_EM_4A_CO2;;kt;-33793,54657002678;-26329,279598206133;-5287,668044254055;-12351,627376438;-11483,277390588926;-22117,0796013331;-39576,34450482746;-39103,343206393096;-44049,01241463477;-40755,859199160855;-37018,961349972;-29099,060176266365;-37493,48668268522;-39413,73867683987;-49855,87839228527;-49776,631099226724;-43788,42312207296;-36279,92737924995;-36680,72296077102;-36317,8168544725;-34423,723883986284;-39853,49143158336;-40325,04548802452;-42617,23628906834;-35967,70017403558;-31901,223991597853;-42762,70076583429;-40362,227992538705;-38984,68330975724;-20929,662187443195;-21663,121243724152;-22240,28406978252;-21947,3938079545;-27021,984366001976
PL;4B;EM;CO2;PL_EM_4B_CO2;;kt;1729,7522724247178;1339,0896181195099;1360,2806612968755;1381,4383317749698;1401,082998731981;1423,2751977938908;1441,3137535044582;1451,2946264544776;1466,295227750241;1482,8632539968246;1593,4753292101568;1395,049925319061;1423,4627473057428;1433,293052777607;1460,7881905009197;1563,0816281702644;1595,3407741965275;1589,5095567497654;1762,7863516911902;1644,2638615359645;1655,499265285696;1608,1190671544578;1619,3124709160395;1654,5077199907912;1666,768036722446;1632,023479776757;1664,1976423931962;1747,1112791600738;1707,7786799223973;1733,6031835570843;1736,152200107853;1699,993609064453;1654,5907822942202;1787,3113541797075
PL;4C;EM;CO2;PL_EM_4C_CO2;;kt;101,3457562536322;186,72112335354103;230,29594446747075;219,83046723962087;295,52088604124316;473,3618767053704;485,770256187847;540,2008982537437;206,7684968371012;428,39604543713455;391,94147030100817;497,6938243069241;353,8488669672946;140,5437887888721;312,45948437333266;338,50069238861704;396,6200861603754;393,94837320887586;377,6596598089227;301,20737237776757;292,0604617922165;278,32304245372626;252,12492342339823;234,55524023200337;315,9383273447998;171,3141594134546;-71,11333070119565;163,31953229354517;-124,95491850861829;-102,32964392597086;-259,7926558538015;-282,59760396170384;-193,5983763628721;-85,83039570230711
PL;4D;EM;CO2;PL_EM_4D_CO2;;kt;645,625933333334;593,6942000000007;583,9408666666673;617,637533333334;578,257533333334;655,9542000000007;629,1508666666673;582,547533333334;600,5508666666673;684,7008666666674;666,587533333334;514,9422666666671;612,859133333334;1016,7648333333343;905,0682666666676;1001,6002333333344;896,6272333333342;1088,411500000001;1034,8162000000011;914,7097666666674;1114,6644666666677;1161,3506666666676;1155,9023666666678;1290,540900000001;1224,332266666668;1336,6727000000012;1385,7987000000014;1429,5992333333345;1424,1090600000014;1422,1352933333349;1754,573700000002;1585,9059333333348;638,5734666666674;795,0690000000009
PL;4E;EM;CO2;PL_EM_4E_CO2;;kt;1608,3476180946375;1525,575394796557;1630,7943483629308;1583,7440593168337;1488,6122300596683;1365,5741319751637;1315,898797689717;1396,5516153950625;1385,5028344421642;1232,715917384853;1234,8113420600666;1153,476719026916;1088,5249219465143;1111,2265535532404;1121,1479341193576;1172,1305243678528;1324,5924721423735;1176,2236017438534;1426,4045424608748;1276,9164676683822;1322,4363163843996;1250,8522066098974;1303,3971294231237;1404,5510264416716;2176,296902671112;1881,8147960852107;5963,378486710259;2442,167509953248;2228,2545790712525;2375,83954384438;2117,4784193404776;2269,4911290744335;1701,8243964303615;1572,744889802806
PL;4G;EM;CO2;PL_EM_4G_CO2;;kt;-459,26645329858076;-320,6003847649433;-668,593284328711;-922,6552333534612;-1254,1450463705708;-942,3083368615926;-877,6405572141612;-1217,209105009434;-1603,10261591093;-2282,878610787849;-2632,8236549365233;-2349,392713671003;-2550,834841470789;-2982,275168401439;-3630,5486265019495;-3286,036620328734;-3462,504350993132;-4097,04634218154;-3646,079986111785;-3462,813598867984;-3831,274435302676;-3767,7996733529326;-3755,181868796237;-3840,30568669332;-3878,869349275284;-4007,497111825832;-4319,474321625127;-4569,044042793487;-4773,153844604726;-4565,288591382749;-4469,0509415035485;-4877,02659027389;-1205,956083255199;-855,5186534821833
PL;4H;EM;CO2;PL_EM_4H_CO2;;kt;NA;NA;NA;NA;NA;NA;NA;NA;NA;NA;NA;NA;NA;NA;NA;NA;NA;NA;NA;NA;NA;NA;NA;NA;NA;NA;NA;NA;NA;NA;NA;NA;NA;NA
PL;5C1;EM;CO2;PL_EM_5C1_CO2;;kt;340,9876745373958;304,88623685246927;289,7193320625111;286,3341490451673;287,3646702094007;291,5176751823233;295,81473481248264;295,6050391169522;315,61493878722274;261,7142028325627;335,1440514117209;323,2377028285769;336,1101989624324;265,2445468438244;197,25471691200002;215,758793712;215,08574775600005;213,2081952;166,71831038940002;155,019201282;194,28544487219997;190,50913907355002;199,30967098680003;204,50095113690008;210,21003421605;203,49861085619997;282,83527177290006;283,09235014334996;306,26824171185007;259,96695057068996;254,10002962904997;274,5609620308499;439,1409060093796;404,08108507135734
PL;5C2;EM;CO2;PL_EM_5C2_CO2;;kt;NA;NA;NA;NA;NA;NA;NA;NA;NA;NA;NA;NA;NA;NA;NA;NA;NA;NA;NA;NA;NA;NA;NA;NA;NA;NA;NA;NA;NA;NA;NA;NA;NA;NA
PL;1A1a;EM;CH4;PL_EM_1A1a_CH4;;kt;0,793346916175;0,87421731541;0,796801095695;0,74176625536;0,747912767745;0,53656799343;0,540332850715;0,53238360359;0,44177627862;0,442865931685;0,44167300794;0,472331503345;0,48385503648;0,474940704735;0,47552168264;0,48311196153;0,493935237035;0,472171611875;0,487445649965;0,47925651262;0,5037106261;0,5125862887;0,522757401765;0,501524490065;0,49012807728;0,537541779895;0,62655828772;0,71418051508;0,792881646285;0,84661146216;0,88494606544;0,93921888396203;0,80307163925;0,79547947085
PL;1A1b;EM;CH4;PL_EM_1A1b_CH4;;kt;0,2006029445;0,049485933;0,07824199494;0,04999406251;0,0563098425;0,16999055934;0,14623358736;0,1192751027;0,11541950902;0,11008871575;0,11630401365;0,11640657189;0,12125272154;0,1168639;0,1209657;0,1164252;0,1122081;0,1254882;0,1260396;0,12520067855;0,1381011785;0,1380569578;0,12814214617;0,1015536743;0,09647300499;0,11504710675;0,114906177;0,11232123057;0,1053450875;0,10977181091;0,10927925153;0,10719921014893;0,2874015824;0,2777384094
PL;1A1c;EM;CH4;PL_EM_1A1c_CH4;;kt;0,06773769258;0,06144838153;0,06366290532;0,07674427741;0,0875627534;0,07949093648;0,08347319668;0,08006060693;0,06817589624;0,061803372895;0,06416017858;0,05518396888;0,05208148658;0,05364132063;0,05885850776;0,05277896861;0,05622249611;0,060665373935;0,061444275265;0,04774656981;0,06018136713;0,05895284391;0,055181139805;0,058354417745;0,057808371715;0,07255669495;0,06314311127;0,06107800041;0,06135002724;0,064427542115;0,06169205558;0,06966554190422;0,08182033775;0,0788325067
PL;1A2a;EM;CH4;PL_EM_1A2a_CH4;;kt;0,38082846;0,52068512;0,5228815;0,57896284;0,61933159;0,70637859;0,63821961;0,62532871;0,52701572;0,46775181;0,46812508;0,37531175;0,38160629;0,39797008;0,4536411;0,30964614;0,27122003;0,23236355;0,14511108;0,1062632;0,09342721;0,13854415;0,1572858;0,15970952;0,15828361;0,1535199;0,12755481;0,174263463;0,152332158;0,08065381;0,056646102;0,07292651162593;0,57045212;0,51560233
PL;1A2b;EM;CH4;PL_EM_1A2b_CH4;;kt;0,08225544;0,07704248;0,0496275;0,07199878;0,11116458;0,17363127;0,19074988;0,18165513;0,10406714;0,10060151;0,1025073;0,10959966;0,09705339;0,09032288;0,07918482;0,06637348;0,06913591;0,07740514;0,07361909;0,06875998;0,06730302;0,07095267;0,07232305;0,0713115;0,07383364;0,07544537;0,06560528;0,058805066;0,063509971;0,068548013;0,062008658;0,06411648920618;0,14626834;0,13075674
PL;1A2c;EM;CH4;PL_EM_1A2c_CH4;;kt;0,62072575;0,6608364;0,59584908;0,71578004;0,79504947;1,42196569;1,318987;1,14859051;0,68485958;0,62749782;0,61270316;0,58637246;0,55345498;0,3896941;0,38411196;0,35998601;0,35817302;0,36581672;0,50546019;0,49634538;0,54994117;0,55331197;0,55575021;0,57781956;0,56417;0,51865004;0,52735124;0,584593719;0,568097414;0,565593573;0,527188767;0,53017814551067;0,52574781;0,63195251
PL;1A2d;EM;CH4;PL_EM_1A2d_CH4;;kt;0,0221037;0,02413038;0,02041172;0,1007376;0,09415759;0,69677695;0,71753388;0,74261143;0,69255842;0,64918114;0,64264452;0,61749013;0,6496304;0,6882245;0,71621503;0,70123269;0,70676613;0,66489855;0,68139914;0,67107008;0,69953778;0,70550966;0,72795748;0,9420684;0,93782422;0,93711649;1,02800636;1,122431588;1,178195376;1,264038237;1,308093493;0,8237350578388;0,03438595;0,03196309
PL;1A2e;EM;CH4;PL_EM_1A2e_CH4;;kt;0,36538126;0,4003063;0,36511376;0,61470031;0,59173023;0,78562298;0,96581267;0,8502371;0,71244987;0,52331557;0,49419563;0,4592043;0,4805271;0,46133343;0,43164479;0,42035046;0,36740924;0,36802998;0,32682102;0,30618152;0,31335908;0,31152591;0,31536335;0,30548838;0,30513724;0,29336084;0,30926689;0,307377368;0,321113977;0,304749121;0,280807723;0,26383141252831;0,30815548;0,36953235
PL;1A2f;EM;CH4;PL_EM_1A2f_CH4;;kt;0,94252266;0,8873148;0,8433895;0,92138586;0,99286353;0,94988456;1,02710058;0,95374127;0,82861939;0,74295454;0,65907403;0,53265553;0,46301884;0,46970711;0,50467717;0,52410673;0,61808833;0,7803872;0,69632217;0,723453;0,83038131;0,98385574;0,88766549;0,85984281;0,95345981;0,93092217;1,12087004;1,217721469;1,355218695;1,356844275;1,310657981;1,30496770294094;1,33829786;1,30146358
PL;1A2g;EM;CH4;PL_EM_1A2g_CH4;;kt;0,74421744;0,68301769;0,60456984;1,12662012;1,00050519;1,14567979;1,46937333;1,28371678;1,05755583;0,89706137;0,86102321;0,77790388;0,77873605;0,76246134;0,70851312;0,68929653;0,71848346;0,65924226;0,66366377;0,63424326;0,71550812;0,7683576;0,76084357;0,87771899;0,89940142;0,964133046;1,018883572;1,113851566;1,06086821;1,185855828;1,290260284;1,25328341941393;1,12052017;0,99416082
PL;1A3a;EM;CH4;PL_EM_1A3a_CH4;;kt;0,00044496088047;0,00038722867658;0,00034444126601;0,00038749586657;0,0005241320649;0,00048134465434;0,00047218302876;0,00047663024655;0,00043855724378;0,00037904526045;0,00039897165156;0,00039399005378;0,00040991305656;0,00043606644489;0,00040768944767;0,00052729215806;0,0006215003897;0,00062042397896;0,00061767591809;0,00059877336383;0,00068435821562;0,00074636431345;0,0010784537418;0,00077553815417;0,00093342832182;0,00084446769164;0,00079388905069;0,00059146312296;0,00060691183625;0,00061080969476;0,00035996299096;0,00037683616505;0,00086379293553;0,00100089082823
PL;1A3b;EM;CH4;PL_EM_1A3b_CH4;;kt;6,32871328788578;7,17182133627437;7,61696730288431;7,62782472141175;8,08687370647393;8,0234163484767;8,27614226233911;8,51106538645081;8,25607828178766;8,77159874725143;7,59476175021816;6,35012194093755;5,74147622602107;5,60748305033143;5,77360493634331;5,76879533835779;6,04408347283746;6,04632186871993;5,986992454018;5,6003035275418;5,14420730038867;4,80208441960043;4,42303950221032;4,00100836247549;4,62293616914631;4,85473124560198;5,11988328961807;5,4978343225025;3,94418707501333;4,01956229020219;3,56748890555666;3,65872126565694;6,4781756306838;6,98103826144989
PL;1A3c;EM;CH4;PL_EM_1A3c_CH4;;kt;0,0802163;0,0597622;0,04477715;0,04394935;0,04938575;0,0480886;0,04053525;0,0364089;0,0341815;0,032121;0,02944425;0,02873045;0,02730285;0,02873045;0,02873045;0,0281951;0,02587525;0,02551835;0,02230625;0,0215634;0,019946145;0,020664925;0,019227365;0,017789805;0,015992855;0,0146329;0,0146329;0,015000507;0,0180530727;0,01500568205;0,0144665846;0,0156775463;0,1198862215;0,0513469315
PL;1A3d;EM;CH4;PL_EM_1A3d_CH4;;kt;0,01395455015729;0,0118795956609;0,01037852739028;0,0077746604829;0,00577158857508;0,00846799371127;0,00811844587564;0,0056060910834;0,00399812837619;0,00328259851422;0,002948969137;0,00288094979668;0,00257579289962;0,00360298372231;0,00256376339336;0,00214179974;0,00258814816962;0,00213103338586;0,00213965609381;0,00129218775698;0,00106332169984;0,00108599937626;0,0010577252052;0,00116624681459;0,00104492615327;0,00108242956944;0,00205600693716;0,00203862194597;0,00108223444107;0,00091839736715;0,00144905238553;0,00266865762684;0,01471937185813;0,01257828603849
PL;1A3e;EM;CH4;PL_EM_1A3e_CH4;;kt;;;;;9e-07;7,2e-06;2,43e-05;2,61e-05;2,34e-05;2,07e-05;0,0026265;0,0035244;0,0036348;0,0055188;0,0076428;0,0101277;0,0130413;0,0120897;0,0135705;0,0113493;0,009399;0,0094287;0,0109362;0,0155514;0,0152733;0,0145074;0,0155388;0,015674094;0,017129297;0,015546159;0,01382922;0,01180477724561;;
PL;1A4a;EM;CH4;PL_EM_1A4a_CH4;;kt;1,11606318;0,98950976;1,00602495;4,70831032;4,23164271;4,15577571;3,6766763;3,3617207;3,05895217;3,13069502;3,1372567;2,37232342;2,57599351;2,60106357;2,63939138;2,65335619;2,28938008;2,52075448;2,44484702;3,12790726;3,5158869;3,36958918;3,02228972;3,23211214;2,82634632;2,97383472;3,32403598;3,2512752;3,059752595;2,906932165;3,034198405;3,62714584244232;3,66467545;2,54562105
PL;1A4b;EM;CH4;PL_EM_1A4b_CH4;;kt;99,00331359999998;121,1946289;124,5384625;154,2502929;134,7343296;133,40992859999997;138,3749674;123,025759;101,2925985;102,3213315;83,0707587;91,7455955;98,25982779999998;97,13749430000001;100,539639;107,6773835;119,35941469999999;109,76704659999999;115,57359349999999;117,9631778;133,79252309999998;120,8119875;126,17898399999999;122,8266375;112,05622;111,334223;117,013727;116,13919515;149,497517285;129,36442843;127,231767655;124,44423065029257;189,90128065000002;168,7280785
PL;1A4c;EM;CH4;PL_EM_1A4c_CH4;;kt;12,09677825309883;18,19212383735343;19,70587241892797;25,68931623149079;25,93300729237856;25,31460723869347;26,1353664;23,33796686917923;21,49144892127303;22,27974939673367;16,9862853;18,82769358844221;16,73973758877722;16,4708628241206;17,2533047979062;17,97979710770519;20,18960857018426;18,29793742294807;19,66480984472362;19,54770141951424;21,65379148794808;20,69371994242881;20,30416127156616;19,97854501139028;18,8286674578727;17,94522255795646;19,06022763534338;18,98063735818258;18,08550007494556;15,57531140288945;15,9544119127722;15,39819676536539;13,1346692479062;12,94212285184255
PL;1A5a;EM;CH4;PL_EM_1A5a_CH4;;kt;IE;IE;IE;IE;IE;IE;IE;IE;IE;IE;IE;IE;IE;IE;IE;IE;IE;IE;IE;IE;IE;IE;IE;IE;IE;IE;IE;IE;IE;IE;IE;IE;IE;IE
PL;1B1a;EM;CH4;PL_EM_1B1a_CH4;;kt;842,1748271835932;726,572728248445;729,7747110338777;687,42938;702,058495;691,585457;688,926495;697,735454;658,771135;645,188359;645,1474890000001;738,783942;696,3876150000001;710,218425;710,556373;717,534356;713,217479;697,248498;698,6544930000001;665,781278;647,94226;643,063521;640,80676;643,842329;648,039477;686,117788;683,712421;675,62580441;656,298689275;580,108524663;575,7921343510001;561,879499998;942,9396210907929;921,0773973894521
PL;1B1b;EM;CH4;PL_EM_1B1b_CH4;;kt;0,0013516;0,0011356;0,0011066;0,0010275;0,0011455;0,0011578;0,0010339;0,0010535;0,0009746;0,0008368;0,0008972;0,0008946;0,0008723;0,0010112;0,0010097;0,0008404;0,0009613;0,0010168;0,0010075;0,0007091;0,0009844;0,0009377;0,0008893;0,000936;0,0009568;0,0009792;0,0009718;0,0009418093;0,0009472769;0,0008916109;0,0007783118;0,00092837;0,0017007;0,0016499
PL;1B1c;EM;CH4;PL_EM_1B1c_CH4;;kt;4,5191106792;4,0152828573;3,4222463847;3,325591269;3,0287751741;3,3486753105;2,8061258706;3,0543910137;2,5216709076;2,8913134302;3,1228984917;3,204958536;3,102197319;3,8286744444;2,8062747999;2,2863626136;3,1224517038;3,2235746985;3,2167239507;2,5964334162;3,4946260245;3,3117408441;3,0736028934;3,347930664;3,4027366464;3,8894375988;4,2346557162;3,953090312574;3,973863467769;3,823618460142;3,29458994072052;3,8817229121307;10,00162017855;9,18333806832
PL;1B2a;EM;CH4;PL_EM_1B2a_CH4;;kt;1,40008176538909;1,32743646922183;1,5904144018583;1,7592387921022;1,9733925667828;2,00993681765389;2,18191312427411;2,07633077816492;2,44797770034844;2,81177398373984;3,86463763066202;4,35005226480836;4,1719337979094;3,18107369244771;3,79477457453045;3,70612754332632;3,46242653461675;3,44837590981435;3,3517779649184;3,36058078257778;3,45772512620069;3,37492312124948;3,551676288969;4,91671410374663;4,80458472395592;4,80505491822116;4,76063067136085;4,82050912214878;5,04159071882606;4,90037304414549;4,53959776410504;4,19026524743599;1,47442509353301;1,47357713335694
PL;1B2b;EM;CH4;PL_EM_1B2b_CH4;;kt;30,13072973860938;30,16736412089795;28,55627147587597;32,76048052781252;31,95645994045483;33,88379109243699;34,5599666080693;34,79699915543802;35,08681715329804;34,03193728160885;36,15910044106945;37,71965538014487;37,65015716816055;39,96047804168792;42,20695585178125;43,13821261299023;43,68756867546654;43,72612723388418;42,83096008715997;42,12974754350652;44,15584920906589;44,67984246052076;46,57738022652241;46,15553253954947;45,18005797283158;45,68096308545419;46,15233716929565;47,52938486372193;48,57000048435371;48,6362285755845;50,79540109194897;52,09756012887296;35,04893271248195;33,39925835981038
PL;1B2c;EM;CH4;PL_EM_1B2c_CH4;;kt;12,01088777875404;12,33097663663536;14,2584931865064;17,15280681584418;19,18865767685072;19,68550204435924;20,85434587736897;19,62492481827488;23,13237274684932;26,51474960106187;37,46016474773487;43,22994460050334;41,50058016161007;43,30365264036071;49,59079412110406;47,7553866032846;45,2705459136184;41,71553140370391;43,01199152901173;39,73805293605942;39,88983736970154;36,75492249326708;39,9475518746395;53,34432219226934;52,689183471023;51,57620425622651;54,75286016303673;54,43639266584993;55,10374162135041;53,20831656816305;51,39293809783202;48,87262197281299;14,04693115251839;13,47711919970827
PL;1B2d;EM;CH4;PL_EM_1B2d_CH4;;kt;NA;NA;NA;NA;NA;NA;NA;NA;NA;NA;NA;NA;NA;NA;NA;NA;NA;NA;NA;NA;NA;NA;NA;NA;NA;NA;NA;NA;NA;NA;NA;NA;NA;NA
PL;2B1;EM;CH4;PL_EM_2B1_CH4;;kt;NA;NA;NA;NA;NA;NA;NA;NA;NA;NA;NA;NA;NA;NA;NA;NA;NA;NA;NA;NA;NA;NA;NA;NA;NA;NA;NA;NA;NA;NA;NA;NA;NA;NA
PL;2B8;EM;CH4;PL_EM_2B8_CH4;;kt;1,598836022;1,26549606;1,221183052;1,198565814;1,064858804;1,3097843836;1,391620582;1,45438801;1,457471398;1,29337277;1,46429419;1,348847066;1,56230539;1,460222995;1,544467318;1,3896800888;2,2999446246;2,369889728;2,080220233;2,0973657;2,03420614;2,224753054;1,861611698;1,9927795344;1,935543147;2,0231733656;1,4804340088;2,0239405472;1,9394531986;2,050587439;1,9133716678;1,609285724;1,737113752;1,705139464
PL;2C1;EM;CH4;PL_EM_2C1_CH4;;kt;0,82456087;0,60288676;0,60351781;0,53397596;0,61511954;0,60525969;0,58230025;0,62865495;0,48175043;0,45331489;0,5655104;0,51469306;0,53318209;0,54125442;0,60133906;0,43178499;0,483547666;0,486776514;0,44144576;0,305378745;0,408607563;0,455892598;0,46707311;0,479796359;0,517260653;0,520090249;0,479532438;0,48945274;0,471691962;0,452758166;0,3423027335;0,35147;0,9875124;0,9094729
PL;2C2;EM;CH4;PL_EM_2C2_CH4;;kt;0,0886;0,0601;0,0361;0,0431;0,0542;0,0704;0,0718;0,0773;0,075;0,0625;0,055969;0,048608;0,041759;0,0927;0,083552;0,065118;0,013034;0,058538;0,056031;0,009673;0,053206;0,072668;0,078115;0,073589;0,062878;0,077754;0,077682;0,065732;0,063618;0,065523;0,061709;0,07337;0,0821;0,0832
PL;2C7;EM;CH4;PL_EM_2C7_CH4;;kt;NA;NA;NA;NA;NA;NA;NA;NA;NA;NA;NA;NA;NA;NA;NA;NA;NA;NA;NA;NA;NA;NA;NA;NA;NA;NA;NA;NA;NA;NA;NA;NA;NA;NA
PL;2D1;EM;CH4;PL_EM_2D1_CH4;;kt;NA;NA;NA;NA;NA;NA;NA;NA;NA;NA;NA;NA;NA;NA;NA;NA;NA;NA;NA;NA;NA;NA;NA;NA;NA;NA;NA;NA;NA;NA;NA;NA;NA;NA
PL;2D2;EM;CH4;PL_EM_2D2_CH4;;kt;NA;NA;NA;NA;NA;NA;NA;NA;NA;NA;NA;NA;NA;NA;NA;NA;NA;NA;NA;NA;NA;NA;NA;NA;NA;NA;NA;NA;NA;NA;NA;NA;NA;NA
PL;2G4;EM;CH4;PL_EM_2G4_CH4;;kt;NA;NA;NA;NA;NA;NA;NA;NA;NA;NA;NA;NA;NA;NA;NA;NA;NA;NA;NA;NA;NA;NA;NA;NA;NA;NA;NA;NA;NA;NA;NA;NA;NA;NA
PL;3A1;EM;CH4;PL_EM_3A1_CH4;;kt;705,6936387971814;633,6536765913319;583,7843307107366;547,2770451202537;547,3347187701571;514,4903189399228;507,3499017697564;523,0517911011655;510,17834154661585;486,9895120568886;452,37780725441485;435,98779875925743;422,32686776510417;423,7780652149525;415,70719098486563;424,54219283045796;436,21528941683135;443,76422647159205;448,27397169097105;443,8724584066013;443,87130873883365;446,7121130714818;451,5030731273363;455,400740321867;457,564795437598;463,15633507176415;457,2523828814623;472,8730819640251;479,74668715068447;485,67114498598767;492,6218071686815;498,9985404128816;717,9179048064789;747,952132027711
PL;3A2;EM;CH4;PL_EM_3A2_CH4;;kt;15,10189371089154;12,65023866268236;11,80223826609279;11,01879264154399;11,56967666852884;11,32829382991142;11,24239620522685;11,8001282576105;8,01491942995791;8,12881204221808;6,66310794898903;6,08643164068337;4,12888185701609;6,67223016992671;7,15781566716273;6,31127422684372;7,50257557319093;8,28393720042195;6,97081551087965;8,30264721795458;7,77396292781699;9,58384950388263;12,5555525190557;12,31269819773956;12,13024151641922;8,38661778690575;7,79485330590305;10,42368858578387;10,87498493293347;10,11730516469117;9,98500603085995;9,94800256251479;16,09625752035101;16,70654216567238
PL;3A3;EM;CH4;PL_EM_3A3_CH4;;kt;17,07187336669725;14,21070536132166;13,20306020721288;12,21324703932808;12,81073917205341;12,44392050361138;12,27856823728568;12,78473641670081;12,91674187954375;13,03778410029957;10,61720608768959;9,64334734026984;6,51454043631041;10,49557540669018;11,25568808148814;9,52421504557621;10,45043285795035;12,40385721852089;12,33797360414492;11,19695174305288;12,99547542468949;11,41011467722472;11,23237144220061;8,35084433677674;12,17004863692715;10,41797021477322;10,06217208484936;10,72021251000238;10,55981168498239;11,27259735469745;11,10341735227568;11,75791290100486;18,44892118314589;19,18503773908188
PL;3A4;EM;CH4;PL_EM_3A4_CH4;;kt;98,2598415232331;84,56055756403211;77,80276671212293;72,93146532653245;76,7281987484717;73,13284296212403;72,7914991234078;76,21977495500238;69,25846269296775;64,29194353958727;61,55949862911954;57,70686362088758;54,30497021737129;52,95986593493406;51,31980706449688;56,03129362322399;56,24264721658587;57,97986220991236;59,32559762700903;58,35101896089652;57,81419435505189;58,99551034103253;58,48982187306404;63,25135984277232;64,24986039178654;66,73134031169239;69,33972216021054;69,11467510423206;68,65897226040542;69,45867680218257;69,59395189239608;72,82813026547556;108,13609078997331;113,25617805458221
PL;3B;EM;CH4;PL_EM_3B_CH4;;kt;83,5032409045205;84,99785457461518;81,69247718880355;72,74460746583492;73,6811304211749;73,06653826641359;67,38059185684484;68,63468336951685;70,35823232059958;69,80261263154733;65,50484165983194;64,9974198749209;70,24962857382222;70,91036978103585;68,69443466355595;72,92940254897441;72,74546750433502;70,83500834584633;64,13730711553762;60,06765088203751;58,46674503230943;55,75235624617184;52,34420101348465;51,3646237124066;52,2212582270649;51,61793118927164;49,16627719616032;49,98312907548947;50,4440627972404;48,76128496231658;50,59420890506796;49,49999399588608;85,87838331891462;88,2963738913857
PL;3D;EM;CH4;PL_EM_3D_CH4;;kt;NA;NA;NA;NA;NA;NA;NA;NA;NA;NA;NA;NA;NA;NA;NA;NA;NA;NA;NA;NA;NA;NA;NA;NA;NA;NA;NA;NA;NA;NA;NA;NA;NA;NA
PL;3F;EM;CH4;PL_EM_3F_CH4;;kt;0,80379165784669;0,78121431434867;0,6794191546722;0,81016271491012;0,6817113234082;0,79714717084487;0,77527670449256;0,74727983471989;0,8255544527962;0,7561802024747;0,70843131941687;0,83181853341061;0,75881300912269;0,72332857098316;0,89232224116084;0,77060053439146;0,74712286350325;0,73726879246242;0,91558175522643;0,98494711286181;0,85025161792956;0,84103237114344;0,88380655351526;0,97106873392333;1,05940715070071;0,95249874099293;0,99208146204693;0,93362216992448;0,98327655242931;0,91749337051503;1,09828741616731;1,13218943957766;0,81569013460295;0,86940718145093
PL;4A;EM;CH4;PL_EM_4A_CH4;;kt;1,69503862783546;0,61000457802354;10,26368069215283;1,81313366036921;1,92871759027219;1,13055965158115;3,04295371420595;1,40653590757415;0,86353355900983;1,72445114954981;1,46906071824296;0,70957370419289;1,08312397714982;4,44361690926514;0,79452432466412;1,2071129783362;1,22680600402268;0,72961621656426;0,6299256901995;0,91916678023851;0,46813372276633;0,61725757411484;1,59552040072257;0,3280624284828;0,63642914275409;1,28898269515041;0,34763581417964;0,24997125234402;0,65503725845873;0,89128537739047;2,067906194803;0,22829567622578;1,69357449169641;1,69469043222827
PL;4C;EM;CH4;PL_EM_4C_CH4;;kt;0,273997404;0,273997404;0,273997404;0,273997404;0,273997404;0,396430524;0,138742308;0,190913436;0,094931352;0,196380288;0,071251812;0,082962144;0,139214376;0,208897704;0,13255974;0,126605592;0,274088772;0,040978548;0,161325432;0,031323996;0,039455748;0,038130912;0,043338888;0,060120144;0,078515568;0,060135372;0,148838472;0,032572692;0,066561588;0,104403168;0,03761316;0,046993608;0,273997404;0,273997404
PL;4H;EM;CH4;PL_EM_4H_CH4;;kt;NA;NA;NA;NA;NA;NA;NA;NA;NA;NA;NA;NA;NA;NA;NA;NA;NA;NA;NA;NA;NA;NA;NA;NA;NA;NA;NA;NA;NA;NA;NA;NA;NA;NA
PL;5A1;EM;CH4;PL_EM_5A1_CH4;;kt;257,921743949995;252,86199804501098;244,48371285997712;233,93868537787964;222,8244499486375;212,88842804754563;201,77369801394042;192,07048486644882;187,66865856045442;179,05076935511923;159,09841392386775;144,2286634138996;131,04951728556978;115,5443649604612;106,47390172371881;97,56191405667195;85,85044984480663;75,13912095278168;56,81828728657979;48,95759252387256;36,81109602774796;21,88379393815544;80,56160484772445;58,90133153823142;65,9056641634642;52,68850640386741;50,28519322227558;53,0477071418842;55,58682282933934;48,07620714760152;38,74451176806698;36,42678103186995;263,46454482334167;261,3728221717793
PL;5A2;EM;CH4;PL_EM_5A2_CH4;;kt;223,11904941535747;223,15617154057705;221,08787660984459;218,1121116191027;214,23349604272494;210,2536487085816;205,34153450790646;200,6419114579509;195,89067072322544;190,30484840467915;184,0410220351597;176,94074411513864;167,76901133751738;157,7584435381753;147,2037070221484;135,73196436287486;124,91578342862583;114,6291539309141;105,42923329754991;97,18777285490873;89,82606602834855;83,1781445607559;8,4560864834892;24,60583549999403;10,0306396757705;15,17887090720839;4,74104768233051;3,47453990268122;2,62899158188348;2,85252697938967;1,54921997177114;1,50777490072202;213,34560604502954;219,3542849170549
PL;5A3;EM;CH4;PL_EM_5A3_CH4;;kt;41,12658725194631;40,72676353138115;40,14254656691718;39,42062262544218;38,57856808551343;37,64393309337248;36,60805907026071;35,50366764678002;34,32929900418311;33,07646954862418;31,75110352469878;30,35737983357876;28,8852337503526;27,35469815894094;25,77439009443222;24,15625643032073;22,55733788705873;20,87141977332376;19,36484790046994;18,03205911013856;16,83790995965919;15,76903975737968;14,84095069466685;14,02274911939771;13,27361177884951;12,42753347926988;11,65321406784942;10,9425969932939;10,28873120407289;9,68560183995526;9,12798824052691;8,61134475730377;41,22536507374279;41,28851297009228
PL;5B1;EM;CH4;PL_EM_5B1_CH4;;kt;0,50822071262236;1,36755084979444;1,18779304564308;1,14684025026333;1,7656982793382;1,00098947278456;1,06988863768194;1,14363631884097;1,217384;1,288;1,288;1,5804;1,1904;0,9768;1,5688;2,15;1,6511116;1,756279996;1,793047668;1,818546164;2,044641964;2,241663204;4,9411063332;4,92692744000001;5,969929964;6,5753688548;5,6570539564;5,7029570764;5,78140335199999;6,7284102116;7,03988724119999;7,5463263696;0,6512480431891;1,1104073247116
PL;5C2;EM;CH4;PL_EM_5C2_CH4;;kt;NA;NA;NA;NA;NA;NA;NA;NA;NA;NA;NA;NA;NA;NA;NA;NA;NA;NA;NA;NA;NA;NA;NA;NA;NA;NA;NA;NA;NA;NA;NA;NA;NA;NA
PL;5D1;EM;CH4;PL_EM_5D1_CH4;;kt;64,53842201000295;80,77448203686245;99,5925816556058;117,62875392518436;105,56771621958332;109,21525910301887;108,4150035707095;99,90147122041596;96,05804320810627;86,63181674730811;85,37432051571761;83,33045543866243;83,49558779761051;96,52523653355624;94,03682278641344;91,96038983531153;88,94079610099115;91,96320173021921;101,10051387634851;101,4111749477287;108,27552224314442;97,69325632189013;86,91116262100451;85,30117781559625;73,92839379592951;68,33487686616118;66,45953864234218;69,2825914197204;67,16235871677128;68,65630105738519;64,20117275782478;62,94077038093653;63,75058943147503;68,53260801521844
PL;5D2;EM;CH4;PL_EM_5D2_CH4;;kt;25,06115322740126;22,4274009882752;20,97549388319587;19,54252255124612;14,50623338695118;14,26985115137989;12,41202368064242;11,95938772951782;11,90906679053267;10,80963200912045;10,47959373945932;9,10333389825104;8,92056842192264;9,10871032102791;9,28155105698231;9,19802839276089;9,06403628396486;9,27944393298582;9,33042150735041;9,38820671608215;9,50928335194581;9,55866988506249;9,94144906566846;9,93129703220368;10,36591283031811;9,93901101832957;10,24156401219542;11,04372948569283;11,01712594823917;10,86036463665613;11,07472117745105;11,00943111664658;29,4585458854673;29,30853350170094
PL;5D3;EM;CH4;PL_EM_5D3_CH4;;kt;NA;NA;NA;NA;NA;NA;NA;NA;NA;NA;NA;NA;NA;NA;NA;NA;NA;NA;NA;NA;NA;NA;NA;NA;NA;NA;NA;NA;NA;NA;NA;NA;NA;NA
PL;1A1a;EM;N2O;PL_EM_1A1a_N2O;;kt;3,3635631365;3,351947375;3,2417222255;3,0081293585;2,9078578405;2,649356125;2,761139486;2,6780259905;2,576724749;2,505676752;2,469863346;2,501356499;2,423211087;2,54176001;2,5270130645;2,5646259265;2,6550242605;2,603860135;2,5562833375;2,5423684625;2,655983067;2,703277258;2,7302579805;2,6798530075;2,5667132745;2,5703821905;2,496193163;2,4499162831;2,424267294;2,2878715696;2,1626383522;2,46169526181223;3,642094873;3,593192937
PL;1A1b;EM;N2O;PL_EM_1A1b_N2O;;kt;0,028828445;0,008606576;0,013385641;0,0092746415;0,009639055;0,030716591;0,029706164;0,024194625;0,022529773;0,0204771975;0,0209650425;0,0210008585;0,021755091;0,02072946;0,02104925;0,02024715;0,01926113;0,02155578;0,02175714;0,0221691075;0,023843145;0,023116985;0,020086883;0,0151693775;0,014646876;0,0200428388;0,0196312032;0,0182035516;0,0170492848;0,017279943;0,016988123;0,01713827814169;0,041112218;0,039606926
PL;1A1c;EM;N2O;PL_EM_1A1c_N2O;;kt;0,023638169;0,019439977;0,0169825495;0,046073783;0,0972253935;0,098505482;0,1039045435;0,0913936585;0,0864585335;0,0712502339;0,0574716495;0,0520850015;0,030839139;0,0353198145;0,0358214174;0,0294392045;0,025851334;0,0399136585;0,0343639045;0,0229161465;0,0133638045;0,0166267345;0,0112802045;0,010536388;0,010510556;0,012292655;0,012173143;0,011324201;0,0124096672;0,0137891352;0,0113680528;0,01212133306464;0,029706675;0,02476009
PL;1A2a;EM;N2O;PL_EM_1A2a_N2O;;kt;0,050899719;0,071654358;0,07222131;0,081727686;0,0875773485;0,1004288435;0,0915324815;0,0901582065;0,075423798;0,0674148615;0,066869152;0,0532886975;0,0544886335;0,056831642;0,06487439;0,043814496;0,0379481645;0,0315615225;0,019297382;0,014337785;0,0121477915;0,0189425975;0,021777655;0,022195278;0,0219087315;0,02138498;0,0174052465;0,024139125;0,0208321554;0,0102958559;0,0068170364;0,00908146390963;0,079015549;0,0711103
PL;1A2b;EM;N2O;PL_EM_1A2b_N2O;;kt;0,011988496;0,011201637;0,0072577;0,010473442;0,016137197;0,0248322305;0,027209967;0,0259047645;0,015324426;0,0148093615;0,01508767;0,016124764;0,0142251435;0,013193547;0,011559553;0,009668817;0,0100628915;0,011273991;0,0107027035;0,010015102;0,009793178;0,0103008005;0,0104994025;0,01035031;0,010699221;0,0109247555;0,009478032;0,0084675895;0,0091206949;0,0098926994;0,0089144819;0,00920170778601;0,02128403;0,01906207
PL;1A2c;EM;N2O;PL_EM_1A2c_N2O;;kt;0,0849219125;0,089800355;0,080864307;0,098036281;0,1083442055;0,2034583935;0,190445495;0,1660825265;0,104379737;0,095349988;0,092235444;0,088091144;0,083161022;0,058253685;0,057197539;0,0534507915;0,053046458;0,053964738;0,0748281635;0,073436192;0,0813097455;0,0819187955;0,0823972765;0,085403814;0,083183855;0,076468326;0,077945101;0,0859756183;0,0837567753;0,0832136438;0,0773041395;0,07750740427995;0,072928303;0,087558408
PL;1A2d;EM;N2O;PL_EM_1A2d_N2O;;kt;0,00350775;0,003808022;0,003264338;0,01455537;0,0135286735;0,0971608675;0,099731082;0,1034020845;0,095975813;0,089872116;0,088656398;0,0852726895;0,089359;0,094478235;0,0981416545;0,0960626785;0,0964783545;0,0905240575;0,092395506;0,091106352;0,095161362;0,096172309;0,098983102;0,12766002;0,126976068;0,1268719835;0,138757699;0,1511452469;0,1582583352;0,1698120655;0,1754754498;0,11105879028474;0,005172915;0,004868106
PL;1A2e;EM;N2O;PL_EM_1A2e_N2O;;kt;0,055108164;0,060282735;0,054945354;0,0926661165;0,0891412245;0,118691332;0,1453324605;0,128005025;0,1077188405;0,0794498155;0,0750456845;0,069736215;0,07284312;0,0697165145;0,0650936285;0,063294164;0,055121931;0,055077852;0,048734558;0,045426853;0,046284332;0,0458703465;0,0465025025;0,044676797;0,044453921;0,042354666;0,0445768085;0,0443238509;0,0459831647;0,0437615374;0,0402184386;0,03770001747724;0,046701266;0,055786598
PL;1A2f;EM;N2O;PL_EM_1A2f_N2O;;kt;0,140036749;0,132016595;0,12569074;0,137496409;0,1484367495;0,142080884;0,153413987;0,1429776005;0,1242493685;0,111124831;0,0980089795;0,0787742445;0,068289291;0,0694799815;0,0741743005;0,0768152945;0,0884224895;0,11174801;0,0992355005;0,101151885;0,1154617615;0,136632386;0,1225248485;0,1180730065;0,1304150315;0,1270590855;0,152159206;0,1653981948;0,183977151;0,1838556309;0,1770598742;0,17615805372418;0,198989017;0,193497508
PL;1A2g;EM;N2O;PL_EM_1A2g_N2O;;kt;0,109859716;0,1008167585;0,088951381;0,167224388;0,1484149235;0,1696176735;0,2184725445;0,190299277;0,1553324095;0,1310402305;0,1243205815;0,111448817;0,1105396775;0,108034311;0,100066763;0,0972685145;0,100962154;0,092324114;0,0921712705;0,087832029;0,098615018;0,105514415;0,1038553055;0,1189701885;0,121918823;0,1305185722;0,1375660244;0,1502710908;0,1432118467;0,1598729608;0,173478987;0,16863676389348;0,165410105;0,146713252
PL;1A3a;EM;N2O;PL_EM_1A3a_N2O;;kt;0,00177984352187;0,00154891470631;0,00137776506405;0,00154998346628;0,00209652825961;0,00192537861735;0,00188873211506;0,00190652098622;0,0017542289751;0,00151618104182;0,00159588660623;0,00157596021513;0,00163965222625;0,00174426577955;0,00163075779067;0,00210916863225;0,00248600155879;0,00248169591584;0,00247070367237;0,00239509345533;0,00273743286246;0,0029854572538;0,00431381496718;0,0031021526167;0,00373371328728;0,00337787076656;0,00317555620275;0,00236585249184;0,00242764734501;0,00244323877904;0,00143985196383;0,0015073446602;0,0034551717421;0,00400356331292
PL;1A3b;EM;N2O;PL_EM_1A3b_N2O;;kt;0,55144770428802;0,60517946318109;0,72144164282144;0,83631064699062;1,12719184531796;1,44590255531872;1,86255853418031;2,15471893699699;2,506059100718;3,11785002219655;2,97014691030608;3,02184252163921;2,8152336599857;1,39865979048591;1,50085395688709;1,51707400136857;1,63092281012468;1,74182190045678;1,74763941642489;1,49551908491901;1,60036644108631;1,63137793215605;1,56372492427757;1,46840235067327;1,525496165167;1,60708255409129;1,82611617565418;2,15215419333179;2,20092206267904;2,24718264349264;2,18414257092361;2,48539888164456;0,62454842083603;0,66197522277704
PL;1A3c;EM;N2O;PL_EM_1A3c_N2O;;kt;0,5138907;0,3911458;0,3042856;0,2992809;0,338429;0,3297844;0,276993;0,2486911;0,233869;0,221364;0,202917;0,1979978;0,1881594;0,1979978;0,1979978;0,1943084;0,178321;0,1758614;0,153725;0,1486056;0,13746018;0,1424137;0,13250666;0,12259962;0,11021582;0,1008436;0,1008436;0,103376988;0,1244139468;0,1034126522;0,0996974264;0,1080428492;0,691430116;0,282808141
PL;1A3d;EM;N2O;PL_EM_1A3d_N2O;;kt;0,00398701433065;0,00339417018882;0,00296529354008;0,00222133156655;0,00164902530716;0,00241942677466;0,00231955596447;0,00160174030954;0,00114232239319;0,00093788528978;0,00084256261058;0,00082312851334;0,00073594082847;0,00102942392066;0,00073250382667;0,00061194278286;0,0007394709056;0,00060886668167;0,00061133031252;0,000369196502;0,00030380619995;0,00031028553607;0,00030220720148;0,0003332133756;0,0002985503295;0,00030926559127;0,00058743055347;0,00058246341313;0,00030920984031;0,00026239924776;0,00041401496729;0,00076247360767;0,00420553481661;0,003593796011
PL;1A3e;EM;N2O;PL_EM_1A3e_N2O;;kt;;;;;9e-08;7,2e-07;2,43e-06;2,61e-06;2,34e-06;2,07e-06;0,00027555;0,00037863;0,00037677;0,00057807;0,00079047;0,00103896;0,00131703;0,00123516;0,00136995;0,00116142;0,00095289;0,00095586;0,00110661;0,00156813;0,00154032;0,00146364;0,00156678;0,0015800385;0,0017129297;0,0015557511;0,0013830768;0,00118067122456;;
PL;1A4a;EM;N2O;PL_EM_1A4a_N2O;;kt;0,136538917;0,136781629;0,1421013475;0,179138568;0,1432533865;0,1399460615;0,12050998;0,112714105;0,0843986205;0,084979063;0,079869965;0,065457823;0,0863331015;0,0864211755;0,084018992;0,0823568385;0,087682252;0,084733772;0,087960958;0,100372664;0,11468897;0,105586142;0,098411188;0,096197551;0,085284408;0,086035003;0,092803932;0,0908271654;0,0850304591;0,0753259838;0,077780888;0,09409250779161;0,452097051;0,366716783
PL;1A4b;EM;N2O;PL_EM_1A4b_N2O;;kt;0,6028688355;0,6945627295;0,7207105425;1,047879712;0,9478244955;0,942654903;0,957561837;0,881360505;0,77474437;0,76620068;0,673457331;0,74344099;0,776393479;0,7675606065;0,784254615;0,812693625;0,880872161;0,824146673;0,852247755;0,862485179;0,966328218;0,906069345;0,937424585;0,920527445;0,83704995;0,84092831;0,877819265;0,869717878;1,3564645942;1,2109247191;1,1595779986;1,15990291025585;1,043292218;0,934559985
PL;1A4c;EM;N2O;PL_EM_1A4c_N2O;;kt;1,52780330794305;1,50428540938108;1,75604786578727;2,26818027062396;2,44094484731575;2,55185500239699;2,820814022;3,23704219413401;2,94766479469012;3,01905676499246;3,2990218415;3,09914152405025;3,07845191917923;3,11097417728643;3,17314577794389;3,2436388319665;2,45700108602093;2,25959456033501;2,26761681821859;2,20499798874622;2,2251116386608;2,24453371576884;2,25080234458542;2,20251946898492;2,12219170397487;2,09718542880654;2,22106734419849;2,62407852812261;2,7543218513;2,84221948494305;2,87303898432345;2,89258065347168;1,5033435699732;1,45486823874205
PL;1A5a;EM;N2O;PL_EM_1A5a_N2O;;kt;IE;IE;IE;IE;IE;IE;IE;IE;IE;IE;IE;IE;IE;IE;IE;IE;IE;IE;IE;IE;IE;IE;IE;IE;IE;IE;IE;IE;IE;IE;IE;IE;IE;IE
PL;1B1a;EM;N2O;PL_EM_1B1a_N2O;;kt;NA;NA;NA;NA;NA;NA;NA;NA;NA;NA;NA;NA;NA;NA;NA;NA;NA;NA;NA;NA;NA;NA;NA;NA;NA;NA;NA;NA;NA;NA;NA;NA;NA;NA
PL;1B1b;EM;N2O;PL_EM_1B1b_N2O;;kt;NA;NA;NA;NA;NA;NA;NA;NA;NA;NA;NA;NA;NA;NA;NA;NA;NA;NA;NA;NA;NA;NA;NA;NA;NA;NA;NA;NA;NA;NA;NA;NA;NA;NA
PL;1B1c;EM;N2O;PL_EM_1B1c_N2O;;kt;NA;NA;NA;NA;NA;NA;NA;NA;NA;NA;NA;NA;NA;NA;NA;NA;NA;NA;NA;NA;NA;NA;NA;NA;NA;NA;NA;NA;NA;NA;NA;NA;NA;NA
PL;1B2a;EM;N2O;PL_EM_1B2a_N2O;;kt;NA;NA;NA;NA;NA;NA;NA;NA;NA;NA;NA;NA;NA;NA;NA;NA;NA;NA;NA;NA;NA;NA;NA;NA;NA;NA;NA;NA;NA;NA;NA;NA;NA;NA
PL;1B2c;EM;N2O;PL_EM_1B2c_N2O;;kt;0,00083969934951;0,00080399702649;0,00079228120669;0,00087007655324;0,00090270698219;0,00096586769651;0,00101271671955;0,0009919114345;0,0010503327083;0,00108617292512;0,00129827364055;0,00141522422687;0,00137277825073;0,00147760242916;0,00161053861897;0,00161445180719;0,00159734579786;0,00153839058918;0,00156020110561;0,00148255739698;0,00154504752361;0,00149399994119;0,00160039876339;0,00180671970816;0,00177592386351;0,00178195070871;0,00187536591133;0,00192412335466;0,00197637234993;0,0019552290234;0,002007392479;0,00202196649675;0,00083405410605;0,0008109452975
PL;1B2d;EM;N2O;PL_EM_1B2d_N2O;;kt;NA;NA;NA;NA;NA;NA;NA;NA;NA;NA;NA;NA;NA;NA;NA;NA;NA;NA;NA;NA;NA;NA;NA;NA;NA;NA;NA;NA;NA;NA;NA;NA;NA;NA
PL;2B1;EM;N2O;PL_EM_2B1_N2O;;kt;NA;NA;NA;NA;NA;NA;NA;NA;NA;NA;NA;NA;NA;NA;NA;NA;NA;NA;NA;NA;NA;NA;NA;NA;NA;NA;NA;NA;NA;NA;NA;NA;NA;NA
PL;2B2;EM;N2O;PL_EM_2B2_N2O;;kt;10,204484;9,305154;8,982301;10,401172;11,002235;12,490335;12,481277;11,700995;10,810076;10,581685;12,98763861;13,3282;10,927183;13,136688;13,4871032;14,10860237135615;14,01670515926416;14,588347042681;12,24711476746666;2,80882727598798;2,9572229488815;2,61556809931716;2,98196484413223;2,09752732454018;1,65009176921027;1,73358699081963;2,03708504924249;1,57928320407363;1,70304652671387;1,52734808147873;1,2968029105884;1,59629988784847;14,14989;14,072897
PL;2B3;EM;N2O;PL_EM_2B3_N2O;;kt;1,2;0,7782;0,9261;0,9615;0,324;;;;;;;;;;;;;;;;;;;;;;;;;;;;1,5;1,8
PL;2B4;EM;N2O;PL_EM_2B4_N2O;;kt;0,46114512;0,49131048;0,49618794;0,48902106;0,50373876;0,59854824;0,60562506;0,61759356;0,6224094;0,66164712;0,69641502;0,704364;0,724746;0,72224963286032;0,7085826;0,75713442;0,75701592;0,74703348;0,68659848;0,68717676;0,75511518;0,77756856;0,7725963;0,75800184;0,79442874;0,4446765;0,246639;0,1340256;0,1329176;0,1498644;0,0946494;0,1359904;0,45796458;0,47436972
PL;2C7;EM;N2O;PL_EM_2C7_N2O;;kt;NA;NA;NA;NA;NA;NA;NA;NA;NA;NA;NA;NA;NA;NA;NA;NA;NA;NA;NA;NA;NA;NA;NA;NA;NA;NA;NA;NA;NA;NA;NA;NA;NA;NA
PL;2D1;EM;N2O;PL_EM_2D1_N2O;;kt;NA;NA;NA;NA;NA;NA;NA;NA;NA;NA;NA;NA;NA;NA;NA;NA;NA;NA;NA;NA;NA;NA;NA;NA;NA;NA;NA;NA;NA;NA;NA;NA;NA;NA
PL;2D2;EM;N2O;PL_EM_2D2_N2O;;kt;NA;NA;NA;NA;NA;NA;NA;NA;NA;NA;NA;NA;NA;NA;NA;NA;NA;NA;NA;NA;NA;NA;NA;NA;NA;NA;NA;NA;NA;NA;NA;NA;NA;NA
PL;2G3;EM;N2O;PL_EM_2G3_N2O;;kt;0,40419284259761;0,40628926389641;0,40838568519522;0,41048210649402;0,41257852779282;0,41467494909163;0,41677137039043;0,41886779168924;0,42096421298804;0,42306063428684;0,42515705558565;0,42548409730826;0,42599377925443;0,42690356152833;0,42824873960475;0,42923744549091;0,43102092966586;0,43322341567213;0,43461879913036;0,43558812550601;0,43690488614974;0,43867632068492;0,43917911285383;0,43961008309522;0,44095682592046;0,44267701260912;0,444;0,446112;0,448602048;0,45078914016;0,44967177907648;0,45260241404199;0,4;0,4020964212988
PL;2G4;EM;N2O;PL_EM_2G4_N2O;;kt;NA;NA;NA;NA;NA;NA;NA;NA;NA;NA;NA;NA;NA;NA;NA;NA;NA;NA;NA;NA;NA;NA;NA;NA;NA;NA;NA;NA;NA;NA;NA;NA;NA;NA
PL;3B;EM;N2O;PL_EM_3B_N2O;;kt;13,67564688082339;12,96510388656825;12,25500559141717;11,34434184910755;11,43139122042756;11,10441476246608;10,60117449135002;10,82678087295994;10,76404194898172;10,38354499653253;9,72701589117672;9,51324424665399;9,34407381815526;8,98726555541543;8,50932947990069;8,90112378946818;9,13992962726646;9,25178015811174;8,92668372858473;8,69810650818274;8,74841758043983;8,62797483158914;8,33342706337154;8,34535668785593;8,46846915526744;8,66467744652635;8,6366886745283;9,06055164088777;9,40827325472463;9,45228638131223;9,92970510668253;9,73108179372077;13,82635222600309;14,20612723054399
PL;3D;EM;N2O;PL_EM_3D_N2O;;kt;69,36912766119171;55,91835025694413;49,86299753022727;51,29242351184712;50,86422426165572;52,51839716032474;51,62586141391825;52,16529822326334;52,79517456899896;50,91697425170945;49,61606381773147;50,08871248149657;47,98071287222435;46,42902648342526;48,37303461188731;48,08233743590071;49,66540246864778;52,06981579406762;53,32478012006429;52,39298036721376;50,1583881155403;51,48996494231004;51,5644564255783;53,22372012755665;52,38885421744195;49,78693417604087;51,0400708182529;54,12491244197151;54,01133906144336;50,42887013066578;53,12695104026006;52,93783135739429;70,86216499043255;75,48712893439394
PL;3F;EM;N2O;PL_EM_3F_N2O;;kt;0,03534463766001;0,03370458091175;0,03108128659123;0,03913511314473;0,03010019535972;0,03347556544132;0,03534061048695;0,03270866295447;0,03576196185272;0,03157508258493;0,03161397547488;0,03561937800149;0,03188894431695;0,03143439732167;0,03603780846877;0,03042467637595;0,03020450369468;0,02706789535668;0,03634594449594;0,03808645160826;0,03229270758018;0,03341273464793;0,03564120492843;0,03774528566807;0,03993206115787;0,03637474386438;0,03989087664788;0,03457037827399;0,04021404634298;0,03520372272338;0,04161259404364;0,04379241503825;0,03738894042411;0,03812846937591
PL;4A;EM;N2O;PL_EM_4A_N2O;;kt;0,36478904387442;0,30406489134554;0,84099675594309;0,36631865823848;0,37342912136445;0,33672226780038;0,48200837757886;0,40836655223548;0,41316630912324;0,45021924700476;0,40337225093065;0,36042177180876;0,43363646803704;0,66226323242629;0,51534148852089;0,56283554283339;0,55140934773413;0,59304118605459;0,59587681796105;0,62561569773154;0,61890689989823;0,63980006487314;0,70865468827258;0,65091455823998;0,67284235331981;0,70709253886593;0,61801212197522;0,64886648553837;0,61966362772062;0,62261647668249;0,6669060216767;0,56296525175478;0,352403493232;0,35503504184476
PL;4B;EM;N2O;PL_EM_4B_N2O;;kt;0,08110428913662;0,08110428913662;0,08110428913662;0,08110428913662;0,08110428913662;0,08110428913662;0,08110428913662;0,08110428913662;0,08110428913662;0,08110428913662;0,09169131279972;0,02311291307751;0,02311291307751;0,02311291307751;0,02311291307751;0,02693291509879;0,02693291509879;0,02727225180617;0,0464764565862;0,0464764565862;0,0464764565862;0,03395056717179;0,03395056717179;0,03395056717179;0,03395056717179;0,03395056717179;0,03395056717179;0,05035278005268;0,05064565156777;0,05064565156777;0,05064565156777;0,04005862790467;0,06857839972221;0,06857839972221
PL;4C;EM;N2O;PL_EM_4C_N2O;;kt;0,0151573032;0,0151573032;0,0151573032;0,0151573032;0,0151573032;0,0219301992;0,0076751064;0,0105611688;0,0052515216;0,0108635904;0,0039415896;0,0045893952;0,0077012208;0,0115560432;0,007333092;0,0070037136;0,0151623576;0,0022668984;0,0089243856;0,0017328168;0,0021826584;0,0021093696;0,0023974704;0,0033257952;0,0043434144;0,0033266376;0,0082336176;0,0018018936;0,0036821304;0,0057754944;0,002080728;0,0025996464;0,0151573032;0,0151573032
PL;4D;EM;N2O;PL_EM_4D_N2O;;kt;0,02919540768572;0,00693895054286;0,00276397911429;0,0172033334;0,00032952197143;0,03361552197143;0,02212837911429;0,00215677911429;0,00987186482857;0,04593615054286;0,03817832197143;0,01124640502857;0,03154242425714;0,1562767723;0,05444254954285;0,01875157067143;0,01570324155714;0,05756987704286;0,04041926585714;0,01299956224286;0,04984389991428;0,02310823931428;0,01104401775714;0,03341988964286;3,388e-06;5,9411e-06;0,01728482407143;0,02548076692857;0,00188665101429;0,00107450734286;0,02067208832857;5,04397143e-06;0,02617292197143;0,09324243625715
PL;4E;EM;N2O;PL_EM_4E_N2O;;kt;5,61898197873907;5,4487415294304;5,2876654824583;5,15523805888284;4,95592311382804;4,73997432085584;4,55777300331245;4,3551722868256;4,14412538059264;4,00370349633728;3,81275757966297;3,59778775531952;3,43982378793811;3,27437957459332;3,07205665404743;2,89954365613677;2,7465283590987;2,60717681815528;2,59176693318023;2,58636276061186;2,65552083618634;2,64873521712892;2,65589743845217;2,67975936984512;2,91937271721079;5,69209115514577;5,851759984974;5,88619926722462;5,94365062087526;5,8984497984499;5,92745499694965;5,96828291779845;5,97998569232945;5,82862606579299
PL;4H;EM;N2O;PL_EM_4H_N2O;;kt;NA;NA;NA;NA;NA;NA;NA;NA;NA;NA;NA;NA;NA;NA;NA;NA;NA;NA;NA;NA;NA;NA;NA;NA;NA;NA;NA;NA;NA;NA;NA;NA;NA;NA
PL;5B1;EM;N2O;PL_EM_5B1_N2O;;kt;0,03049324275735;0,08205305098767;0,07126758273858;0,0688104150158;0,10594189676029;0,06005936836707;0,06419331826092;0,06861817913046;0,07304304;0,07728;0,07728;0,094824;0,071424;0,058608;0,094128;0,129;0,099066696;0,10537679976;0,10758286008;0,10911276984;0,12267851784;0,13449979224;0,296466379992;0,2956156464;0,35819579784;0,394522131288;0,339423237384;0,342177424584;0,34688420112;0,403704612696;0,422393234472;0,452779582176;0,03907488259135;0,06662443948269
PL;5C1;EM;N2O;PL_EM_5C1_N2O;;kt;0,0250855507999;0,02237764248569;0,02124984286794;0,02100929374342;0,02108054301654;0,02138906318039;0,02171758405796;0,02170426187374;0,02321;0,01918;0,02469;0,02379;0,02481;0,019705;0,0146;0,016;0,015955;0,01582;0,01234425356;0,01148241016;0,014439545;0,01413256527;0,01477411976;0,01518372562;0,01560439393;0,0151204482;0,02102926834;0,02105637411;0,02280168157;0,01933330713;0,01888236261;0,02040200329;0,03240928206839;0,02979630303536
PL;5C2;EM;N2O;PL_EM_5C2_N2O;;kt;NA;NA;NA;NA;NA;NA;NA;NA;NA;NA;NA;NA;NA;NA;NA;NA;NA;NA;NA;NA;NA;NA;NA;NA;NA;NA;NA;NA;NA;NA;NA;NA;NA;NA
PL;5D1;EM;N2O;PL_EM_5D1_N2O;;kt;2,42589487736004;2,46486072366386;2,46283140847472;2,43301495015914;2,35172231843878;2,38091290588286;2,39146948928572;2,35894229982;2,418743642495;2,43038057522288;2,43950397514015;2,43843333129583;2,46627178402076;2,48077639192271;2,43775868534575;2,43301317838776;2,43384114860936;2,45727004018209;2,42767115792541;2,49775544375983;2,53767738724545;2,56746572643338;2,55232389585737;2,55032566808158;2,52617824198684;2,53639017970684;2,61171308363742;2,64446447309816;2,6591486959605;2,63391214262626;2,61432586627911;2,60219643799877;2,52620048153155;2,50779245362352
PL;5D2;EM;N2O;PL_EM_5D2_N2O;;kt;NA;NA;NA;NA;NA;NA;NA;NA;NA;NA;NA;NA;NA;NA;NA;NA;NA;NA;NA;NA;NA;NA;NA;NA;NA;NA;NA;NA;NA;NA;NA;NA;NA;NA
PL;5D3;EM;N2O;PL_EM_5D3_N2O;;kt;NA;NA;NA;NA;NA;NA;NA;NA;NA;NA;NA;NA;NA;NA;NA;NA;NA;NA;NA;NA;NA;NA;NA;NA;NA;NA;NA;NA;NA;NA;NA;NA;NA;NA
PL;2C7;EM;HFC;PL_EM_2C7_HFC;;kt;NA;NA;NA;NA;NA;NA;NA;NA;NA;NA;NA;NA;NA;NA;NA;NA;NA;NA;NA;NA;NA;NA;NA;NA;NA;NA;NA;NA;NA;NA;NA;NA;NA;NA
PL;2F1;EM;HFC;PL_EM_2F1_HFC;;kt;;;;;;150,6565486581;183,8790114498;232,2204639468;308,315996469;466,302192096;916,0612229177675;1340,9797963079095;1866,8647637930756;2522,6254896167115;2780,716258471026;3188,600841045372;3675,6054702808656;4167,654647613492;4845,000778011753;5244,7041563769235;5298,340996457976;5781,692748905086;6010,54261171784;5595,01092929195;6112,206252839049;5317,656322293374;5432,09536573556;5493,261025327744;5290,15610171337;5012,400918953631;4843,803890829496;4771,174639610909;;
PL;2F2;EM;HFC;PL_EM_2F2_HFC;;kt;;;;;;;;;;15,6;15,73;15,85675;0,81248125;3,22879371875;12,39581696078125;214,08299099543672;230,69263326733545;258,6670300013314;206,15573730852182;133,6947601362075;146,61194504023302;161,36617832907353;165,188817593025;197,42094535537956;205,65547727707724;74,43666743198123;61,85652005160527;71,17427792074461;76,83480493472855;75,40974576944816;71,52240303355552;75,01480836568471;;
PL;2F3;EM;HFC;PL_EM_2F3_HFC;;kt;;;;;;;0,0446488;0,12617976;0,243490797;1,46500903215;1,6439281555425;3,65871114776538;3,12942411537712;9,46397153460826;8,27988955787785;12,13093247998395;15,09371518098474;20,41947497193552;23,69105979833873;28,79796373342182;38,69841734675071;45,36836087941321;52,61794626044254;59,37400214742042;68,8749958150494;76,04420382429687;79,55659288308203;91,18171813892796;96,10025073698155;100,31639348513248;94,7051787008759;90,6923305158321;;
PL;2F4;EM;HFC;PL_EM_2F4_HFC;;kt;;;;;;15,925;75,075;114,075;109,08625;97,9225;89,13125;144,287;177,6736;81,7765;348,777;346,1055;517,7806161909002;440,7972946302376;288,8193716704073;245,11954332206003;112,25861096821973;113,73857892727494;114,78891107251823;113,59536698933762;114,04095232971025;114,93344346385537;115,57637092763441;116,59788890706668;116,24609776618549;115,83585000000001;104,02682620197565;0,0826896;;
PL;2F5;EM;HFC;PL_EM_2F5_HFC;;kt;;;;;;;;;;;;;;;;0,53064;1,01304;0,6474;0,33;0,99;2,2473;2,802525;1,627725;0,4125;0,4125;0,452925;0,533775;0,5742;0,545325;0,6105;0,4188525;0,3000525;;
PL;2G4;EM;HFC;PL_EM_2G4_HFC;;kt;NA;NA;NA;NA;NA;NA;NA;NA;NA;NA;NA;NA;NA;NA;NA;NA;NA;NA;NA;NA;NA;NA;NA;NA;NA;NA;NA;NA;NA;NA;NA;NA;NA;NA
PL;2C3;EM;PFC;PL_EM_2C3_PFC;;kt;127,47165006;126,96979317;120,96691932;130,15561398;137,27310921;154,51646832;143,96915556;148,65500166;150,19107192;141,33510006;145,10873115;151,388874;163,034172;158,7087756;163,39739439;148,56627558;155,10150591;148,00341951;129,5678037;;;;;;;;;;;;;;132,3127668;132,53735469
PL;2C7;EM;PFC;PL_EM_2C7_PFC;;kt;NA;NA;NA;NA;NA;NA;NA;NA;NA;NA;NA;NA;NA;NA;NA;NA;NA;NA;NA;NA;NA;NA;NA;NA;NA;NA;NA;NA;NA;NA;NA;NA;NA;NA
PL;2F3;EM;PFC;PL_EM_2F3_PFC;;kt;;;;;;;0,87584;8,218958;7,9982983;11,852214985;15,76384603575;29,9622421339625;26,87432402726435;25,38115382590112;24,11209613460612;22,90649132787577;21,76116676148204;20,67310842340793;19,6394530022375;18,65748035212559;17,72460633451934;16,8383760177934;15,99645721690374;15,19663435605858;14,43680263825559;13,71496250634284;13,02921438102565;12,37775366197442;11,75886597887568;11,17092267993186;10,61237654593534;10,08175771863856;;
PL;2G2;EM;PFC;PL_EM_2G2_PFC;;kt;NA;NA;NA;NA;NA;NA;NA;NA;NA;NA;NA;NA;NA;NA;NA;NA;NA;NA;NA;NA;NA;NA;NA;NA;NA;NA;NA;NA;NA;NA;NA;NA;NA;NA
PL;2G4;EM;PFC;PL_EM_2G4_PFC;;kt;NA;NA;NA;NA;NA;NA;NA;NA;NA;NA;NA;NA;NA;NA;NA;NA;NA;NA;NA;NA;NA;NA;NA;NA;NA;NA;NA;NA;NA;NA;NA;NA;NA;NA
PL;2C7;EM;FGAS_IPCC;PL_EM_2C7_FGAS_IPCC;;kt;NA;NA;NA;NA;NA;NA;NA;NA;NA;NA;NA;NA;NA;NA;NA;NA;NA;NA;NA;NA;NA;NA;NA;NA;NA;NA;NA;NA;NA;NA;NA;NA;NA;NA
PL;2G4;EM;FGAS_IPCC;PL_EM_2G4_FGAS_IPCC;;kt;NA;NA;NA;NA;NA;NA;NA;NA;NA;NA;NA;NA;NA;NA;NA;NA;NA;NA;NA;NA;NA;NA;NA;NA;NA;NA;NA;NA;NA;NA;NA;NA;NA;NA
PL;2C4;EM;SF6;PL_EM_2C4_SF6;;kt;;;;;0,00058181818182;0,00072727272727;0,00072727272727;0,00062787878788;0,00052848484848;0,00042909090909;0,0003296969697;0,0002303030303;0,00013090909091;8,363636364e-05;3,636363636e-05;5,454545455e-05;0,00011818181818;0,00018181818182;0,00018181818182;0,00018181818182;0,00018181818182;0,00018181818182;0,00018181818182;0,00018181818182;0,00018181818182;0,00018181818182;0,00018181818182;0,00018181818182;;;;;;
PL;2C7;EM;SF6;PL_EM_2C7_SF6;;kt;NA;NA;NA;NA;NA;NA;NA;NA;NA;NA;NA;NA;NA;NA;NA;NA;NA;NA;NA;NA;NA;NA;NA;NA;NA;NA;NA;NA;NA;NA;NA;NA;NA;NA
PL;2G1;EM;SF6;PL_EM_2G1_SF6;;kt;;;;;;0,00055;0,00031648;0,00037696;0,00052144;0,00060172;0,000682;0,0007722284;0,000890375432;0,00082495992336;0,00094419512489;0,00112094482239;0,00133804992595;0,00118479372743;0,00125987065288;0,00146743403982;0,00136943495903;0,00152961585984;0,00165686034265;0,0019031327358;0,00213336608108;0,00319651315946;0,00325572169627;0,00343371726234;0,0047093353171;0,00398043653075;0,00392704548014;0,00394026357054;;
PL;2G2;EM;SF6;PL_EM_2G2_SF6;;kt;NA;NA;NA;NA;NA;NA;NA;NA;NA;NA;NA;NA;NA;NA;NA;NA;NA;NA;NA;NA;NA;NA;NA;NA;NA;NA;NA;NA;NA;NA;NA;NA;NA;NA
PL;2G4;EM;SF6;PL_EM_2G4_SF6;;kt;NA;NA;NA;NA;NA;NA;NA;NA;NA;NA;NA;NA;NA;NA;NA;NA;NA;NA;NA;NA;NA;NA;NA;NA;NA;NA;NA;NA;NA;NA;NA;NA;NA;NA
PL;2C7;EM;NF3;PL_EM_2C7_NF3;;kt;NA;NA;NA;NA;NA;NA;NA;NA;NA;NA;NA;NA;NA;NA;NA;NA;NA;NA;NA;NA;NA;NA;NA;NA;NA;NA;NA;NA;NA;NA;NA;NA;NA;NA
PL;2G4;EM;NF3;PL_EM_2G4_NF3;;kt;NA;NA;NA;NA;NA;NA;NA;NA;NA;NA;NA;NA;NA;NA;NA;NA;NA;NA;NA;NA;NA;NA;NA;NA;NA;NA;NA;NA;NA;NA;NA;NA;NA;NA
