Vorgang gestartet
Berechne Variable Liming, Ereignis #18500 (1/9)
Berechne Variable Dolomite CaMg(CO3)2, Ereignis #18501 (2/9)
Berechne Variable Dolomite CaMg(CO3)2, Ereignis #18502 (3/9)
Berechne Variable Dolomite CaMg(CO3)2, Ereignis #18504 (4/9)
Berechne Variable Dolomite CaMg(CO3)2, Ereignis #18506 (5/9)
Berechne Variable Limestone CaCO3, Ereignis #18507 (6/9)
Berechne Variable Limestone CaCO3, Ereignis #18508 (7/9)
Berechne Variable Limestone CaCO3, Ereignis #18510 (8/9)
Berechne Variable Limestone CaCO3, Ereignis #18512 (9/9)
Datei '\\tsclient\c\Program Files\Housesoft\Zentrales System Emissionen\tables\data\crf_exporter\reporter_import_files\Submission 2024\import files\3 Agriculture\3G.xml' wurde geschrieben (297 Werte).
Vorgang beendet (00:00:16.4180453)
