year;year_uid
01.01.1990;148BC756-8670-4708-BBB9-F35E9FA0D74A
01.01.1991;AB7879C2-73C7-442F-989C-676B12A180AD
01.01.1992;C4FB6134-E473-41FB-89B9-09CD83398888
01.01.1993;DEB2E74E-7E63-4966-A2C1-BA25333DC5A5
01.01.1994;943A31F2-CDDD-49E3-99BF-C9CA082EB057
01.01.1995;D04EE64A-170B-41D6-8968-5EDABCB5155A
01.01.1996;D4CCECB4-E2A8-42F7-BC92-241521823FBC
01.01.1997;A2D20B23-41C5-4418-AE69-E6A0FD3675DF
01.01.1998;B96FAC46-6058-4063-935E-68D9CD48BC78
01.01.1999;C32F2E5B-B0C8-482F-97FF-2433F128C701
01.01.2000;D3819F7C-B6FC-45E9-A368-562F36BF770D
01.01.2001;E2A81483-3CE8-40C5-9BF8-C0F4905B1170
01.01.2002;0CF64CB3-E248-4D6E-B72B-1287E2C73EEC
01.01.2003;AEEDB4BA-A067-439F-8EE9-14F706204597
01.01.2004;9EA5A026-7F04-4915-B361-55259CC381AF
01.01.2005;4A6E5A09-37DF-4BDC-B1F7-4C078C9C1306
01.01.2006;0F272346-16A7-4848-9CC6-D7330D37CF98
01.01.2007;6139C148-8307-44C3-9CF3-E4F6A4EFBF75
01.01.2008;186211CC-7E72-49C6-B065-A29D0210D5E2
01.01.2009;34A8BE8A-5620-4A47-A6E2-51A863E3E8DF
01.01.2010;F18F7BF5-8AF7-47C1-A19F-584E84D2A7A4
01.01.2011;6CE3F5C5-D464-48A5-9F2F-CDE450108F5F
01.01.2012;CC1659B9-1CF8-4926-B2E3-091312C92591
01.01.2013;44779CBD-45E6-4929-8D58-1088FBA69AB9
01.01.2014;00984BA3-E7AE-43F6-BD60-1C9807D6FC7B
01.01.2015;A8C0C165-2951-4938-B9AA-2689E42939A6
01.01.2016;CCFE9865-18F2-4AD0-B8D2-859B0FB83279
01.01.2017;22D9B5D0-4098-4DAC-85EF-BE62D6DFF0B1
01.01.2018;EDB8ECB8-0F2A-4E93-8675-BFB717B875C9
01.01.2019;3056CF92-E5E1-4FE8-8947-6CBC84485DE5
01.01.2020;2ECC1D63-D0E8-4C3E-BD8E-DE3B68E4BDA1
01.01.2021;B2A792FC-897B-43F1-A1D0-93D2D2343D62
01.01.2022;C0D8E4D8-528B-41E2-AF54-475B29068264
