Vorgang gestartet
Berechne Variable Lubricant Use, Ereignis #6053 (1/102)
Berechne Variable Lubricant Use, Ereignis #6054 (2/102)
Berechne Variable Lubricant Use, Ereignis #6056 (3/102)
Berechne Variable Lubricant Use, Ereignis #6057 (4/102)
Berechne Variable Lubricant Use, Ereignis #6058 (5/102)
Berechne Variable Lubricant Use, Ereignis #6059 (6/102)
Berechne Variable Lubricant Use, Ereignis #6060 (7/102)
Berechne Variable Lubricant Use, Ereignis #6061 (8/102)
Berechne Variable Lubricant Use, Ereignis #6063 (9/102)
Berechne Variable Lubricant Use, Ereignis #6065 (10/102)
Berechne Variable Lubricant Use, Ereignis #6066 (11/102)
Berechne Variable Lubricant Use, Ereignis #6067 (12/102)
Berechne Variable Lubricant Use, Ereignis #6069 (13/102)
Berechne Variable Lubricant Use, Ereignis #6070 (14/102)
Berechne Variable Lubricant Use, Ereignis #6071 (15/102)
Berechne Variable Lubricant Use, Ereignis #6072 (16/102)
Berechne Variable Lubricant Use, Ereignis #6073 (17/102)
Berechne Variable Paraffin Wax Use, Ereignis #6074 (18/102)
Berechne Variable Paraffin Wax Use, Ereignis #6075 (19/102)
Berechne Variable Paraffin Wax Use, Ereignis #6076 (20/102)
Berechne Variable Paraffin Wax Use, Ereignis #6077 (21/102)
Berechne Variable Paraffin Wax Use, Ereignis #6078 (22/102)
Berechne Variable Paraffin Wax Use, Ereignis #6079 (23/102)
Berechne Variable Paraffin Wax Use, Ereignis #6080 (24/102)
Berechne Variable Paraffin Wax Use, Ereignis #6081 (25/102)
Berechne Variable Paraffin Wax Use, Ereignis #6082 (26/102)
Berechne Variable Paraffin Wax Use, Ereignis #6083 (27/102)
Berechne Variable Paraffin Wax Use, Ereignis #6084 (28/102)
Berechne Variable Paraffin Wax Use, Ereignis #6085 (29/102)
Berechne Variable Paraffin Wax Use, Ereignis #6086 (30/102)
Berechne Variable Paraffin Wax Use, Ereignis #6087 (31/102)
Berechne Variable Paraffin Wax Use, Ereignis #6088 (32/102)
Berechne Variable Paraffin Wax Use, Ereignis #6089 (33/102)
Berechne Variable Paraffin Wax Use, Ereignis #6090 (34/102)
Berechne Variable Paraffin Wax Use, Ereignis #6091 (35/102)
Berechne Variable Paraffin Wax Use, Ereignis #6092 (36/102)
Berechne Variable Paraffin Wax Use, Ereignis #6093 (37/102)
Berechne Variable Paraffin Wax Use, Ereignis #6094 (38/102)
Berechne Variable Solvent use, Ereignis #6144 (39/102)
Berechne Variable Solvent use, Ereignis #6145 (40/102)
Berechne Variable Solvent use, Ereignis #6146 (41/102)
Berechne Variable Solvent use, Ereignis #6148 (42/102)
Berechne Variable Solvent use, Ereignis #6149 (43/102)
Berechne Variable Solvent use, Ereignis #6150 (44/102)
Berechne Variable Solvent use, Ereignis #6151 (45/102)
Berechne Variable Solvent use, Ereignis #6152 (46/102)
Berechne Variable Solvent use, Ereignis #6153 (47/102)
Berechne Variable Solvent use, Ereignis #6154 (48/102)
Berechne Variable Solvent use, Ereignis #6155 (49/102)
Berechne Variable Solvent use, Ereignis #6156 (50/102)
Berechne Variable Solvent use, Ereignis #6157 (51/102)
Berechne Variable Solvent use, Ereignis #6158 (52/102)
Berechne Variable Solvent use, Ereignis #6159 (53/102)
Berechne Variable Solvent use, Ereignis #6160 (54/102)
Berechne Variable Solvent use, Ereignis #6161 (55/102)
Berechne Variable Solvent use, Ereignis #6162 (56/102)
Berechne Variable Solvent use, Ereignis #6163 (57/102)
Berechne Variable Solvent use, Ereignis #6164 (58/102)
Berechne Variable AdBlue, Ereignis #21677 (59/102)
Berechne Variable AdBlue, Ereignis #21679 (60/102)
Berechne Variable AdBlue, Ereignis #21680 (61/102)
Berechne Variable AdBlue, Ereignis #21681 (62/102)
Berechne Variable AdBlue, Ereignis #21682 (63/102)
Berechne Variable AdBlue, Ereignis #21683 (64/102)
Berechne Variable AdBlue, Ereignis #21684 (65/102)
Berechne Variable AdBlue, Ereignis #21685 (66/102)
Berechne Variable AdBlue, Ereignis #21686 (67/102)
Berechne Variable AdBlue, Ereignis #21687 (68/102)
Berechne Variable AdBlue, Ereignis #21688 (69/102)
Berechne Variable AdBlue, Ereignis #21689 (70/102)
Berechne Variable AdBlue, Ereignis #21690 (71/102)
Berechne Variable AdBlue, Ereignis #21691 (72/102)
Berechne Variable AdBlue, Ereignis #21692 (73/102)
Berechne Variable AdBlue, Ereignis #21693 (74/102)
Berechne Variable AdBlue, Ereignis #21694 (75/102)
Berechne Variable AdBlue, Ereignis #21695 (76/102)
Berechne Variable AdBlue, Ereignis #21696 (77/102)
Berechne Variable AdBlue, Ereignis #21697 (78/102)
Berechne Variable Road paving with asphalt, Ereignis #6165 (79/102)
Berechne Variable Road paving with asphalt, Ereignis #6166 (80/102)
Berechne Variable Road paving with asphalt, Ereignis #6170 (81/102)
Berechne Variable Road paving with asphalt, Ereignis #6171 (82/102)
Berechne Variable Road paving with asphalt, Ereignis #6172 (83/102)
Berechne Variable Road paving with asphalt, Ereignis #6176 (84/102)
Berechne Variable Road paving with asphalt, Ereignis #6177 (85/102)
Berechne Variable Road paving with asphalt, Ereignis #6178 (86/102)
Berechne Variable Road paving with asphalt, Ereignis #6180 (87/102)
Berechne Variable Road paving with asphalt, Ereignis #6181 (88/102)
Berechne Variable Road paving with asphalt, Ereignis #6183 (89/102)
Berechne Variable Road paving with asphalt, Ereignis #6185 (90/102)
Berechne Variable Asphalt roofing, Ereignis #6187 (91/102)
Berechne Variable Asphalt roofing, Ereignis #6188 (92/102)
Berechne Variable Asphalt roofing, Ereignis #6192 (93/102)
Berechne Variable Asphalt roofing, Ereignis #6195 (94/102)
Berechne Variable Asphalt roofing, Ereignis #6197 (95/102)
Berechne Variable Asphalt roofing, Ereignis #6198 (96/102)
Berechne Variable Asphalt roofing, Ereignis #6200 (97/102)
Berechne Variable Asphalt roofing, Ereignis #6201 (98/102)
Berechne Variable Asphalt roofing, Ereignis #6203 (99/102)
Berechne Variable Asphalt roofing, Ereignis #6204 (100/102)
Berechne Variable Asphalt roofing, Ereignis #6205 (101/102)
Berechne Variable Asphalt roofing, Ereignis #6206 (102/102)
Datei '\\tsclient\C\Program Files\Housesoft\ZSEnext\tables\data\crf_exporter\reporter_import_files\Submission 2024\import files\2 Industry\2D.xml' wurde geschrieben (3366 Werte).
Vorgang beendet (00:00:38.5094530)
