{
    "version": {
      "metadata_ver": "1.27.4",
      "country": "DEU",
      "metadata_type": "CRT"
    },
    "country_specific_data": {
      "variables": [],
      "nodes": [
        {"uid": "42DA0DA4-0D4E-4D12-8F5C-E10FE4DC173E"},
        {"uid": "BBE912CF-572D-4CD4-848A-9688C58112A8"},
        {"uid": "0E732950-EED5-485B-A205-1D2257F4E074"},
        {"uid": "9509B190-F6FD-4532-8A7C-38F11CA33C40"},
        {"uid": "3D71F7FD-7824-4ACD-A521-7604E3840895"},
        {"uid": "5351C997-149A-4E0C-921F-E37A41AAA99A"},
        {"uid": "A4CDC1B6-664C-400D-88DF-FB2D7A07AACF"},
        {"uid": "333CAB46-7D63-428A-8EBB-76B14F08E8DC"},

        {"uid": "CF0907D8-D4E0-4FB9-BA24-898041D59DC3"},
        {"uid": "71A7DE78-9A97-4DB4-9B07-011A00D7C2E3"},
        {"uid": "A43BC199-AAA8-42B3-8DAC-7883AD631DF6"},

        {"uid": "1C9D6794-463E-46EB-BB11-F7F15CE28EA7"},
        {"uid": "7CE72727-7F2A-40F2-886E-134298088FB2"},
        {"uid": "C1DEF4FA-C4ED-40D3-9DB9-599105F2F8FD"},
        {"uid": "F2CC4563-1C63-4725-8BEF-A3065C05D79B"},
        {"uid": "F1EA0EF6-AFD4-4519-8597-0C5B6872D7B7"},
        {"uid": "F4C59F4E-84F8-46BD-AC3C-5FD700B532D4"},
        {"uid": "7D229022-69F2-4627-9467-A6C301629731"},

        {"uid": "0732D16D-39F4-44E1-870D-ECAE42DA922A"},
        {"uid": "744D0EA3-400D-4D32-996D-B604CA56F395"},
        {"uid": "714A110F-B279-466E-8C9C-A94948EFE491"},
        {"uid": "F823E3DC-BE70-4845-896C-86605D69DC10"},
        {"uid": "65CEAA9E-AA8E-46F3-9B94-86BE7A391153"},
        {"uid": "60F5A480-3A89-4377-958C-41E399E33A5E"},

        {"uid": "BEFFA950-45E9-4E02-8F91-8C7901A5682C"},

        {"uid": "E34C5319-47C9-41E5-975A-C1193371E5AC"},
        {"uid": "1F1853CF-7A38-49C0-A112-6D0EE59C2397"},
        {"uid": "4AD04724-C1FA-44AB-BA5C-D587EE83B5E2"},
        {"uid": "ABE359C7-2D97-4C98-8582-C0E070EF8790"},
        {"uid": "49E965E3-D229-4807-AC11-2A3C4A20444B"}
      ],
      "grids": [],
      "drop_downs": [],
      "line_description": [],
      "dimension_instances": []    
    },
    "data": {
      "values": []
    }
  }