Vorgang gestartet
Berechne Variable Forest Land, Ereignis #29311 (1/250)
Berechne Variable Forest Land, Ereignis #29312 (2/250)
Berechne Variable Forest Land, Ereignis #29313 (3/250)
Berechne Variable Forest Land, Ereignis #29314 (4/250)
Berechne Variable Forest Land, Ereignis #29315 (5/250)
Berechne Variable Forest Land, Ereignis #29316 (6/250)
Berechne Variable Forest Land, Ereignis #29317 (7/250)
Berechne Variable Forest Land, Ereignis #29318 (8/250)
Berechne Variable Forest Land, Ereignis #29319 (9/250)
Berechne Variable Forest Land, Ereignis #29320 (10/250)
Berechne Variable Forest Land, Ereignis #29321 (11/250)
Berechne Variable Forest Land, Ereignis #29322 (12/250)
Berechne Variable Forest Land, Ereignis #29323 (13/250)
Berechne Variable Forest Land, Ereignis #29324 (14/250)
Berechne Variable Forest Land, Ereignis #29325 (15/250)
Berechne Variable Forest Land, Ereignis #29326 (16/250)
Berechne Variable Forest Land, Ereignis #29327 (17/250)
Berechne Variable Forest Land, Ereignis #29328 (18/250)
Berechne Variable Forest Land, Ereignis #29329 (19/250)
Berechne Variable Forest Land, Ereignis #29330 (20/250)
Berechne Variable Forest Land, Ereignis #29392 (21/250)
Berechne Variable Forest Land, Ereignis #29393 (22/250)
Berechne Variable Forest Land, Ereignis #13283 (23/250)
Berechne Variable Forest Land, Ereignis #13284 (24/250)
Berechne Variable Forest Land, Ereignis #13285 (25/250)
Berechne Variable Forest Land, Ereignis #13286 (26/250)
Berechne Variable Forest Land, Ereignis #13287 (27/250)
Berechne Variable Forest Land, Ereignis #13290 (28/250)
Berechne Variable Forest Land, Ereignis #13291 (29/250)
Berechne Variable Forest Land, Ereignis #13292 (30/250)
Berechne Variable Forest Land, Ereignis #13293 (31/250)
Berechne Variable Forest Land, Ereignis #13294 (32/250)
Berechne Variable Forest Land, Ereignis #13295 (33/250)
Berechne Variable Forest Land, Ereignis #13296 (34/250)
Berechne Variable Forest Land, Ereignis #13300 (35/250)
Berechne Variable Forest Land, Ereignis #13306 (36/250)
Berechne Variable Forest Land, Ereignis #13307 (37/250)
Berechne Variable Forest Land, Ereignis #13308 (38/250)
Berechne Variable Forest Land, Ereignis #13313 (39/250)
Berechne Variable Forest Land, Ereignis #13314 (40/250)
Berechne Variable Forest Land, Ereignis #13320 (41/250)
Berechne Variable Forest Land, Ereignis #13321 (42/250)
Berechne Variable Forest Land, Ereignis #13322 (43/250)
Berechne Variable Forest Land, Ereignis #13324 (44/250)
Berechne Variable Forest Land, Ereignis #13326 (45/250)
Berechne Variable Forest Land, Ereignis #13327 (46/250)
Berechne Variable Forest Land, Ereignis #13328 (47/250)
Berechne Variable Forest Land, Ereignis #13330 (48/250)
Berechne Variable Forest Land, Ereignis #13332 (49/250)
Berechne Variable Forest Land, Ereignis #13338 (50/250)
Berechne Variable Forest Land, Ereignis #13341 (51/250)
Berechne Variable Forest Land, Ereignis #13342 (52/250)
Berechne Variable Forest Land, Ereignis #13343 (53/250)
Berechne Variable Forest Land, Ereignis #13344 (54/250)
Berechne Variable Forest Land, Ereignis #13345 (55/250)
Berechne Variable Forest Land, Ereignis #13346 (56/250)
Berechne Variable Forest Land, Ereignis #13347 (57/250)
Berechne Variable Forest Land, Ereignis #13349 (58/250)
Berechne Variable Forest Land, Ereignis #13351 (59/250)
Berechne Variable Forest Land, Ereignis #13352 (60/250)
Berechne Variable Forest Land, Ereignis #13359 (61/250)
Berechne Variable Forest Land, Ereignis #13360 (62/250)
Berechne Variable Forest Land, Ereignis #13361 (63/250)
Berechne Variable Forest Land, Ereignis #13365 (64/250)
Berechne Variable Forest Land, Ereignis #13366 (65/250)
Berechne Variable Forest Land, Ereignis #13367 (66/250)
Berechne Variable Landnutzung, Ereignis #23108 (67/250)
Berechne Variable Landnutzung, Ereignis #23109 (68/250)
Berechne Variable Landnutzung, Ereignis #23181 (69/250)
Berechne Variable Landnutzung, Ereignis #23189 (70/250)
Berechne Variable Landnutzung, Ereignis #23291 (71/250)
Berechne Variable Landnutzung, Ereignis #23553 (72/250)
Berechne Variable Landnutzung, Ereignis #23714 (73/250)
Berechne Variable Landnutzung, Ereignis #23892 (74/250)
Berechne Variable Landnutzung, Ereignis #24080 (75/250)
Berechne Variable Landnutzung, Ereignis #24396 (76/250)
Berechne Variable Landnutzung, Ereignis #24522 (77/250)
Berechne Variable Landnutzung, Ereignis #24852 (78/250)
Berechne Variable Landnutzung, Ereignis #24899 (79/250)
Berechne Variable Landnutzung, Ereignis #24948 (80/250)
Berechne Variable Landnutzung, Ereignis #25021 (81/250)
Berechne Variable Landnutzung, Ereignis #25062 (82/250)
Berechne Variable Landnutzung, Ereignis #25065 (83/250)
Berechne Variable Landnutzung, Ereignis #25098 (84/250)
Berechne Variable Forest Land, Ereignis #28875 (85/250)
Berechne Variable Forest Land, Ereignis #28876 (86/250)
Berechne Variable Forest Land, Ereignis #28877 (87/250)
Berechne Variable Forest Land, Ereignis #28878 (88/250)
Berechne Variable Forest Land, Ereignis #28879 (89/250)
Berechne Variable Forest Land, Ereignis #28880 (90/250)
Berechne Variable Forest Land, Ereignis #28881 (91/250)
Berechne Variable Forest Land, Ereignis #28882 (92/250)
Berechne Variable Forest Land, Ereignis #28883 (93/250)
Berechne Variable Forest Land, Ereignis #28884 (94/250)
Berechne Variable Forest Land, Ereignis #28885 (95/250)
Berechne Variable Forest Land, Ereignis #28890 (96/250)
Berechne Variable Forest Land, Ereignis #28891 (97/250)
Berechne Variable Forest Land, Ereignis #28892 (98/250)
Berechne Variable Forest Land, Ereignis #28893 (99/250)
Berechne Variable Forest Land, Ereignis #29357 (100/250)
Berechne Variable Forest Land, Ereignis #29358 (101/250)
Berechne Variable Forest Land, Ereignis #29359 (102/250)
Berechne Variable Forest Land, Ereignis #29360 (103/250)
Berechne Variable Forest Land, Ereignis #29361 (104/250)
Berechne Variable Forest Land, Ereignis #29362 (105/250)
Berechne Variable Forest Land, Ereignis #29363 (106/250)
Berechne Variable Forest Land, Ereignis #29364 (107/250)
Berechne Variable Forest Land, Ereignis #22597 (108/250)
Berechne Variable Forest Land, Ereignis #22601 (109/250)
Berechne Variable Forest Land, Ereignis #22603 (110/250)
Berechne Variable Forest Land, Ereignis #22605 (111/250)
Berechne Variable Forest Land, Ereignis #22606 (112/250)
Berechne Variable Forest Land, Ereignis #22608 (113/250)
Berechne Variable Forest Land, Ereignis #22610 (114/250)
Berechne Variable Forest Land, Ereignis #22611 (115/250)
Berechne Variable Forest Land, Ereignis #22617 (116/250)
Berechne Variable Forest Land, Ereignis #22618 (117/250)
Berechne Variable Forest Land, Ereignis #22622 (118/250)
Berechne Variable Forest Land, Ereignis #22624 (119/250)
Berechne Variable Forest Land, Ereignis #22626 (120/250)
Berechne Variable Forest Land, Ereignis #22627 (121/250)
Berechne Variable Forest Land, Ereignis #22629 (122/250)
Berechne Variable Forest Land, Ereignis #22631 (123/250)
Berechne Variable Forest Land, Ereignis #22632 (124/250)
Berechne Variable Forest Land, Ereignis #22638 (125/250)
Berechne Variable Forest Land, Ereignis #22639 (126/250)
Berechne Variable Forest Land, Ereignis #22643 (127/250)
Berechne Variable Forest Land, Ereignis #22645 (128/250)
Berechne Variable Forest Land, Ereignis #22647 (129/250)
Berechne Variable Forest Land, Ereignis #22648 (130/250)
Berechne Variable Forest Land, Ereignis #22650 (131/250)
Berechne Variable Forest Land, Ereignis #22652 (132/250)
Berechne Variable Forest Land, Ereignis #22653 (133/250)
Berechne Variable Forest Land, Ereignis #22659 (134/250)
Berechne Variable Forest Land, Ereignis #22660 (135/250)
Berechne Variable Forest Land, Ereignis #22664 (136/250)
Berechne Variable Forest Land, Ereignis #22666 (137/250)
Berechne Variable Forest Land, Ereignis #22668 (138/250)
Berechne Variable Forest Land, Ereignis #22669 (139/250)
Berechne Variable Forest Land, Ereignis #22671 (140/250)
Berechne Variable Forest Land, Ereignis #22673 (141/250)
Berechne Variable Forest Land, Ereignis #22674 (142/250)
Berechne Variable Forest Land, Ereignis #22680 (143/250)
Berechne Variable Forest Land, Ereignis #22681 (144/250)
Berechne Variable Forest Land, Ereignis #22685 (145/250)
Berechne Variable Forest Land, Ereignis #22687 (146/250)
Berechne Variable Forest Land, Ereignis #22689 (147/250)
Berechne Variable Forest Land, Ereignis #22690 (148/250)
Berechne Variable Forest Land, Ereignis #22692 (149/250)
Berechne Variable Forest Land, Ereignis #22694 (150/250)
Berechne Variable Forest Land, Ereignis #22695 (151/250)
Berechne Variable Forest Land, Ereignis #22701 (152/250)
Berechne Variable Forest Land, Ereignis #22702 (153/250)
Berechne Variable Forest Land, Ereignis #22706 (154/250)
Berechne Variable Forest Land, Ereignis #22708 (155/250)
Berechne Variable Forest Land, Ereignis #22710 (156/250)
Berechne Variable Forest Land, Ereignis #22711 (157/250)
Berechne Variable Forest Land, Ereignis #22713 (158/250)
Berechne Variable Forest Land, Ereignis #22715 (159/250)
Berechne Variable Forest Land, Ereignis #22716 (160/250)
Berechne Variable Forest Land, Ereignis #22722 (161/250)
Berechne Variable Forest Land, Ereignis #22723 (162/250)
Berechne Variable Forest Land, Ereignis #22727 (163/250)
Berechne Variable Forest Land, Ereignis #22729 (164/250)
Berechne Variable Forest Land, Ereignis #22731 (165/250)
Berechne Variable Forest Land, Ereignis #22732 (166/250)
Berechne Variable Forest Land, Ereignis #22734 (167/250)
Berechne Variable Forest Land, Ereignis #22736 (168/250)
Berechne Variable Forest Land, Ereignis #22737 (169/250)
Berechne Variable Forest Land, Ereignis #23107 (170/250)
Berechne Variable Forest Land, Ereignis #22743 (171/250)
Berechne Variable Forest Land, Ereignis #22744 (172/250)
Berechne Variable Forest Land, Ereignis #22748 (173/250)
Berechne Variable Forest Land, Ereignis #22750 (174/250)
Berechne Variable Forest Land, Ereignis #22752 (175/250)
Berechne Variable Forest Land, Ereignis #22753 (176/250)
Berechne Variable Forest Land, Ereignis #22755 (177/250)
Berechne Variable Forest Land, Ereignis #22757 (178/250)
Berechne Variable Forest Land, Ereignis #22758 (179/250)
Berechne Variable Forest Land, Ereignis #22764 (180/250)
Berechne Variable Forest Land, Ereignis #22765 (181/250)
Berechne Variable Forest Land, Ereignis #22769 (182/250)
Berechne Variable Forest Land, Ereignis #22771 (183/250)
Berechne Variable Forest Land, Ereignis #22773 (184/250)
Berechne Variable Forest Land, Ereignis #22774 (185/250)
Berechne Variable Forest Land, Ereignis #22776 (186/250)
Berechne Variable Forest Land, Ereignis #22778 (187/250)
Berechne Variable Forest Land, Ereignis #22779 (188/250)
Berechne Variable Forest Land, Ereignis #22785 (189/250)
Berechne Variable Forest Land, Ereignis #22786 (190/250)
Berechne Variable Forest Land, Ereignis #22790 (191/250)
Berechne Variable Forest Land, Ereignis #22792 (192/250)
Berechne Variable Forest Land, Ereignis #22794 (193/250)
Berechne Variable Forest Land, Ereignis #22795 (194/250)
Berechne Variable Forest Land, Ereignis #22797 (195/250)
Berechne Variable Forest Land, Ereignis #22799 (196/250)
Berechne Variable Forest Land, Ereignis #22800 (197/250)
Berechne Variable Forest Land, Ereignis #22806 (198/250)
Berechne Variable Forest Land, Ereignis #22807 (199/250)
Berechne Variable Forest Land, Ereignis #22811 (200/250)
Berechne Variable Forest Land, Ereignis #22813 (201/250)
Berechne Variable Forest Land, Ereignis #22815 (202/250)
Berechne Variable Forest Land, Ereignis #22816 (203/250)
Berechne Variable Forest Land, Ereignis #22818 (204/250)
Berechne Variable Forest Land, Ereignis #22820 (205/250)
Berechne Variable Forest Land, Ereignis #22821 (206/250)
Berechne Variable Forest Land, Ereignis #22827 (207/250)
Berechne Variable Forest Land, Ereignis #22828 (208/250)
Berechne Variable Forest Land, Ereignis #22832 (209/250)
Berechne Variable Forest Land, Ereignis #22834 (210/250)
Berechne Variable Forest Land, Ereignis #22836 (211/250)
Berechne Variable Forest Land, Ereignis #22837 (212/250)
Berechne Variable Forest Land, Ereignis #22839 (213/250)
Berechne Variable Forest Land, Ereignis #22841 (214/250)
Berechne Variable Forest Land, Ereignis #22842 (215/250)
Berechne Variable Forest Land, Ereignis #22848 (216/250)
Berechne Variable Forest Land, Ereignis #22849 (217/250)
Berechne Variable Forest Land, Ereignis #22853 (218/250)
Berechne Variable Forest Land, Ereignis #22855 (219/250)
Berechne Variable Forest Land, Ereignis #22857 (220/250)
Berechne Variable Forest Land, Ereignis #22858 (221/250)
Berechne Variable Forest Land, Ereignis #22860 (222/250)
Berechne Variable Forest Land, Ereignis #22862 (223/250)
Berechne Variable Forest Land, Ereignis #22863 (224/250)
Berechne Variable Forest Land, Ereignis #22869 (225/250)
Berechne Variable Forest Land, Ereignis #22870 (226/250)
Berechne Variable Forest Land, Ereignis #22874 (227/250)
Berechne Variable Forest Land, Ereignis #22876 (228/250)
Berechne Variable Forest Land, Ereignis #22878 (229/250)
Berechne Variable Forest Land, Ereignis #22879 (230/250)
Berechne Variable Forest Land, Ereignis #22881 (231/250)
Berechne Variable Forest Land, Ereignis #22883 (232/250)
Berechne Variable Forest Land, Ereignis #22884 (233/250)
Berechne Variable Forest Land, Ereignis #22890 (234/250)
Berechne Variable Forest Land, Ereignis #22891 (235/250)
Berechne Variable Forest Land, Ereignis #22895 (236/250)
Berechne Variable Forest Land, Ereignis #22897 (237/250)
Berechne Variable Forest Land, Ereignis #22899 (238/250)
Berechne Variable Forest Land, Ereignis #22900 (239/250)
Berechne Variable Forest Land, Ereignis #22902 (240/250)
Berechne Variable Forest Land, Ereignis #22904 (241/250)
Berechne Variable Forest Land, Ereignis #22905 (242/250)
Berechne Variable Forest Land, Ereignis #29280 (243/250)
Berechne Variable Forest Land, Ereignis #29281 (244/250)
Berechne Variable Forest Land, Ereignis #29282 (245/250)
Berechne Variable Forest Land, Ereignis #29283 (246/250)
Berechne Variable Forest Land, Ereignis #29284 (247/250)
Berechne Variable Forest Land, Ereignis #29285 (248/250)
Berechne Variable Forest Land, Ereignis #29286 (249/250)
Berechne Variable Forest Land, Ereignis #29287 (250/250)
Datei 'C:\Program Files\Housesoft\Zentrales System Emissionen\tables\data\crf_exporter\reporter_import_files\Submission 2024\import files\4 LULUCF\4A.xml' wurde geschrieben (8250 Werte).
Vorgang beendet (00:14:18.6105558)
