Vorgang gestartet
Berechne Variable Oil, Ereignis #4296 (1/202)
Berechne Variable Oil, Ereignis #4297 (2/202)
Berechne Variable Oil, Ereignis #4298 (3/202)
Berechne Variable Oil, Ereignis #4306 (4/202)
Berechne Variable Oil, Ereignis #4311 (5/202)
Berechne Variable Oil, Ereignis #4312 (6/202)
Berechne Variable Oil, Ereignis #4314 (7/202)
Berechne Variable Oil, Ereignis #4315 (8/202)
Berechne Variable Oil, Ereignis #4317 (9/202)
Berechne Variable Oil, Ereignis #4318 (10/202)
Berechne Variable Oil, Ereignis #4319 (11/202)
Berechne Variable Oil, Ereignis #4320 (12/202)
Berechne Variable Oil, Ereignis #4321 (13/202)
Berechne Variable Oil, Ereignis #4323 (14/202)
Berechne Variable Oil, Ereignis #4324 (15/202)
Berechne Variable Oil, Ereignis #4325 (16/202)
Berechne Variable Oil, Ereignis #4326 (17/202)
Berechne Variable Oil, Ereignis #4327 (18/202)
Berechne Variable Oil, Ereignis #4328 (19/202)
Berechne Variable Oil, Ereignis #4329 (20/202)
Berechne Variable Oil, Ereignis #4330 (21/202)
Berechne Variable Oil, Ereignis #4332 (22/202)
Berechne Variable Oil, Ereignis #4333 (23/202)
Berechne Variable Oil, Ereignis #4334 (24/202)
Berechne Variable Oil, Ereignis #4336 (25/202)
Berechne Variable Oil, Ereignis #4339 (26/202)
Berechne Variable Oil, Ereignis #4340 (27/202)
Berechne Variable Oil, Ereignis #4342 (28/202)
Berechne Variable Oil, Ereignis #4344 (29/202)
Berechne Variable Oil, Ereignis #4345 (30/202)
Berechne Variable Oil, Ereignis #4346 (31/202)
Berechne Variable Oil, Ereignis #4347 (32/202)
Berechne Variable Oil, Ereignis #4348 (33/202)
Berechne Variable Oil, Ereignis #4349 (34/202)
Berechne Variable Oil, Ereignis #4351 (35/202)
Berechne Variable Oil, Ereignis #4352 (36/202)
Berechne Variable Oil, Ereignis #4353 (37/202)
Berechne Variable Oil, Ereignis #4354 (38/202)
Berechne Variable Oil, Ereignis #4355 (39/202)
Berechne Variable Oil, Ereignis #4357 (40/202)
Berechne Variable Oil, Ereignis #4359 (41/202)
Berechne Variable Oil, Ereignis #4360 (42/202)
Berechne Variable Oil, Ereignis #4361 (43/202)
Berechne Variable Oil, Ereignis #4362 (44/202)
Berechne Variable Oil, Ereignis #4363 (45/202)
Berechne Variable Oil, Ereignis #4364 (46/202)
Berechne Variable Oil, Ereignis #4366 (47/202)
Berechne Variable Oil, Ereignis #4367 (48/202)
Berechne Variable Oil, Ereignis #4368 (49/202)
Berechne Variable Oil, Ereignis #4370 (50/202)
Berechne Variable Oil, Ereignis #4371 (51/202)
Berechne Variable Oil, Ereignis #4375 (52/202)
Berechne Variable Oil, Ereignis #4376 (53/202)
Berechne Variable Oil, Ereignis #4377 (54/202)
Berechne Variable Oil, Ereignis #4378 (55/202)
Berechne Variable Oil, Ereignis #4382 (56/202)
Berechne Variable Oil, Ereignis #4384 (57/202)
Berechne Variable 1.B.2.a.vi. Other, Ereignis #31897 (58/202)
Berechne Variable 1.B.2.a.vi. Other, Ereignis #31898 (59/202)
Berechne Variable 1.B.2.a.vi. Other, Ereignis #31899 (60/202)
Berechne Variable Natural Gas, Ereignis #4393 (61/202)
Berechne Variable Natural Gas, Ereignis #4394 (62/202)
Berechne Variable Natural Gas, Ereignis #30718 (63/202)
Berechne Variable Natural Gas, Ereignis #4400 (64/202)
Berechne Variable Natural Gas, Ereignis #4402 (65/202)
Berechne Variable Natural Gas, Ereignis #4403 (66/202)
Berechne Variable Natural Gas, Ereignis #4404 (67/202)
Berechne Variable Natural Gas, Ereignis #4405 (68/202)
Berechne Variable Natural Gas, Ereignis #4406 (69/202)
Berechne Variable Natural Gas, Ereignis #4407 (70/202)
Berechne Variable Natural Gas, Ereignis #4408 (71/202)
Berechne Variable Natural Gas, Ereignis #4411 (72/202)
Berechne Variable Natural Gas, Ereignis #4412 (73/202)
Berechne Variable Natural Gas, Ereignis #4413 (74/202)
Berechne Variable Natural Gas, Ereignis #4414 (75/202)
Berechne Variable Natural Gas, Ereignis #4415 (76/202)
Berechne Variable Natural Gas, Ereignis #4416 (77/202)
Berechne Variable Natural Gas, Ereignis #4417 (78/202)
Berechne Variable Natural Gas, Ereignis #4418 (79/202)
Berechne Variable Natural Gas, Ereignis #4420 (80/202)
Berechne Variable Natural Gas, Ereignis #4423 (81/202)
Berechne Variable Natural Gas, Ereignis #4424 (82/202)
Berechne Variable Natural Gas, Ereignis #4425 (83/202)
Berechne Variable Natural Gas, Ereignis #4426 (84/202)
Berechne Variable Natural Gas, Ereignis #4429 (85/202)
Berechne Variable Natural Gas, Ereignis #4430 (86/202)
Berechne Variable Natural Gas, Ereignis #4431 (87/202)
Berechne Variable Natural Gas, Ereignis #4432 (88/202)
Berechne Variable Natural Gas, Ereignis #4433 (89/202)
Berechne Variable Natural Gas, Ereignis #4435 (90/202)
Berechne Variable Natural Gas, Ereignis #4437 (91/202)
Berechne Variable Natural Gas, Ereignis #4439 (92/202)
Berechne Variable Natural Gas, Ereignis #4440 (93/202)
Berechne Variable Natural Gas, Ereignis #4441 (94/202)
Berechne Variable Natural Gas, Ereignis #4442 (95/202)
Berechne Variable Natural Gas, Ereignis #4443 (96/202)
Berechne Variable Natural Gas, Ereignis #4444 (97/202)
Berechne Variable Natural Gas, Ereignis #4445 (98/202)
Berechne Variable Natural Gas, Ereignis #4446 (99/202)
Berechne Variable Natural Gas, Ereignis #4448 (100/202)
Berechne Variable Natural Gas, Ereignis #4449 (101/202)
Berechne Variable Natural Gas, Ereignis #4451 (102/202)
Berechne Variable Natural Gas, Ereignis #4452 (103/202)
Berechne Variable Natural Gas, Ereignis #4454 (104/202)
Berechne Variable Natural Gas, Ereignis #4455 (105/202)
Berechne Variable Natural Gas, Ereignis #4456 (106/202)
Berechne Variable Natural Gas, Ereignis #4457 (107/202)
Berechne Variable Natural Gas, Ereignis #4458 (108/202)
Berechne Variable 1.B.2.b.vi.1. Gas post-meter, Ereignis #31900 (109/202)
Berechne Variable 1.B.2.b.vi.1. Gas post-meter, Ereignis #31901 (110/202)
Berechne Variable 1.B.2.b.vi.1. Gas post-meter, Ereignis #31902 (111/202)
Berechne Variable 1.B.2.b.vi.1. Gas post-meter, Ereignis #31903 (112/202)
Berechne Variable 1.B.2.b.vi.1. Gas post-meter, Ereignis #31904 (113/202)
Berechne Variable 1.B.2.b.vi.1. Gas post-meter, Ereignis #31905 (114/202)
Berechne Variable 1.B.2.b.vi.1. Gas post-meter, Ereignis #31906 (115/202)
Berechne Variable 1.B.2.b.vi.1. Gas post-meter, Ereignis #31907 (116/202)
Berechne Variable 1.B.2.b.vi.1. Gas post-meter, Ereignis #31908 (117/202)
Berechne Variable 1.B.2.b.vi.2. Abandoned wells, Ereignis #31910 (118/202)
Berechne Variable 1.B.2.b.vi.2. Abandoned wells, Ereignis #31911 (119/202)
Berechne Variable 1.B.2.b.vi.2. Abandoned wells, Ereignis #31912 (120/202)
Berechne Variable 1.B.2.b.vi.2. Abandoned wells, Ereignis #31913 (121/202)
Berechne Variable 1.B.2.b.vi.2. Abandoned wells, Ereignis #31914 (122/202)
Berechne Variable 1.B.2.b.vi.2. Abandoned wells, Ereignis #31915 (123/202)
Berechne Variable 1.B.2.b.vi.2. Abandoned wells, Ereignis #31916 (124/202)
Berechne Variable 1.B.2.b.vi.2. Abandoned wells, Ereignis #31917 (125/202)
Berechne Variable 1.B.2.b.vi.2. Abandoned wells, Ereignis #31918 (126/202)
Berechne Variable Venting and Flaring, Ereignis #4477 (127/202)
Berechne Variable Venting and Flaring, Ereignis #4480 (128/202)
Berechne Variable Venting and Flaring, Ereignis #4481 (129/202)
Berechne Variable Venting and Flaring, Ereignis #4484 (130/202)
Berechne Variable Venting, Ereignis #10817 (131/202)
Berechne Variable Venting, Ereignis #10818 (132/202)
Berechne Variable Venting, Ereignis #10820 (133/202)
Berechne Variable Venting, Ereignis #10821 (134/202)
Berechne Variable Venting, Ereignis #10822 (135/202)
Berechne Variable Venting, Ereignis #10823 (136/202)
Berechne Variable Venting, Ereignis #10826 (137/202)
Berechne Variable Venting, Ereignis #10827 (138/202)
Berechne Variable Venting, Ereignis #10873 (139/202)
Berechne Variable Venting, Ereignis #4507 (140/202)
Berechne Variable Venting, Ereignis #4508 (141/202)
Berechne Variable Venting, Ereignis #4509 (142/202)
Berechne Variable Venting, Ereignis #4510 (143/202)
Berechne Variable Venting, Ereignis #4511 (144/202)
Berechne Variable Venting, Ereignis #4513 (145/202)
Berechne Variable Venting, Ereignis #4516 (146/202)
Berechne Variable Venting, Ereignis #4517 (147/202)
Berechne Variable Venting, Ereignis #4518 (148/202)
Berechne Variable Venting, Ereignis #10829 (149/202)
Berechne Variable Venting, Ereignis #10830 (150/202)
Berechne Variable Venting, Ereignis #10833 (151/202)
Berechne Variable Venting, Ereignis #10834 (152/202)
Berechne Variable Venting, Ereignis #10835 (153/202)
Berechne Variable Venting, Ereignis #10836 (154/202)
Berechne Variable Venting, Ereignis #10837 (155/202)
Berechne Variable Venting, Ereignis #10838 (156/202)
Berechne Variable Flaring, Ereignis #10841 (157/202)
Berechne Variable Flaring, Ereignis #10842 (158/202)
Berechne Variable Flaring, Ereignis #10843 (159/202)
Berechne Variable Flaring, Ereignis #10844 (160/202)
Berechne Variable Flaring, Ereignis #10845 (161/202)
Berechne Variable Flaring, Ereignis #10847 (162/202)
Berechne Variable Flaring, Ereignis #10848 (163/202)
Berechne Variable Flaring, Ereignis #10849 (164/202)
Berechne Variable Flaring, Ereignis #10852 (165/202)
Berechne Variable Flaring, Ereignis #10854 (166/202)
Berechne Variable Flaring, Ereignis #10855 (167/202)
Berechne Variable Flaring, Ereignis #10856 (168/202)
Berechne Variable Flaring, Ereignis #4558 (169/202)
Berechne Variable Flaring, Ereignis #4561 (170/202)
Berechne Variable Flaring, Ereignis #4562 (171/202)
Berechne Variable Flaring, Ereignis #4563 (172/202)
Berechne Variable Flaring, Ereignis #4565 (173/202)
Berechne Variable Flaring, Ereignis #4566 (174/202)
Berechne Variable Flaring, Ereignis #4568 (175/202)
Berechne Variable Flaring, Ereignis #4569 (176/202)
Berechne Variable Flaring, Ereignis #4570 (177/202)
Berechne Variable Flaring, Ereignis #4571 (178/202)
Berechne Variable Flaring, Ereignis #4572 (179/202)
Berechne Variable Flaring, Ereignis #4573 (180/202)
Berechne Variable Flaring, Ereignis #10857 (181/202)
Berechne Variable Flaring, Ereignis #10858 (182/202)
Berechne Variable Flaring, Ereignis #10861 (183/202)
Berechne Variable Flaring, Ereignis #10862 (184/202)
Berechne Variable Flaring, Ereignis #10865 (185/202)
Berechne Variable Flaring, Ereignis #10866 (186/202)
Berechne Variable Flaring, Ereignis #10869 (187/202)
Berechne Variable Flaring, Ereignis #10872 (188/202)
Berechne Variable Other emissions from energy production, Ereignis #17093 (189/202)
Berechne Variable Other emissions from energy production, Ereignis #17095 (190/202)
Berechne Variable Other emissions from energy production, Ereignis #17096 (191/202)
Berechne Variable Other emissions from energy production, Ereignis #17097 (192/202)
Berechne Variable Other emissions from energy production, Ereignis #17098 (193/202)
Berechne Variable Other emissions from energy production, Ereignis #17099 (194/202)
Berechne Variable Other emissions from energy production, Ereignis #17100 (195/202)
Berechne Variable Other emissions from energy production, Ereignis #17101 (196/202)
Berechne Variable Other emissions from energy production, Ereignis #17102 (197/202)
Berechne Variable Other emissions from energy production, Ereignis #17103 (198/202)
Berechne Variable Other emissions from energy production, Ereignis #17104 (199/202)
Berechne Variable Other emissions from energy production, Ereignis #17105 (200/202)
Berechne Variable Other emissions from energy production, Ereignis #17106 (201/202)
Berechne Variable Other emissions from energy production, Ereignis #17107 (202/202)
Datei 'C:\Program Files\Housesoft\Zentrales System Emissionen\export\UNFCCC CRT Reporting Tool\files\Submission 2025\1 Energy\1B2.xml' wurde geschrieben (6868 Werte).
Vorgang beendet (00:03:58.3382814)
