REGION;CATEGORY;TYPE;SUBSTANCE;TS:ID;TS:NAME;UNIT;1990;1991;1992;1993;1994;1995;1996;1997;1998;1999;2000;2001;2002;2003;2004;2005;2006;2007;2008;2009;2010;2011;2012;2013;2014;2015;2016;2017;2018;2019;2020;2021
FR;1A1a;EM;CO2;FR_EM_1A1a_CO2;;kt;49388,48670822149;50472,30855136345;51531,83921793443;39532,29939882057;35781,88153964869;38384,15968624039;42486,30423720878;38266,90601017331;50843,49722648724;44856,07898500778;44662,02514350609;38387,78596004909;42548,89466493226;45956,21684070434;44718,96903682839;50347,56320563667;46191,67120598048;46121,75101548873;45203,85581863629;44407,34351933842;46432,92982066509;41518,11391814018;45958,40527008161;44829,46568647827;31628,04661310771;34833,52055207467;38746,93176526351;43075,98072000825;34445,86477810497;33205,10013020908;30836,41535610821;32796,51157356241
FR;1A1b;EM;CO2;FR_EM_1A1b_CO2;;kt;11935,464731726343;12254,4764905404;12313,183592258489;12525,790709907817;12969,801946757945;13144,704695453358;13649,730438814622;14420,63163737523;14178,226612852768;13650,389446908815;13585,090237593917;13621,400359370084;12975,261614995434;12929,9575528221;13266,965451768636;13288,2932097341;13422,77764883927;13233,69009042221;13036,515050891967;12362,686476755318;10915,437119283877;10582,137459736465;8618,461074255842;8052,556556364385;7926,145169497235;7611,231180946801;7353,900394049887;6831,376209398195;6224,08381821717;6226,034539646181;5095,405081815184;4892,826760908868
FR;1A1c;EM;CO2;FR_EM_1A1c_CO2;;kt;4738,458306459368;4801,69904209848;4778,709244411735;4372,532839118644;4232,15588556618;4205,172424228788;4257,484288208316;4144,51756276912;4352,898440703149;4416,838103141747;4331,209608461293;4107,980895499478;3917,1097745880766;3960,7350956677524;3735,6024429953836;3508,0933966825996;3513,2481051432633;3454,129729063684;3362,0068004526215;3053,0985561618;2972,31415260753;2949,72943094671;2710,74110266792;2807,60013091023;2953,75762191675;2933,37368665918;2853,96998076641;2966,24773358506;2920,15981477509;2841,36578331378;2101,34971229517;2160,11301808719
FR;1A2a;EM;CO2;FR_EM_1A2a_CO2;;kt;9339,08425367425;10250,454070457099;9527,01456174476;8832,877830528283;8692,34626159539;8505,222123844973;8729,474357127823;9132,679756859206;9617,027395649464;9468,01728464378;10402,596726475504;9904,856669378456;9939,240916816427;10347,015049308573;9246,10755098105;9989,104545449267;9149,667943567476;9817,86977717577;10195,78951000021;7457,73300914723;8976,705323464606;7918,812949891019;8179,609776076703;7981,621385880779;8957,071830099036;9320,915682565374;8838,304571107745;8967,696923904494;9597,65004512183;8743,939638981054;6941,748274111772;6771,451952656774
FR;1A2b;EM;CO2;FR_EM_1A2b_CO2;;kt;2472,322134149414;3516,105187265629;3129,601851488462;1855,669791837372;1861,170293446386;2023,616800638789;2195,749670564938;2012,238305854457;1782,630696731865;1999,200571287969;1858,300313093622;2049,668408170588;1756,465985095584;1563,1374569440493;1298,505779815092;1210,3986772519631;1528,8857600058805;1425,776448313292;1383,498897808953;1134,5720624731273;1154,0073674467903;871,7712851573119;860,9133146711566;922,0126428527506;932,9902251186115;1024,3573953619805;1181,9405240043009;941,4638592865246;807,6125131029609;804,3920062642898;884,9331576131977;903,0848476187876
FR;1A2c;EM;CO2;FR_EM_1A2c_CO2;;kt;14759,909598575792;18612,08321101564;16112,226684741829;15566,754572083952;17376,11731018041;18073,10593737349;18922,043283753115;18894,523788169263;16342,72990134677;16685,221280450816;16787,246691171968;19412,41149689301;17161,17949835684;17449,47287410411;16050,90761005078;17042,5660318012;15952,62593930545;15788,71685681948;15567,74255970734;14567,29301025095;15064,169166020873;14520,100106315867;14068,844348947301;13729,94989914314;12568,71500198769;11728,60105990138;11553,89204763179;10663,96718305826;11114,28514252148;10278,47779653169;10414,03193934804;10727,52318485017
FR;1A2d;EM;CO2;FR_EM_1A2d_CO2;;kt;4449,05833885161;5587,35444062292;4990,59758969655;4758,531207253623;5067,84118815314;5146,425831360775;5447,669789086949;5399,09940009786;5418,052836403869;5240,522201715789;5197,4209693136545;5005,0212065847;4506,678629872879;4587,046311423911;4211,391881742491;3985,289128403374;3916,695691302604;3569,812958829791;3157,560584835528;2692,983432836404;2865,678215609521;2388,092830719624;2425,2317469038185;2801,531443979714;2648,0097573015814;2572,6998207083407;2652,1295432533743;2440,779000970232;2470,805284157377;2343,014088441679;2254,274153414235;2441,003157007896
FR;1A2e;EM;CO2;FR_EM_1A2e_CO2;;kt;8524,06743459717;10446,0442493921;9540,717256489079;9954,233405498899;9932,92573610047;10681,10320489989;10570,88977669745;10352,44094988404;10327,08342778191;10771,81595560019;9906,098758824339;10268,680496282479;10233,87471823667;9890,713514558669;9353,57487539283;10036,227574032286;10178,84618128508;10233,986213519833;9427,984697045411;8568,390793365741;9658,828343333938;8994,736151442577;8494,42455624752;8716,770245879996;8506,009008466912;8429,18436905566;8571,353466501685;7994,297761665728;8169,071434424255;8151,168040932232;7620,687046450212;8232,177438149034
FR;1A2f;EM;CO2;FR_EM_1A2f_CO2;;kt;15223,059550621982;18271,71649143272;14766,146156043524;13472,164849815874;14589,769370114465;14191,151124911055;14049,338116734725;13261,197924274615;13142,356497350498;13515,617644967946;12866,29198099388;13789,12839400457;12590,610548502898;12563,361129539138;12619,230238988484;12515,888802904885;13327,3282260834;13312,822179789073;12764,09435374812;11470,95321864271;11781,08852509079;11331,6343067023;10838,40165606982;10103,66801037835;9802,64122707925;9205,258913834976;9449,601056559219;9027,090560041746;9574,234674355072;9490,880801274789;8926,680396500495;9552,36551555902
FR;1A2g;EM;CO2;FR_EM_1A2g_CO2;;kt;10702,89407358791;12026,539795359731;11001,63855364735;12197,701547354694;10207,21666417467;11474,785457232494;12244,93893464662;11176,381887367677;12657,02922392607;12148,007168490698;11188,577774295016;12833,27763778613;13156,525053799827;13039,852367931644;12493,19546483184;12243,193796735326;11565,468374017917;10700,067840579646;10416,548665446287;8379,022244795184;8656,32394207;8689,77908907155;8505,749229086365;8828,43902315597;8088,0271199396;8263,245885904189;8198,364462719694;8308,563613429385;8219,827401040402;8331,702934268507;7873,917655382198;8224,873229626019
FR;1A3a;EM;CO2;FR_EM_1A3a_CO2;;kt;4190,61235744131;4289,1025111138815;4239,24124431853;4226,109746354473;4405,391201592772;5012,014082620782;5555,295986613228;5692,083571172958;5881,466535272983;6043,058851577498;6220,487451095012;5850,4158339819605;5651,562784730615;5143,106213147947;5191,938385158709;5019,474218603985;4788,680486899868;4712,162833106834;4724,608891130297;4666,657873875224;4614,536904681462;4658,59203039069;4681,04723350227;4617,573107994008;4436,55744865388;4424,274816717726;4567,269981129828;4719,435259501616;4965,063168968514;5050,017566721518;3100,016660203692;3820,444486828452
FR;1A3b;EM;CO2;FR_EM_1A3b_CO2;;kt;114540,62784515611;117034,10113467569;121608,96432175247;121741,37078742201;122472,68729355416;123621,23979828059;124582,22767823249;126774,41759123383;128809,85782495949;131643,01690325243;131192,30182888097;134392,2489114699;135264,69965167606;135157,8461640532;135531,88723985967;133496,7280754443;133380,1601571914;132183,27193756425;125770,86565330255;125514,44334505912;126387,5444155382;127254,16488618188;125559,75293152766;125274,71540584815;125173,00323698175;126699,11424032963;126988,41095719856;126959,24935275486;124132,67249663192;123357,8881107042;104932,42166599675;118060,98774468807
FR;1A3c;EM;CO2;FR_EM_1A3c_CO2;;kt;1078,43065595243;1044,62909807929;994,731560266569;920,421786212136;854,696534792149;816,60271560179;790,849147698448;783,337690393307;745,512137535274;751,14573051413;764,559047130454;727,001760604747;748,463067190865;716,271107311688;705,540454018629;638,47387093701;614,0568286845307;575,5624504166167;583,4975503305286;530,3496663954917;502,27572470966095;512,2276729187728;490,7350092482031;484,9094253187974;411,91349518905736;458,5574801894656;381,63705781699235;403,33845779781655;358,7507476062661;359,54169503963584;300,523126715644;343,0593255919824
FR;1A3d;EM;CO2;FR_EM_1A3d_CO2;;kt;1334,1189683064777;1313,613554883666;1305,6812262304527;1226,070100740499;1221,5649210654174;1290,9942429654084;1274,4963055386013;1332,456053808412;1404,527231659947;1486,2743716660664;1402,5251163017717;1413,1051379642563;1544,645530610899;1569,7824334959662;1564,9298811739116;1476,328783397289;1421,9568438866133;1397,1997127868112;1339,1792831029913;1361,1525451747068;1402,561618796428;1397,4196747013389;1440,5603975446031;1437,2449695957384;1423,8289560414469;1445,6835190815802;1418,9590468172785;1440,9001417116667;1464,45144064064;1470,618700594485;1435,8025306109757;1424,7353240464479
FR;1A3e;EM;CO2;FR_EM_1A3e_CO2;;kt;210,4950078;250,589295;270,6364386;230,5421514;367,86508506;377,688185424;479,527674912;427,806044424;424,398030012;532,811841408;483,46255188;445,52633418216;576,152672520574;662,163147044973;834,468352811312;926,365539947052;740,551126864802;651,820316163187;662,887929091917;616,13333663924;538,981804969446;501,168803397667;533,696110639258;490,189285616385;461,1038557145;423,934064821658;388,993710594083;366,285376482757;376,324381400134;459,844879639952;309,786293643732;238,213943764093
FR;1A4a;EM;CO2;FR_EM_1A4a_CO2;;kt;26620,3929452464;28899,7317669879;27520,16943896449;26238,22646540336;24768,076665199518;25040,704274977474;27423,038714305043;25758,45581120324;27145,527845437937;27735,129387607532;25727,41634698413;26792,18790163213;24111,941330131824;27361,791833346622;27680,61239446442;27108,683673934618;24629,458792648915;24380,99658645461;25813,01566468721;28110,655758316505;28417,917381297702;21140,21296620456;23318,965179051553;24568,152800390977;21309,50527847492;22421,766630001017;22006,908148417708;22808,12114454952;22100,462439820814;21614,95773550849;20079,253805448487;21435,437919999207
FR;1A4b;EM;CO2;FR_EM_1A4b_CO2;;kt;54003,24243779369;60657,32456730426;59751,27539904119;58060,08682593535;54888,96142865616;54419,41887397902;60246,004819859416;56734,86975259562;59001,31769704062;60156,10795710773;58223,22858110218;62069,33017021424;59649,96305935058;60702,13169653297;64424,7028522034;63636,87208440435;61154,98154870715;53728,925882875985;58749,09185709116;58867,46514701881;56659,16346972956;49499,34307925333;53820,86513654742;54996,83822161022;42877,623687424784;44907,82755615493;46021,22053222269;45035,152717907884;41668,26779184535;40304,39087741487;38261,037449063406;40491,02086097623
FR;1A4c;EM;CO2;FR_EM_1A4c_CO2;;kt;11256,41876022977;11385,102671308812;11531,902474235867;11815,605226700618;11564,812330334009;11588,930283943097;11848,907597587242;11800,249269571363;12038,152657569886;12140,966175007361;12186,316142863165;12332,28721086255;11912,715588195982;11766,343363678216;12263,351247452309;11947,396193465012;11546,086935119827;11325,025626414754;11550,609453439121;11643,73130965981;11252,981922381014;11137,609377786352;10609,909278054449;11115,750870522597;11091,037569438475;10936,298546351778;10242,125242597072;10008,760735533942;10004,276130563354;9908,011521557832;10959,88355987346;10564,108464835434
FR;1A5a;EM;CO2;FR_EM_1A5a_CO2;;kt;4464,24560772307;4109,97591665254;2803,982832966719;2341,415578282308;1077,2800448717962;593,565328537353;981,8577464998679;1424,1619121067624;2052,7226888264245;2002,041750928067;1957,6646900775593;2096,99024826194;2665,7524760503757;2875,162334781255;2875,1791347812564;2625,9476602555387;2648,174769711787;2518,8249356740207;2534,357826664154;2256,6762406888083;2258,219699642879;2650,6152092776583;2283,6476938270134;2232,7025532465686;2118,897452406361;2036,6778743920959;1346,6932294861308;1324,0206880034402;1417,4866319497087;1607,87474755412;1475,0752304544335;2130,7385840398892
FR;1B1a;EM;CO2;FR_EM_1B1a_CO2;;kt;NA;NA;NA;NA;NA;NA;NA;NA;NA;NA;NA;NA;NA;NA;NA;NA;NA;NA;NA;NA;NA;NA;NA;NA;NA;NA;NA;NA;NA;NA;NA;NA
FR;1B1b;EM;CO2;FR_EM_1B1b_CO2;;kt;NA;NA;NA;NA;NA;NA;NA;NA;NA;NA;NA;NA;NA;NA;NA;NA;NA;NA;NA;NA;NA;NA;NA;NA;NA;NA;NA;NA;NA;NA;NA;NA
FR;1B2a;EM;CO2;FR_EM_1B2a_CO2;;kt;2983,0710452456497;2926,8258225130567;3046,360436474445;2807,417871036509;3056,5475898087648;3042,3881084837926;3302,0440723872966;3319,7111472234137;3327,3333286248067;3138,6402857192384;3242,63471918825;3268,0047551197167;3071,2868418869843;3079,878667663561;3152,2308399675326;3091,446411483569;3393,23195864629;3732,005388241375;4082,8415566475983;3846,4730175179943;3432,29728765977;3396,663277355093;2759,7152078783324;2602,197555968626;2629,27821617259;2522,2556244733096;2507,8206753777913;2436,2230925235635;2463,2024442909337;2097,9032498593797;1764,5598631203727;1386,6874121946494
FR;1B2b;EM;CO2;FR_EM_1B2b_CO2;;kt;818,4271996944024;950,3248348788089;857,9726065506895;903,2881550127207;909,1016215252167;855,9539935315312;753,8025797813452;690,9070724881939;613,8288500633499;540,6531496375812;596,1326912455769;515,4260395128529;502,9134615564435;444,6191611643372;412,04919675327386;334,4577287855545;343,79034359832184;315,39544133301445;313,943369843718;302,2360110081843;290,24679463389515;202,8847263050484;205,83412343202954;152,43887446900018;13,58014690443292;32,49303146031654;35,80347004632632;34,98588239704194;29,88854338765341;34,3409136499731;33,10161701929333;32,8205173108038
FR;1B2c;EM;CO2;FR_EM_1B2c_CO2;;kt;560,0385795702578;587,6466793812157;563,5408099151621;559,6342162500471;574,2703526123838;522,8276390442428;536,9984813068722;530,2739814650027;516,0151449399167;468,0842603804766;457,6452342266153;476,58523268543837;437,86387722285826;448,5555636928548;439,5821989970375;583,338603781557;580,1556663913858;577,9097111570414;514,2187173413582;481,46103626851846;498,8188397674578;391,4803107224177;436,73021167809225;381,93471116583237;405,6976762981846;391,0865761426372;414,1761312574267;430,8582073718323;504,4223876459319;455,6151167186738;406,1402014440612;335,42694688873195
FR;2A1;EM;CO2;FR_EM_2A1_CO2;;kt;10937,2990894559;10386,0810333028;9343,43451034131;8591,86888287462;8775,43341156502;8635,39989967834;8435,57679844679;8111,45428778775;8686,27349762968;8386,27661074137;8560,92514803824;8655,3297627933;8642,74248082596;8555,68044721851;9064,84163120923;9108,28453820269;9307,09851753533;9477,92113092897;8879,58403152867;7679,22875147584;7887,5415317117;8065,2480440053;7501,86008707807;7299,551;6974,6197;6606,09357;6639,023;6483,218340261;6701,300268343;6806,67191492722;6197,2294527018;6494,58980628435
FR;2A2;EM;CO2;FR_EM_2A2_CO2;;kt;2711,8689552905;2637,26325605175;2293,12635614771;2305,70370894652;2532,88493323364;2510,50468303473;2488,95778074929;2483,1118261375;2559,52454085801;2548,0130963676;2583,95912647236;2413,00183340951;2368,89376801455;2427,20011277053;2475,32480905232;2337,6840975665;2497,47940626896;2438,83738542286;2448,77325597643;1993,56495683313;2210,69239413452;2280,95072862855;2194,69415428832;2428,11463275501;2375,06369986936;2208,46867307055;2086,06867448487;2109,4882487853;2245,84372192429;2216,5890854238;1967,93060704782;2301,28472173483
FR;2A3;EM;CO2;FR_EM_2A3_CO2;;kt;801,67049;793,7425;783,29814;711,955295;748,49779;788,64686;773,943985;804,28528;800,68111;784,36596;782,09971;757,292135;819,2318;756,693444166667;713,368114431383;694,740773519174;696,069984105473;684,644683708859;609,362548636808;516,039501207296;544,537011;583,996439;522,625391;510,1067025512;495,999637;498,783224232;494,031454696;535,558712613996;561,691238292598;539,967342046127;468,907634837396;514,678936344519
FR;2A4;EM;CO2;FR_EM_2A4_CO2;;kt;488,089106313248;469,566246172183;478,306315832455;495,546313721371;483,007809255575;495,802725826624;467,860007142858;486,732829730318;495,443434553669;422,525849607994;410,2839193628996;451,36449266593;443,861273848786;399,5211707010337;524,927320484658;477,410137874549;476,382505214486;521,106673170987;428,601418995044;360,508608116533;377,434532720164;405,178048396396;376,782886942416;383,784808098519;388,84713229173;374,207505905694;375,788202505849;372,980883316117;427,60583478048;452,281978833798;420,94878120195;429,675725585468
FR;2B1;EM;CO2;FR_EM_2B1_CO2;;kt;2019,32995653953;2013,49589760648;1847,92201681075;1888,17930928706;1875,56838742193;1860,25413992521;1915,03715035949;1881,93535456441;1862,28329781136;1811,66231078086;1902,76975814467;1689,31156524355;1375,34591503879;1357,87893114799;1315,88531569697;1494,14016175743;936,445153333657;1200,96824117574;1260,92509588947;1249,1312247223;976,098485822943;938,43666862799;1057,318955732;1090,34832228805;1043,68860664496;1155,27673273019;1186,6371494929;1195,25394469356;1378,42368331;1462,71276311743;1325,01439941409;1201,78353169479
FR;2B3;EM;CO2;FR_EM_2B3_CO2;;kt;25,1300457153738;24,8286169242448;24,5383471829213;23,2569387046652;27,4036685016279;28,7094117752427;28,059766851632;30,3286840144742;29,5751120366518;31,9893657397306;37,7018581154121;35,7429743122235;38,6056067032662;39,3142735891006;39,6077421942385;37,6751109243432;39,255016774028;37,8274907649883;35,6534421826955;29,4674416077837;32,5879733327658;32,34953040977;29,2545387238063;21,9745123486669;19,3009152484472;21,2883619757782;23,5063;19,4791308;21,03329569;20,2753331790264;12,5436386034437;21,5092146174732
FR;2B5;EM;CO2;FR_EM_2B5_CO2;;kt;158,267327027027;152,348408108108;145,901489189189;139,98257027027;130,713362651351;120,964887232432;104,418660413513;101,315949394594;91,9043852756756;91,5690597567566;78,9891304378377;65,9662362;56,6542754;21,49015605;19,0260367;22,6336803;15,0182868;19,7572617;17,5225908;17,4312138;22,6769708;24,3036805;26,0535;20,381878;19,1098281;20,2008334;23,962928;27,191252;27,450588;26,9973;21,600843;27,6703669
FR;2B6;EM;CO2;FR_EM_2B6_CO2;;kt;5,66625167929884;5,66625167929884;5,66625167929884;5,66625167929884;5,66625167929884;5,66625167929884;5,66625167929884;5,66625167929884;5,66625167929884;5,66625167929884;5,66625167929884;5,82082106063466;5,82082106063466;5,82082106063466;6,20305446996926;5,79001454492563;6,83346970285714;6,91468157142857;6,61414185714286;4,53137842857143;4,88583214285714;6,71676228571429;5,86728028571429;7,91784434285714;6,79198985142857;6,691338;6,417899;6,09245184;6,5104896;6,1867008;6,40561152;6,40561152
FR;2B7;EM;CO2;FR_EM_2B7_CO2;;kt;397,225741482745;394,012049837131;390,798358191518;387,584666545904;384,370974900291;381,157283254677;377,943591609064;374,72989996345;371,516208317836;302,7169104812;302,7169104812;327,7578;331,6516;282,678;359,5044;361,4364;350,709;353,0878;356,326301;300,4643;341,161;293,524482;295,862154;282,6448;340,997979;320,71034512;315,7899515;335,731037;293,776192;278,703552;245,405946;243,349663
FR;2B8;EM;CO2;FR_EM_2B8_CO2;;kt;375,8050688435691;313,4927184165294;323,5515973599269;310,727656045642;347,058627267315;382,6309766372899;368,3896253780171;373,0790996948988;394,6482088991363;397,9585204688583;398,9860981925178;370,0746306180831;342,1902779305087;343,6646018173574;367,0826867386176;404,6288076033661;358,0055764871091;361,0563045774515;284,9070797689914;240,4192676891741;241,8080757612784;214,6217807329315;176,893451440669;193,9033844523225;173,9056684238037;217,105607266429;230,2082889098551;203,5791007855803;198,8458671631572;181,6292030529774;141,800825454296;193,5332487195141
FR;2B10;EM;CO2;FR_EM_2B10_CO2;;kt;4561,05146328418;4867,88117615457;4970,36461895573;4813,74187912262;5341,02321754899;5087,74503493393;5514,84457725275;5701,87120764339;5751,60344726739;5762,68549254684;5804,16670084986;6073,85389177011;5777,95322213877;5660,89378211219;5907,41967002657;5865,20293639827;5879,30083653526;5896,45246078312;5473,72618888558;4670,16015696361;4883,91098776106;4943,20331438753;4797,7032081425;4694,63691438897;5167,0425096178;4950,30032846109;4742,10186990897;5064,43554195521;4641,67857380064;4747,84403872803;4531,61117497678;4726,6959833804
FR;2C1;EM;CO2;FR_EM_2C1_CO2;;kt;15787,5454112821;15034,1596158143;14292,5464266824;14321,7351322617;14147,6158174529;13608,2923238729;12869,5333768144;13997,460567296377;13847,016497897916;14470,460293868535;14733,025239593055;13668,303638318;15134,5325010555;14476,8767311141;15734,76219569;15663,9818780637;17276,6298354567;17510,8357046153;14736,9942569891;8832,36823435282;11717,4305433758;11178,020082301768;10239,031911898954;12202,9663503475;11639,3071418514;10969,7859320771;11225,0426217105;12573,0635941328;11914,6594145855;11143,9247195728;8676,78902444775;11172,4299162849
FR;2C2;EM;CO2;FR_EM_2C2_CO2;;kt;1488,88493263251;1567,52988840121;1556,72169513494;1599,95446819999;1611,45978993193;1629,37944100924;1593,11680553825;1609,91364159021;1651,71297830111;1645,78740496131;1698,15441845785;1449,76447913944;1454,89042507716;1480,01582216565;1192,61372316462;1234,11837481277;1454,18591374172;1293,28836043017;1293,62660020586;970,926457162796;1311,59906977496;1403,02493855712;1304,7340338272;1231,42979825642;1396,95313998921;1356,53880408178;1506,03079012373;1521,93468752978;1613,0806286329;1397,06381097458;992,696775225836;1149,61978662703
FR;2C3;EM;CO2;FR_EM_2C3_CO2;;kt;533,646;473,752;694,803;656,284;595,3;578,248;595,476;633,81;663,076;723,325;719,894;753,181;786,909;748,118;714,175;698,061421932636;711,819211699538;681,357484576084;635,722563058589;569,198;597,191;548,841582308676;567,79572283915;569,49562357;606,63613476371;657,754170675925;680,700851558687;678,198375642563;628,61722863806;666,790677824025;669,885027152465;689,623133499554
FR;2C4;EM;CO2;FR_EM_2C4_CO2;;kt;IE;IE;IE;IE;IE;IE;IE;IE;IE;IE;IE;IE;IE;IE;IE;IE;IE;IE;IE;IE;IE;IE;IE;IE;IE;IE;IE;IE;IE;IE;IE;IE
FR;2C6;EM;CO2;FR_EM_2C6_CO2;;kt;10,5490484856934;10,6663368645819;11,385805514633;11,2902689285126;11,1827411982247;81,8422897617565;78,7867750945376;78,8063014865963;87,343985434595;103,313500386697;92,4987022859831;99,4244307150651;106,89505472768;107,223584145539;72,4373743688401;65,0383221366502;52,6349428099279;57,699700837967;60,1777758364074;28,5107608738113;72,0436464182778;68,7905614165567;64,2857995402391;62,8288388664517;68,4272653295449;61,3172444909277;63,7114220219962;72,429134367463;74,8588429893554;75,3840994495522;72,9330522310343;79,3452057805194
FR;2C7;EM;CO2;FR_EM_2C7_CO2;;kt;83,9153232364634;80,8373232364634;85,9281940670945;71,5641940670945;79,7721940670945;90,0321940670945;87,4671940670945;86,4411940670945;91,0581940670945;98,7531940670945;101,318194067095;40,4250940670945;15,6471940670945;15,6471940670945;15,6471940670945;15,6471940670945;15,9001770004944;16,0098804477381;15,3814515727069;13,7150865689653;14,8538752195016;15,6676716759035;15,4430401608348;14,445612965328;13,919401264904;13,4459040149663;12,7670246311798;13,1092190950362;13,3762709476802;12,5936429933392;10,9372354877795;13,953334917084
FR;2D1;EM;CO2;FR_EM_2D1_CO2;;kt;563,056119329319;542,057581291187;528,869252693002;506,788566757397;517,229947681459;523,869692511701;508,288212765788;518,392094480031;537,56469460966;529,173061525828;538,198373533077;520,637099919639;509,704930564382;482,349690776939;477,69801510943;465,627219627083;445,411779337614;446,290508707245;415,765639455061;364,445099724795;374,824290233425;385,252251425098;367,566509146084;359,026547233632;352,14024034656;349,892116455945;348,969297486338;337,211773468489;343,108510955676;324,21327449204;326,182081891272;335,744692300802
FR;2D2;EM;CO2;FR_EM_2D2_CO2;;kt;54,2573776239222;49,4003780372863;51,2527285594234;41,5102099266339;43,9744472531955;49,4973986679763;54,4138687496302;37,9262132909014;123,630648788866;106,543576208466;70,4448233297749;96,8231650086739;77,8553946423192;103,638043176082;117,779130002804;93,2672297672933;101,881834259216;178,652482092143;101,939876126855;79,2286409967864;82,3092485401783;93,9921514885416;46,6899694420053;17,8158737788759;12,9035753199555;33,8137059563136;33,190475697234;40,5631367093621;41,9803639985221;38,495419558668;34,3128184661649;40,4519234777545
FR;2D3;EM;CO2;FR_EM_2D3_CO2;;kt;437,927960789003;479,686001254733;417,922673117972;527,199149887924;481,422161618541;484,318275029222;518,432518286187;487,372506962339;530,944938002753;491,157887510128;512,309345984834;487,113372571821;361,943922987572;350,562161172423;471,867764315308;548,426447531223;412,761367624093;547,629297137922;491,829930328259;462,154569277919;514,301815833783;456,225115465589;466,909235524305;576,627828004768;617,382664373014;501,25095806338;538,761210231754;340,551230563587;407,500771936748;342,420497681176;359,844713788086;631,866193204234
FR;2G4;EM;CO2;FR_EM_2G4_CO2;;kt;29,8122;43,22472;34,97296;45,05556;34,29184;41,76084;42,97084;22,1188;22,74844;18,62532;20,81408;28,22628;40,44048;46,47652;46,7148;55,67816;51,759;46,065;54,656;46,387;35,238;32,854397;47,722;50,322131;17,816014;21,208413;19,274911;29,76379;18,6525130217391;3,988277118;4,057093186;12,565812252
FR;2H;EM;CO2;FR_EM_2H_CO2;;kt;0,04372795367749;0,04372795367749;0,04372795367749;0,04372795367749;0,04372795367749;0,04372795367749;0,04372795367749;0,04372795367749;0,04372795367749;0,04372795367749;0,04372795367749;0,04372795367749;0,04372795367749;0,04372795367749;0,04372795367749;0,04372795367749;0,04372795367749;0,04372795367749;0,04372795367749;0,04372795367749;0,04372795367749;0,04372795367749;0,04372795367749;0,04387000842039;0,04486692361501;0,06019240372489;0,066429668209;0,06314247321741;0,0553086179157;0,06395596064;0,102771072;0,116168311
FR;3G;EM;CO2;FR_EM_3G_CO2;;kt;915,320640058151;891,072252893781;757,660854994741;902,281812731131;919,504411551209;1048,784485269862;994,619003275214;1170,847242602212;1117,145935573592;1081,339852552186;955,337916714539;928,965396833937;950,701930668842;987,287706166836;960,861399919736;913,99374615702;859,651688284314;843,884995778432;832,968072458823;919,667901188235;802,449864786274;885,613375964706;971,093359823529;904,791471833333;908,636348227451;862,715977092156;789,052511392156;644,876880913726;731,538812917647;665,5661380845078;811,289923594117;780,6098642497155
FR;3H;EM;CO2;FR_EM_3H_CO2;;kt;864,511214285714;860,60975;862,22125;860,727214285714;829,656928571428;820,676214285714;784,208071428571;787,407892857143;791,545071428571;825,5665;874,468964285714;868,653892857143;865,889357142857;843,048642857143;862,281357142857;891,905535714286;874,983607142857;869,825392857143;932,449571428571;977,257285714286;935,231;1038,38507142857;1014,56928571429;933,221928571428;1037,38760714286;1081,57735714286;1172,97557142857;1293,05707142857;1323,51842857143;1224,28546428571;1097,84675;1014,76257142857
FR;3I;EM;CO2;FR_EM_3I_CO2;;kt;128,158708333333;142,429113095238;137,61680952381;111,528541666667;108,008738095238;121,49080952381;129,675595238095;128,311398809524;144,055148809524;146,717738095238;162,428357142857;161,662089285714;155,275476190476;146,654160714286;158,781726190476;165,426446428571;155,947;162,781273809524;187,516672619048;174,437345238095;172,247363095238;186,125630952381;175,759375;176,167357142857;163,752678571429;172,850136904762;149,789422619048;165,436988095238;160,902172619048;138,748041666667;167,579172619048;160,144220238095
FR;4A;EM;CO2;FR_EM_4A_CO2;;kt;-36337,760673371304;-37802,53644355324;-37726,28320275263;-42533,48323427088;-42878,15555836923;-45082,7491095616;-51873,02911756541;-51268,90367774886;-52155,85247458342;-55163,95925892112;-36990,47564763058;-50237,05816638332;-57476,51250986086;-62281,860687939494;-63406,084811383385;-65395,82379118467;-66753,836658314;-69637,77337432952;-71160,81605653084;-62248,07138696876;-61546,77036173876;-61088,33012870236;-63450,509107936756;-71556,29396970803;-59840,027344957234;-56151,24379479229;-46759,96600402908;-34376,30822447357;-31739,974363192196;-26901,583654044127;-32242,340892622302;-27592,68261043272
FR;4B;EM;CO2;FR_EM_4B_CO2;;kt;23874,911444486355;22084,841437889685;21347,13043129302;20741,679757993017;19989,53675139635;18384,38407813302;17192,96108753635;15696,970096536348;14832,900249163013;13220,910591496346;11337,85526749301;9696,503009489676;8318,30368537634;7200,602521859673;8443,277691676341;9702,980861493008;12384,618511979677;14647,009562313013;16387,490945576348;16355,762523576348;14981,729664806348;13913,533472703013;11841,099613933011;12585,930755199677;10903,567896429677;11019,078037659676;8811,860750733007;8533,688378673007;7622,73367364634;6634,804634919673;6211,553263263006;7020,756558053006
FR;4C;EM;CO2;FR_EM_4C_CO2;;kt;-7910,068341679174;-5454,0600038785715;-5030,429999411672;-4272,645661684404;-3481,4689905508367;-2232,189986083569;-1056,9226482833344;-486,7799775160673;-39,46697268250019;525,9016984514336;821,2591269850006;962,2746634189341;795,0589446525006;221,29401395310006;23,44150108666654;-232,42716264606702;-321,44300471250045;1153,9675933547676;709,5569184550371;784,2371463166172;533,9229162215304;713,9173847263338;-418,38956393520056;5849,612717636239;1163,4952559743342;1033,7370226127275;734,3447029787372;37,19205202459989;-2303,814099155802;-2539,7350619765693;-2342,8621933640025;-2350,778609451069
FR;4D;EM;CO2;FR_EM_4D_CO2;;kt;288,1363031037336;304,7499697704003;310,8989697704003;317,0369697704003;324,06963643706695;329,503636437067;337,07163643706696;348,41263643706696;354,495636437067;364,39196977040035;360,1459697704003;363,218636437067;364,88696977040036;376,5469697704003;386,22330310373366;388,87430310373367;383,4989697704003;415,25963643706706;412,6379697704004;440,8491078170671;447,7204411504004;446,6644411504004;433,7797744837337;589,1254411570005;584,9674411577339;630,0527744910672;617,5568610676672;619,2105277343339;577,9018610676671;547,6591944010005;520,3278610676672;494,8995277343338
FR;4E;EM;CO2;FR_EM_4E_CO2;;kt;4816,840977479671;5306,194663399671;5764,070015986338;5369,867035239671;4816,468387826338;4348,752407079671;4363,071092963004;4340,67544554967;4295,876464803004;4309,916484056337;3791,6738366430036;5329,620855896338;5748,882541816339;5857,870894366339;5834,565913619672;5683,008266206339;4742,545285459671;5854,597971379672;5426,353657299672;5066,996224572338;4860,643303659004;4629,712716079004;4089,7481284990035;6455,429874263339;5652,040953339005;5478,105032425671;5194,291143191338;4985,826981241338;4485,265152588004;4270,274323934671;4336,513161948004;4564,407999961338
FR;4F;EM;CO2;FR_EM_4F_CO2;;kt;90,38333333333343;90,23300000000008;88,74066666666675;87,93033333333341;86,19966666666674;90,84533333333341;90,91866666666675;93,87033333333342;97,10066666666675;98,40233333333342;98,22266666666675;102,5200000000001;101,32100000000008;101,81233333333343;102,24133333333343;100,97266666666675;99,2970000000001;101,3650000000001;97,95133333333342;97,44166666666676;98,97433333333342;97,14466666666675;95,44700000000009;110,57566666666678;110,03666666666678;102,60066666666675;96,83300000000008;91,59333333333342;91,58233333333342;88,49133333333342;87,96700000000008;87,78366666666675
FR;4G;EM;CO2;FR_EM_4G_CO2;;kt;-5239,61446088;-4964,01514343;-3000,37025467;-1818,697334921;-2710,06373102;-3090,23920926;-2558,824400687;-3174,37911042;-3729,60330911;-3881,65258233;-4494,63627753;-4187,38521013;-3076,92419567;-2951,9404767017;-3587,58087351;-4147,510101853;-4296,41673851;-4746,92371206;-3503,363577625;-1395,98227775;-3211,29796037;-3891,72109917;-2766,75197609;-2223,57357118;-2057,745552141;-1483,84336691;-1132,73133647;-1115,89668971;-1013,19131966;-743,71185144;-1052,10326326;-1367,9427201779
FR;4H;EM;CO2;FR_EM_4H_CO2;;kt;;;;;1034,0;1217,425;1061,7713333;926,02033333;807,62366667;704,363;614,306;535,766;467,26533333;407,52066667;355,41733333;309,97633333;270,34333333;235,77766667;205,634;179,34033333;156,41266667;136,41466667;118,97233333;103,763;90,493333333;78,925;68,834333333;60,034333333;52,356333333;45,664666667;39,823666667;35,0
FR;5A1;EM;CO2;FR_EM_5A1_CO2;;kt;NA;NA;NA;NA;NA;NA;NA;NA;NA;NA;NA;NA;NA;NA;NA;NA;NA;NA;NA;NA;NA;NA;NA;NA;NA;NA;NA;NA;NA;NA;NA;NA
FR;5A2;EM;CO2;FR_EM_5A2_CO2;;kt;NA;NA;NA;NA;NA;NA;NA;NA;NA;NA;NA;NA;NA;NA;NA;NA;NA;NA;NA;NA;NA;NA;NA;NA;NA;NA;NA;NA;NA;NA;NA;NA
FR;5A3;EM;CO2;FR_EM_5A3_CO2;;kt;NA;NA;NA;NA;NA;NA;NA;NA;NA;NA;NA;NA;NA;NA;NA;NA;NA;NA;NA;NA;NA;NA;NA;NA;NA;NA;NA;NA;NA;NA;NA;NA
FR;5C1;EM;CO2;FR_EM_5C1_CO2;;kt;2162,176568895153;2164,473733255033;2209,496513541431;2201,559890974877;2242,805554972416;2193,782312815576;2066,346110030992;1862,929679689057;1729,727834152911;1609,6415211123574;1677,1985486359588;1613,914428525042;1588,1414325511073;1588,7122323423946;1462,786656788424;1521,331848428316;1587,16339788672;1465,578773302684;1521,768343528879;1495,700984276266;1581,577652086434;1625,429119114134;1518,478761124822;1522,644580865441;1772,793801506835;1520,2560538456387;1532,2866244858892;1457,303064194443;1423,2985962288585;1791,9629627675863;1603,9911862234726;1678,1307031382491
FR;5C2;EM;CO2;FR_EM_5C2_CO2;;kt;32,0313841435714;31,512812715;30,9942412864286;30,4756698578571;29,9570984292857;29,4385270007143;28,9199555721429;28,4013841435714;27,882812715;27,3642412864286;26,8456698578571;26,6099555721429;26,3742412864286;28,2419155607143;26,44027044;27,7386515142857;25,1767003435714;25,2555954578571;25,3344905721429;27,1886815864286;25,9473408257143;24,6694274057143;23,6360853407143;22,3139767907143;21,8716509557143;21,6064801757143;21,6240833207143;21,9562958657143;22,6428185207143;22,9312104707143;20,0221971257143;22,1521776707143
FR;1A1a;EM;CH4;FR_EM_1A1a_CH4;;kt;0,5553786138678;0,59261678797726;0,58769849727732;0,50570792259162;0,47686597311178;0,53397665102036;0,6317470141676;0,60937574739351;0,71901672539337;0,68470846376769;0,67369168764392;0,6453363557188;0,6880926149797;0,74619518125676;0,78032646346185;0,88094960124824;0,86573889510743;0,80256266429224;0,85299210048089;1,01345340432469;1,19725610597968;1,18017018753873;1,14143603313233;1,11766938670085;0,95444031073883;1,19086868348666;1,62606536775636;1,86098212341923;1,56382813282149;1,80893646561366;1,68003964786752;1,89518526624758
FR;1A1b;EM;CH4;FR_EM_1A1b_CH4;;kt;0,27660465094694;0,29083633994979;0,28611664141338;0,29885356028624;0,30630072734301;0,30411029118001;0,31497910017057;0,34435513493698;0,3185052468393;0,32786302323651;0,31596150503165;0,33014403328193;0,3159486677745;0,3093977067253;0,32001364643584;0,34709435700952;0,34198565419039;0,33821597541048;0,33680512322315;0,31203606384547;0,27150989679892;0,23561193926691;0,18505548042417;0,18034775144381;0,17292149389799;0,16873074235778;0,16769857005202;0,16180310671342;0,1484498004798;0,14610041429758;0,12495859250979;0,11363512908561
FR;1A1c;EM;CH4;FR_EM_1A1c_CH4;;kt;1,82892185492688;1,68173334867952;1,52272113309048;1,31476287912724;1,11172756410054;1,01277133574368;0,85905588234185;0,70478081425246;0,65072197991682;0,43458667085278;0,30901413684536;0,30431431885195;0,26757708677713;0,27483859611364;0,28418269780776;0,20997902001191;0,22229754671429;0,32984552514286;0,11521467657143;0,13788571940267;0,054268437;0,050285714;0,054099627;0,06218961052801;0,06031805622337;0,07348989826873;0,08963090923376;0,07108027692148;0,05063049440136;0,04706611482538;0,04501044467345;0,04529881151244
FR;1A2a;EM;CH4;FR_EM_1A2a_CH4;;kt;0,50819143045734;0,63154805028013;0,55470541284678;0,31764677764626;0,36688476632544;0,34127609477346;0,35268121996091;0,25295093060633;0,25491027117977;0,24155369078003;0,33115812962361;0,25288890015787;0,24019971516305;0,25076532010863;0,2066030999111;0,28751349380573;0,28928714798869;0,36715558856855;0,38661344077911;0,30697226047244;0,4541147842093;0,37479387187439;0,36267232321024;0,33547614265183;0,37598448667749;0,41002169362496;0,41517679304879;0,4551020632382;0,47831314081589;0,39069843161278;0,34737483866699;0,30616367534075
FR;1A2b;EM;CH4;FR_EM_1A2b_CH4;;kt;0,13421545684825;0,23305489462763;0,19049267660145;0,09059718849496;0,08458661278621;0,09835770626484;0,10379029457185;0,08891332461094;0,07867072711807;0,07895228390003;0,07113428731376;0,07426742430652;0,06118611084021;0,03786847447747;0,0313563122891;0,02913863358955;0,03916600355319;0,03559605176833;0,03422565904293;0,028131345665;0,02647164851953;0,01824069191802;0,01679413106365;0,02006890076694;0,02029137886235;0,02269259802688;0,02705032768918;0,01945969653386;0,01508259168547;0,01505157472901;0,01941071949927;0,01979493189966
FR;1A2c;EM;CH4;FR_EM_1A2c_CH4;;kt;0,57790168539739;0,78228751606481;0,60812925723612;0,55758995651748;0,68923803155779;0,75450049468259;0,77499015281522;0,73203827708349;0,64049026020699;0,61128024402785;0,58198377315361;0,68482263050959;0,57202699981776;0,55260073122606;0,52489565323522;0,60228403106403;0,55637217219175;0,67006096042613;0,62708139130418;0,52340049481029;0,55837878127891;0,55662386013592;0,52532231338492;0,63372457893934;0,6152648232154;0,60832741279142;0,6804100091509;0,55849678826899;0,5035147318903;0,53225199324244;0,59141133688134;0,57422665755362
FR;1A2d;EM;CH4;FR_EM_1A2d_CH4;;kt;0,64057196939448;0,72455718227042;0,70864843238462;0,50274624812068;0,53237654074149;0,53232937517741;0,57206017802135;0,57665933255562;0,55843355466553;0,53766318914039;0,49802024298718;0,53827497253924;0,50156780695434;0,62001961513327;0,53831979079286;0,6798984531476;0,60800475901464;0,64674184642453;0,61819702102723;0,60125838503499;1,02095622321999;0,54289056648255;0,45724477049053;0,47879528116915;0,48754363646626;0,49900420907987;0,54793064581313;0,58427531739893;0,60598711161912;0,70524995491456;0,63078010895145;0,67581060262762
FR;1A2e;EM;CH4;FR_EM_1A2e_CH4;;kt;0,60989994878401;0,73166677447523;0,64029022936904;0,68746609890073;0,72441069334855;0,7433944490864;0,63036377826828;0,61366285242688;0,52611342905472;0,53863651840989;0,453001852959;0,45454378482939;0,45347941023367;0,45906483852728;0,47140490599397;0,42334241414095;0,42539418347152;0,42112890984588;0,38999772145436;0,40269619641075;0,4590173603541;0,40104667512117;0,57105861249374;0,56217011667425;0,52810644832507;0,65708806524967;0,66899522356088;0,62215285860217;0,68014531689179;0,64541844799465;0,64913836209994;0,58628755687789
FR;1A2f;EM;CH4;FR_EM_1A2f_CH4;;kt;0,92738085832217;1,15870761291862;0,80418211167521;0,66766174378139;0,74863550298688;0,69304724632338;0,65543999342677;0,59784592131113;0,68283942675663;0,70858997571172;0,67726570066955;0,80559278062269;0,77622318032091;0,76300068609278;0,77050933749948;1,167756353239;1,21119136469844;1,2743577230193;1,48731362226989;1,27039487334523;1,27275326903217;1,14608461887008;1,14100199803448;1,12594865811353;1,16511621172398;1,13187668370064;1,15093676878307;1,05073838604392;1,10647544814839;1,10027300352849;1,04803413987777;1,04174837974473
FR;1A2g;EM;CH4;FR_EM_1A2g_CH4;;kt;0,52582485170445;0,59306847944754;0,45787983499481;0,88954307827211;0,79516603611162;0,88575103083095;0,85383431864942;0,93616690876103;0,87969052624527;0,79581435770005;0,78198689859643;0,71306562819191;0,66346989176444;0,59117708800062;0,68265185779948;0,93792748415258;0,45392366124333;0,8390286735593;0,77376557682789;0,99939749749295;1,03964796059251;0,69458413487174;0,68883544419977;0,82084805860884;0,63088344740184;0,75655457305592;0,9142468445016;0,948404610875;1,097229703296;0,9590488190615;0,93093159939083;1,0351222795939
FR;1A3a;EM;CH4;FR_EM_1A3a_CH4;;kt;0,0800214577394;0,07357596389161;0,07084795105239;0,06543090727764;0,06295290342572;0,06452536619479;0,06104105689332;0,06632806297017;0,06456631661673;0,07134192915176;0,06680985780576;0,06142784201904;0,05810716204178;0,05545594958281;0,05397839676594;0,05543415682205;0,05545803372898;0,05507375945347;0,05411412691163;0,05411300350643;0,05066622203406;0,0501844219587;0,0491079570876;0,0487708981446;0,046559544275;0,0454923840029;0,0467779696277;0,0472394449754;0,0480539510764;0,0486180937086;0,0306653435999;0,0381316803133
FR;1A3b;EM;CH4;FR_EM_1A3b_CH4;;kt;38,50422174194877;38,32752470922281;38,2910319095199;36,49266605005284;33,52107404595939;30,89448022597327;28,68515744326092;27,18900938869212;25,87501309078013;24,90456670291794;22,77839256568223;21,68469734287248;20,11818213337378;18,300643149689;16,7739858764042;15,10731622660742;13,48422164155805;12,02086731077607;10,36168787495771;9,3458719095027;8,37034346902879;7,56209926268117;6,75155713190392;6,1555590322284;5,62258378794609;5,4856455488158;5,41808810194646;5,41611415907773;5,46295052631832;5,62669856522107;4,78044507817909;5,70253573842042
FR;1A3c;EM;CH4;FR_EM_1A3c_CH4;;kt;0,15333589101624;0,1485298407008;0,14143519499707;0,1308695129544;0,12152441511884;0,11610807269986;0,11244632007857;0,11137830889737;0,10600010973486;0,10680111812076;0,10870828094435;0,10336822503831;0,10641968555604;0,10184249477944;0,10031676452057;0,09078095040265;0,08840299903477;0,08513234136812;0,08850966528036;0,08096926873238;0,07646356395117;0,07777078700885;0,07466470413952;0,07378343294404;0,06307215961383;0,07021818889053;0,05859279644425;0,06217637446419;0,05547072244924;0,05556535580545;0,04631922094477;0,05310084676047
FR;1A3d;EM;CH4;FR_EM_1A3d_CH4;;kt;0,49801935377798;0,50821706504519;0,51989780115829;0,53410357137384;0,54420443002258;0,57554513808321;0,58726479651857;0,60460337776037;0,63776936316074;0,66049176044178;0,64862970442398;0,66960439247879;0,72433944439389;0,72881396131442;0,73896093121394;0,70759397281801;0,69958719278326;0,7039004687683;0,7276261269064;0,73844860427383;0,73477045161879;0,73245599638056;0,77936334917312;0,7846309419562;0,78911850591871;0,79353108309798;0,79835754806985;0,80432096639077;0,81099934303953;0,81993386143586;0,81838372089923;0,82174590375448
FR;1A3e;EM;CH4;FR_EM_1A3e_CH4;;kt;0,12030146979764;0,14321603547338;0,15467331831125;0,13175875263551;0,21024114007492;0,21585520866548;0,27405820548186;0,24449841576015;0,24255067767772;0,30430543217384;0,27612051639268;0,25445396128933;0,32905873027553;0,37818199028503;0,47659085816598;0,68635591729714;0,37773437557174;0,36365581080909;0,25854582920113;0,37086536491257;0,40221737948435;0,21017666487232;0,26231171009208;0,18556573064944;0,08163330728269;0,06843537807343;0,05594821792258;0,05896813470301;0,11247331901843;0,06739057422183;0,0430784382228;0,05706299776882
FR;1A4a;EM;CH4;FR_EM_1A4a_CH4;;kt;3,09660217875735;3,32161377686526;3,1664887769354;2,99133796469668;2,81666117937772;2,85578735955425;3,10438938463668;2,91112815017838;3,08578206888642;3,12891499943088;2,87200536214712;3,0175113645544;2,67595351781684;2,97442287221283;2,99386507784818;2,92008917316924;2,65781075668503;2,59583714468997;2,82033858451338;2,98734145127944;2,94811897273198;2,20789760562091;2,44639739466939;2,59311089513397;2,25588286629791;2,36463348401362;2,30897441009041;2,40128023974393;2,3285060830492;2,28194420177923;2,15809292558437;2,23934364840376
FR;1A4b;EM;CH4;FR_EM_1A4b_CH4;;kt;182,6136346854346;215,32826057158456;205,87769191892036;197,62879722477382;170,83523618714196;172,55821533171974;188,12424205772666;165,5174601997309;166,6594443857644;158,2920162010745;149,8950988139842;153,8175839074744;142,40049083701163;152,67975453978573;153,4965081570055;148,23067285170802;133,59342902622018;122,62973016870134;124,99734237100925;119,95727311520758;125,83307869548221;95,06338122868996;101,795688823688;102,50584871942824;79,10690318446528;80,85139985016463;83,84608294044772;77,99168886477968;71,6974116389348;69,04303030370934;60,45192873810425;65,17952750350979
FR;1A4c;EM;CH4;FR_EM_1A4c_CH4;;kt;0,90242792662109;0,91463201087947;0,92753531702415;0,92714369732134;0,90965196935657;0,87575690924365;0,89598853326863;0,88964027468564;0,87210885554747;0,87916472026114;0,88080663988549;0,85416089735684;0,80223627422487;0,77264052844642;0,79063733644898;0,77316131649881;0,74572586231207;0,70113544769386;0,68671949879473;0,67618053330581;0,67268530330249;0,62005153666858;0,60846236191324;0,59157981746353;0,56899138190639;0,54631844975213;0,50863008720027;0,52000551294685;0,52359061301043;0,52590372760158;0,54860697206042;0,56597195288972
FR;1A5a;EM;CH4;FR_EM_1A5a_CH4;;kt;0,11751828;0,10500848;0,07818609223115;0,05857505286782;0,04178862441346;0,03400058702451;0,03221151615635;0,03671172968993;0,03907800054181;0,03910553043613;0,03646611585347;0,06786713674321;0,16622771904062;0,17138536507933;0,17571793682132;0,16103956541245;0,16189507222216;0,15170613461839;0,14881697953859;0,12106697793196;0,12445458705223;0,14053291853619;0,12548942342763;0,11776541684497;0,11109485217657;0,10922368651538;0,07008963641589;0,06346392207921;0,06824917589203;0,08818259856256;0,08144905285725;0,10979275779226
FR;1B1a;EM;CH4;FR_EM_1B1a_CH4;;kt;191,218;177,44773118448165;185,31264239210918;193,5915151166511;197,921800135107;196,12403894175802;149,06462746456228;126,85802452245328;123,08990253001942;116,93839821555893;80,1835587037855;72,09925381805749;47,93735638528254;45,74800572325302;26,65813911197264;14,807;9,447;1,407;1,407;1,407;1,407;1,072;0,469;0,536;0,402;0,402;0,402;0,402;0,402;0,402;0,402;0,0469
FR;1B1b;EM;CH4;FR_EM_1B1b_CH4;;kt;1,19158487047761;1,15680176501475;1,13396437253913;1,02522324990525;0,94177893124435;0,97199455821209;0,93650876374998;0,90752284253093;0,96690006296753;0,9041850697845;0,87238839256845;0,85798326808383;0,77471462167275;0,78630899016037;0,78191718391506;0,76241756418588;0,74562101336456;0,76923105406422;0,61504537937196;0,69027441592324;0,691387263;0,213347263;0,172286273;0,251753882;0,15004544241662;0,19621497169335;0,24781132634882;0,26735255018719;0,30322014060256;0,18174459414177;0,62045823493098;0,29515679009198
FR;1B2a;EM;CH4;FR_EM_1B2a_CH4;;kt;8,23078007095934;8,07069516348713;7,87580878823884;7,61407578759991;7,67005723411086;6,91024011817457;5,97455017927629;5,15624827190627;4,95948452860041;4,46333374848351;4,21408000928792;4,10900191482708;3,91425212691102;3,7052200337489;3,50386852906486;3,32733850450888;3,29294103270706;3,07653775520196;3,04234937435601;2,79656195250628;2,7274785957284;2,7177473840298;2,45340993093491;2,21417455650411;2,12725127510104;2,32237266834253;2,27425659882259;2,12351740609035;2,1606067609485;1,98432371175479;1,73988396141292;1,75615072555889
FR;1B2b;EM;CH4;FR_EM_1B2b_CH4;;kt;60,81106161133933;60,89659338378278;59,23540652210155;58,28204530510612;56,84828979369346;55,30587670334812;53,71784589336059;53,34853908555891;53,84609628880796;54,12491834311824;54,67739556188592;53,87590676381565;54,73750664894067;53,88803718571297;53,76880769956108;52,44049846490028;53,73589554784022;52,66436515081989;52,77989911681526;52,68571234454799;55,49217026368731;53,52142703692538;53,06965479220089;51,13325159537518;45,64697254807718;44,56034837919185;45,44232301143484;41,81994119799723;39,58253407434886;36,9159274063482;30,56154561845765;30,29586006992322
FR;1B2c;EM;CH4;FR_EM_1B2c_CH4;;kt;3,0102603637115;3,0353952890926;2,89052811385474;2,68212512782957;2,841038658427;2,65888037730225;2,33504482812286;2,16395182143929;2,10736790735558;1,5642836541164;1,48909744829146;1,40771563115534;1,31146015110104;1,19478276112276;1,15979104618709;1,09631830015775;1,08415610602348;1,15096140230913;1,10726929773973;1,11287782029824;1,11110518230119;0,90449453196651;0,92024841721674;0,93700469529541;0,85673588766237;0,87062331270033;0,91963176695707;0,9031007828681;0,94915232778087;0,82018670883418;0,76872840461211;0,77831776231233
FR;2B8;EM;CH4;FR_EM_2B8_CH4;;kt;0,04324733333333;0,04209811111111;0,04318088888889;0,04224766666667;0,0881;0,03898444444444;0,03928664797659;0,04077880639199;0,04268322562504;0,0371208669218;0,03631483655308;0,03293101116403;0,02791210589295;0,0264658663304;0,04701466666667;0,03385190338165;0,02599310444444;0,02691004;0,02386769555556;0,01502457001333;0,01411978159653;0,01358472781849;0,01291677466667;0,01184000222222;0,01533941333333;0,01799832666667;0,01626072444444;0,01355630850653;0,01373882888889;0,01212717315865;0,00774631152785;0,01104041022222
FR;2B10;EM;CH4;FR_EM_2B10_CH4;;kt;3,07784355990207;3,44749617603555;3,70042338306924;3,42572698519562;3,56286096565458;3,68153338313774;3,85120672930009;4,14048943200878;3,84316380279066;3,94243198347655;4,03619454288952;4,20661594260839;4,03909482748498;4,55323827651964;4,6786107031021;3,75079954950202;3,52665488977463;3,31639683270878;2,91180106521745;2,58257299195298;3,15970648416767;2,04555417244544;1,72283712102247;1,74750115247948;2,08203270695013;1,87183885714274;1,71617208552745;1,6503428918216;1,45702968125964;1,34925095515056;1,24200465286152;1,22529296862986
FR;2C1;EM;CH4;FR_EM_2C1_CH4;;kt;5,39578014755018;4,9673854226574;4,74836092675203;4,66006239112606;5,0863928090187;4,84231018044631;4,44472744686086;5,09391603064837;5,22035307475827;5,09366879189838;5,07539610760951;4,49681401082608;4,99621304292978;4,07911210116118;5,72396224018176;4,19707045131308;2,57534926604042;4,47633864470337;2,99730323344748;1,23531251762489;2,38282702924037;2,62457866782957;1,99390845506922;1,51444742154257;1,34070856950455;1,18874384409717;1,38412838511582;1,12905542865295;0,9933160335278;0,9627983015533;0,82145652154085;1,12974506448791
FR;2C2;EM;CH4;FR_EM_2C2_CH4;;kt;0,23891414353321;0,23891414353321;0,23891414353321;0,23891414353321;0,23891414353321;0,24065708527428;0,24240002701534;0,2441429687564;0,24588591049746;0,24762885223852;0,26104794522089;0,24476579689437;0,26282828349017;0,26755858561569;0,27166234646292;0,28347388337208;0,30918762882141;0,28684450250844;0,3030966240805;0,22743601122252;0,30326586690915;0,33091314459022;0,30563785728024;0,29359735726483;0,2994480417;0,30268713318;0,33605458332;0,29104690476;0,3317362461;0,3157262931;0,204013488;0,2482809784
FR;2D1;EM;CH4;FR_EM_2D1_CH4;;kt;0,05803928159703;0,05837358784976;0,05901689373705;0,05675220815043;0,05425167720414;0,05086723032967;0,04729852168387;0,04508266351783;0,04245114934903;0,04223019997998;0,03817439616316;0,03638219746274;0,03376935365387;0,03117460006937;0,0294787661374;0,02658688507754;0,02360521091236;0,02063410882475;0,01837023468398;0,01713306325592;0,01822501344867;0,01606112581074;0,01397131848979;0,01248887616635;0,01140518439362;0,01137869879944;0,01122053275534;0,01101982810671;0,0114852866615;0,01186730290788;0,00950738908597;0,01088578933671
FR;2D2;EM;CH4;FR_EM_2D2_CH4;;kt;NA;NA;NA;NA;NA;NA;NA;NA;NA;NA;NA;NA;NA;NA;NA;NA;NA;NA;NA;NA;NA;NA;NA;NA;NA;NA;NA;NA;NA;NA;NA;NA
FR;3A1;EM;CH4;FR_EM_3A1_CH4;;kt;1372,145576730715;1350,784816734271;1332,251022379311;1320,577761607365;1325,55386079005;1333,31157161014;1331,741424546079;1316,75484755755;1308,75169749121;1309,826292604497;1363,163003680199;1366,267699079492;1330,760287661657;1287,482439358319;1268,517231961206;1262,171107154563;1266,324453057301;1278,827251169387;1299,735495578636;1286,67733938751;1280,48086771936;1261,446274051809;1251,189537062187;1257,242476016914;1277,616346541383;1285,508822784553;1278,263976515702;1264,291302956691;1240,724202403954;1219,388737892398;1198,247070499695;1168,594100525585
FR;3A2;EM;CH4;FR_EM_3A2_CH4;;kt;141,369513189877;137,517982534561;133,619182429397;132,123748689312;132,05256209682;131,389857777885;130,416005269529;128,527125831658;126,910524750588;125,005353049482;123,990152505753;120,955510958279;119,397789250245;118,693666978009;117,393797803337;116,481815495812;113,304275742999;109,615786075929;105,254089388654;103,812277152547;103,560788701918;99,896871168579;97,3534292364681;94,5043272036475;93,6414267075206;92,1599000415979;91,627483327886;90,3941342481134;92,1661188704109;91,2018761206904;90,6424301885323;90,2791154512316
FR;3A3;EM;CH4;FR_EM_3A3_CH4;;kt;9,58266695945687;9,66394318102713;10,182811682233;10,4765811089013;10,7317528568645;10,7888891967035;11,1507226518071;11,3928900083283;11,6123291790647;11,676762603197;11,6568221114079;11,6649854553052;11,6929204376556;11,5250867274925;11,3351492067456;11,1496354979134;11,0595394942592;11,0077733420272;10,8946635973221;10,6746482816065;10,4198219676007;10,287580976363;10,0314215005666;9,85994991039582;9,80823850962087;9,82117562332636;9,88979558423334;9,82502235153542;9,93521684757482;9,8802948830741;9,83797561066121;9,71244138854998
FR;3A4;EM;CH4;FR_EM_3A4_CH4;;kt;30,21053732854491;30,1830753135409;29,9005340719391;29,79013220786202;29,7785966750626;30,7602991377477;31,25867075325005;31,52212110651842;31,76728072482133;32,06586987755094;32,64763855847346;32,93175464285341;33,5727691444222;33,63450229747053;33,66194376287102;33,8240679525608;33,85896161484318;33,80512523742078;33,99140625062915;34,87601045984336;35,37487244031967;34,54691570480719;33,165097669369;32,66266846657434;32,41037876219253;31,84425430285214;31,25884973128447;31,26797337097079;31,75668586846636;31,61635433234395;32,89614413686753;32,90997072647141
FR;3B;EM;CH4;FR_EM_3B_CH4;;kt;226,89935371411468;224,11316022846356;224,68162827355437;226,18382024440606;229,17157615359957;231,96465354457212;236,62975055180175;239,45777382823368;244,40306101738545;248,1465220336254;256,96870086202125;260,22054304430554;261,04469704710255;257,45149854480826;256,6011572640849;256,83458575058035;257,78459949857586;261,7165884963063;266,11169980298325;260,6022885723376;256,720285060853;254,8827428122135;249,68892054941176;246,88448875471278;246,97755437394247;246,39747786682577;245,8514106576954;242,37485836108291;240,37751884185292;236,21900373702886;232,12818701943857;225,9553068530181
FR;3C;EM;CH4;FR_EM_3C_CH4;;kt;2,33609039987581;2,54750473476576;2,9429455604356;3,26299180534737;3,479712289935;3,30830996794416;2,99779933497718;2,88798695219715;2,70596567516996;2,58872002386448;2,80310433834412;2,72605042152479;2,57927331841055;2,52519672168574;2,8512449173192;2,53427639957668;2,24214567856732;2,05252577925912;1,94001214076814;2,36161956366272;2,35447341312088;2,38954731034707;2,28306397403469;2,1022363737088;1,68932902779511;1,63471019134464;1,68536423205202;1,72483802946469;1,36912778963245;1,56474052016104;1,53373317145491;1,29098191940813
FR;3F;EM;CH4;FR_EM_3F_CH4;;kt;2,76880367057192;2,84172118873042;2,85722999649356;2,74584233340478;2,79839472669001;2,73749319323709;2,90612622429907;2,89337586786111;3,02469345440069;2,96629890469582;2,97651107528796;2,56502935192591;2,58255284161596;2,12198950654606;2,18907529810907;1,9029922119323;1,85764247013148;1,75399122354672;1,84329693093172;1,83194994506788;1,70794664199706;1,61971684831953;1,56371291548621;1,35833911095959;1,31243869146852;1,25995846555188;1,03104831651937;1,14234428573926;1,03261521392369;1,10196324559197;0,96387447058138;1,00468735127441
FR;4A;EM;CH4;FR_EM_4A_CH4;;kt;26,5909313588;23,1256479285;24,0856796824;23,3741073132;23,5444756635;22,6538476786;21,0447405251;21,9863778031;21,9277342653;21,3959693098;21,8715893396;18,9300832822;23,2992529488;23,5569223753;21,35869342;19,0947940264;18,1742138775;16,3137573183;15,6344244894;17,7511570525;17,9754582028;18,7285295622;17,2390020317;15,4320388231;18,8669329924;19,2102815541;20,1559321496;24,4523062597;20,2520988273;26,2260758764;19,2096543842;20,9734999576
FR;4B;EM;CH4;FR_EM_4B_CH4;;kt;5,2530639218;5,61756068;5,8116272328;5,9360244181;5,7471676283;5,5939792844;5,5869911522;5,5878213773;5,5447958023;5,424043316;5,3079885387;5,5263787722;5,3395582738;5,3717252052;5,368783101;5,4108295976;5,2521699328;5,2006435428;5,1075430109;5,3285122253;5,5239523068;5,482773719;5,506719548;6,2484376323;5,5970421187;5,4913131519;5,3826230494;5,3268249519;4,9705205242;4,9039532826;4,8106842822;4,9005354707
FR;4C;EM;CH4;FR_EM_4C_CH4;;kt;6,455219251;7,2112195026;7,4490749295;7,6954729928;7,516115118;7,4015859997;7,5411465388;7,6052334545;7,5670273915;7,3307191391;7,3411503362;7,5508101278;7,4349918619;7,4583141923;7,4695281888;7,5667945074;7,4811563875;8,4643955224;7,9187776775;8,0121193559;8,2619564789;8,2241590269;7,7635669323;11,3386100888;8,6219080031;8,2759229365;8,2361396394;7,9556195917;6,3880868628;6,2889220784;6,1884486229;6,2130749169
FR;4D;EM;CH4;FR_EM_4D_CH4;;kt;0,2311130007;0,2284259607;0,2315478807;0,2324378007;0,2329302807;0,2323600407;0,2329187607;0,2359312407;0,2361962007;0,2390963607;0,2398595607;0,2338605207;0,2355078807;0,2407955607;0,2459421207;0,2470163607;0,2474915607;0,2511318807;0,2525344407;0,28058187371;0,28182603371;0,27947019371;0,27720363371;0,30623691371;0,31984491371;0,32925387371;0,30921244745;0,29876092745;0,29296636745;0,27530620745;0,25693180745;0,24713116745
FR;4E;EM;CH4;FR_EM_4E_CH4;;kt;1,6570804806;1,7700571206;1,7338065606;1,7165035206;1,7175633606;1,7142196806;1,7298091206;1,7346331206;1,7161435206;1,7227416006;1,6085179206;2,0050449606;1,8759028806;1,8517800006;1,8560452806;1,8413198406;1,6418740806;1,9246152006;1,7769604806;1,6299920234;1,6333501034;1,6164502634;1,4864096234;2,1504109034;1,7468912234;1,7361718634;1,6330858546;1,5998938546;1,4725949746;1,4616941746;1,4614781746;1,4526711346
FR;4F;EM;CH4;FR_EM_4F_CH4;;kt;0,01749024;0,0174672;0,01670112;0,0163728;0,01495008;0,0176976;0,0189072;0,02160288;0,02427552;0,02604672;0,02670336;0,02850624;0,02932128;0,02941344;0,02987712;0,02974464;0,02939328;0,03027456;0,02927808;0,02885184;0,02985984;0,02960352;0,02915136;0,0349056;0,03750624;0,03257856;0,02787552;0,02414016;0,02338272;0,0209088;0,02017728;0,0201312
FR;4H;EM;CH4;FR_EM_4H_CH4;;kt;;;;;97,586666667;107,904;79,806666667;59,668;45,233333333;34,886666667;27,470666667;22,154666667;18,345333333;15,613333333;13,656;12,253333333;11,248;10,526666667;10,010666667;9,64;9,3746666667;9,184;9,048;8,9506666667;8,88;8,8293333333;8,7933333333;8,768;8,7493333333;8,736;8,7266666667;8,72
FR;5A1;EM;CH4;FR_EM_5A1_CH4;;kt;472,091449216587;497,053152657987;524,501801105953;552,665211143184;564,089180888302;573,462907513888;579,430604318193;587,151285784858;607,224512047036;617,869773484541;629,455137141399;641,292420084971;651,823330259927;656,905531506712;655,2205473336;647,8509699148623;644,5308925118024;646,2408924922155;644,9340827658071;620,4734560853312;619,0215701907194;580,6983586776623;566,0608084104815;509,5318231697101;476,1835858340808;447,3645131516123;448,8340159613706;452,6022265975282;443,2862482275427;475,7012597746088;475,0719596334453;445,7849866813759
FR;5A2;EM;CH4;FR_EM_5A2_CH4;;kt;0,54182004372495;0,58170848376315;0,63802237265987;0,6926416444229;0,74650448944674;0,85832526180002;0,97001338558812;1,05855622013459;1,14789119331136;1,23152526010379;1,32620304579697;1,43260395299999;1,5244170217164;1,62731665175072;1,74389754042122;1,8537790138274;1,96631908898403;2,09086453532494;2,24620475262124;2,45076389796264;2,31861328423873;2,23300560029407;2,18041527515918;2,15097403827301;2,16393825354248;2,21973563129934;2,23805699160064;2,23716948634326;2,26335442039728;2,30821905590602;2,36006094612825;2,42154586525449
FR;5B1;EM;CH4;FR_EM_5B1_CH4;;kt;3,97948072028221;4,07881556878021;4,18062705916249;4,28497787326653;4,86348259236164;5,45097678930026;6,19381619375679;6,50938705669883;7,38379206851076;10,0099873252281;11,193591038889;11,7438176419981;12,304021865166;13,2885005661375;14,3361577171036;15,1797724188035;15,9539853336859;16,3579321507136;16,7351289251121;17,3683080601139;17,8607484607451;21,5506549294319;25,2555444210683;26,2894289230306;27,3253838191253;27,585977330794;27,8321566790279;28,8646399706771;29,8907630143396;28,3620175976663;26,8771371038441;28,8860041038917
FR;5B2;EM;CH4;FR_EM_5B2_CH4;;kt;0,03147342618606;0,04196456824808;0,0524557103101;0,06294685237212;0,06618956900947;0,06943228564682;0,07267500228417;0,07925580957762;0,07734832920271;0,08159247303689;0,08583661687107;0,11921752343204;0,15259842999301;0,14782972905573;0,14306102811844;0,14165330760176;0,1405778916334;0,16900174331378;0,19742559499416;0,22013178248453;0,2428363063751;0,26629713086757;0,28942434201252;0,44224576986586;0,59632780539867;0,84538494134753;1,09412433852792;1,1465383729221;1,19943161562361;1,07475625283461;0,95420166637582;1,08988936990448
FR;5C1;EM;CH4;FR_EM_5C1_CH4;;kt;0,01336128687791;0,01374261833523;0,01454580250933;0,01434590745682;0,01618492240821;0,01623274018476;0,01638793167205;0,01535994773397;0,01632594267291;0,01701886586402;0,01806590985056;0,01894496318091;0,02043332000034;0,02040366665668;0,02051923580039;0,02019935756642;0,02055887127166;0,02074143479913;0,02012927094682;0,01911459654178;0,02184468956634;0,02339857740671;0,02610560443237;0,02494744531952;0,02480481338931;0,0261410045125;0,02299015230055;0,02183296550896;0,02160616023932;0,02246054356387;0,02233848765571;0,02203011356627
FR;5C2;EM;CH4;FR_EM_5C2_CH4;;kt;1,9036783000858;1,92875881292164;1,95383932575748;1,97891983859332;2,00400035142916;2,029080864265;2,05416137710084;2,07924188993668;2,10432240277252;2,12940291560835;2,1601763199637;2,19096986974266;2,22178358473363;2,25618645275094;2,28438353213488;2,31786086975177;2,34480835349395;2,37625701227988;2,40772595555415;2,84543454957374;2,91859918478992;2,99133468150181;3,15110638668829;3,31042101460523;3,77612117465204;3,08486198313532;3,00607278438094;2,73408928863982;2,95848703931283;3,24382084561166;2,78474637509391;3,67751689560501
FR;5D1;EM;CH4;FR_EM_5D1_CH4;;kt;58,1561305188524;61,2017073588935;64,290921568614;67,3847093556472;70,455930073946;73,534718305399;76,5069997733141;79,4781265565835;82,5040464440334;83,1994758892225;84,035232174905;84,7193186738156;83,7785355884829;82,6590577168867;81,5539186929823;82,1048371606315;82,6637544127558;83,0910443507272;83,4443894496883;83,7932357800063;84,3177840487137;84,5263574064827;84,8804074493629;84,8862967960544;85,3499262399939;85,9071200600267;85,5875514362625;85,841959968178;87,1814966615884;87,8538231680185;88,6464177722182;89,6213161440042
FR;5D2;EM;CH4;FR_EM_5D2_CH4;;kt;2,60676957201196;2,63585537553954;2,66747632190491;2,7021004567802;2,7379024560814;2,77496017861842;2,81937401645931;2,91329071471502;3,01093376177638;3,06126922851128;3,12079069633683;3,31131165559536;3,20104370166635;3,17390420528494;3,23900580025567;3,37487073388;3,34298833106967;3,33921358768119;3,22508722780861;3,13134756688551;3,06833582948724;3,19466389248805;3,0800498048894;3,01083119565071;3,04444692037084;3,13573600284142;3,12316848393429;3,24479401765716;3,3799776255371;3,29870244534808;3,28501443577384;3,18863957115586
FR;1A1a;EM;N2O;FR_EM_1A1a_N2O;;kt;1,41364574879742;1,48639267896236;1,55493102461745;1,53442489972855;1,35143811069237;1,35228710351709;1,54297447128978;1,56862237408647;1,729789646419;1,64725942590249;1,73238069620015;1,6922868889326;1,73930294502175;1,90924923969523;1,95454444337917;1,93851299408065;1,50736045481483;1,22494924563757;1,28126793481631;1,20870364799393;1,46761293536864;1,07964663384492;1,21909030848086;1,107905373164;0,85295657834175;0,87251303623474;0,99994764385423;1,10393266646109;0,86926881201409;0,85342187824048;0,810062430936;0,81565712486046
FR;1A1b;EM;N2O;FR_EM_1A1b_N2O;;kt;0,05499422759157;0,05800460216479;0,05708170207684;0,05876154847264;0,06046730219099;0,06013567551339;0,06270203662168;0,06816035205669;0,06351010392343;0,06452172089494;0,06196338490949;0,0647319320168;0,06190228206328;0,05991117256427;0,06045008964651;0,05541970737944;0,05255558800794;0,05307314713447;0,05246366923042;0,047452754448;0,03825543706489;0,03289827979507;0,02448565511616;0,02099875101309;0,01958144716194;0,01807523230447;0,01859955013069;0,01636968013439;0,01472857095749;0,01320555198814;0,01050551194387;0,01005608134848
FR;1A1c;EM;N2O;FR_EM_1A1c_N2O;;kt;0,04157776024431;0,03974143000804;0,03701913244942;0,03002403145899;0,02534292408067;0,02816306387812;0,02665482800036;0,02436987087409;0,02913756309334;0,02306135213965;0,02411838233607;0,02326283835644;0,02034790930423;0,0207722136324;0,0161480592005;0,00392326552085;0,01112418854984;0,03254607300788;0,004439022381;0,00515468327615;0,00258285072537;0,00246651793588;0,00256565760694;0,00283100127916;0,0027870277727;0,00316442000794;0,00360797126861;0,00310550842121;0,00249258089391;0,00236115963602;0,00204401026562;0,00207284694952
FR;1A2a;EM;N2O;FR_EM_1A2a_N2O;;kt;0,05745530482046;0,06812126288431;0,05765339169762;0,05841706088123;0,05323582630666;0,04754484002227;0,04888470071801;0,05224469202121;0,05320305447898;0,055735211667;0,06802043569968;0,05435967875981;0,05154799910844;0,05386228809819;0,04695462782093;0,05291720926947;0,05165054032019;0,06279033008686;0,06454076573596;0,0521405877187;0,07328990018467;0,05998536295543;0,06110166956496;0,05697203283952;0,06497975483483;0,07338975418168;0,08753336615662;0,10207338893115;0,0855408275033;0,07039560156312;0,0586997305977;0,05302389414834
FR;1A2b;EM;N2O;FR_EM_1A2b_N2O;;kt;0,02434697603142;0,03950886352675;0,03357763225769;0,01734139045122;0,01722158271361;0,01979711541961;0,02017373328532;0,01806801468045;0,0169832254704;0,01729651390515;0,01617923459904;0,01645897563811;0,01318165407397;0,00962590972502;0,00811644883932;0,00871900759272;0,00910965097361;0,00699449036811;0,00662769087443;0,00574505805126;0,00541204558152;0,00376187123901;0,00344252903178;0,00392187746244;0,00428304124277;0,00469745425887;0,00621643581393;0,00478687051958;0,0039055334243;0,00446275492719;0,00518657685797;0,00523197635092
FR;1A2c;EM;N2O;FR_EM_1A2c_N2O;;kt;0,09086872080755;0,12223110500295;0,09564023621735;0,08865801719099;0,11020618388454;0,12871302273723;0,12772324355056;0,12190505111426;0,10156393557274;0,09765729619847;0,08978284658579;0,10267332070831;0,08328728308315;0,08481938671128;0,08215988512186;0,09383208844218;0,08673045895865;0,09951016152019;0,09225253765936;0,07762964652279;0,08203296246011;0,08209726845625;0,07675716770798;0,09221875036534;0,08925105285244;0,08787884264108;0,09586525114421;0,07959839281409;0,07175001683667;0,07473323863451;0,08256246131679;0,08077344841722
FR;1A2d;EM;N2O;FR_EM_1A2d_N2O;;kt;0,10262545104559;0,11625180635758;0,10837324385444;0,08017951556867;0,08601846410383;0,0845763059281;0,08964450910383;0,09001296317582;0,08882140002345;0,08253576540273;0,07731262292557;0,0815329318634;0,07693147020282;0,09129465116431;0,07959098737822;0,09978044694194;0,08930226690436;0,09418287552027;0,088352633955;0,08566827331498;0,14286066647599;0,07907351261804;0,06798263630503;0,07050962209235;0,07210380847491;0,07389950307774;0,0819906745411;0,08619709493126;0,08813786215649;0,1012182590482;0,09004287602137;0,09741831487668
FR;1A2e;EM;N2O;FR_EM_1A2e_N2O;;kt;0,1043306229018;0,12309275725811;0,10799815294936;0,1184777522758;0,11996160476728;0,12539746272788;0,1082025985489;0,10454622745858;0,09204864897668;0,09037983175097;0,0779729530956;0,07090866014123;0,07934614154837;0,07858697899236;0,0842613417191;0,06926812562632;0,06958381683466;0,0657179465385;0,05949928157196;0,05891550440122;0,06658476713002;0,05897762414788;0,08230106973959;0,07792950254823;0,07232475162255;0,09330269798616;0,09368204271288;0,08617680724604;0,09603711513791;0,08949119306337;0,08874363518442;0,08451536821583
FR;1A2f;EM;N2O;FR_EM_1A2f_N2O;;kt;0,26701404514595;0,30204969269445;0,20202547508364;0,17637986254022;0,19117533423047;0,18899301383416;0,19548675799726;0,19164202714375;0,19899482268135;0,20639627291679;0,20388359192978;0,20309708747523;0,18640910160031;0,20261368410497;0,20090321631853;0,23185200591027;0,21640229919532;0,22040453176996;0,25533031540778;0,22359829402201;0,21121949057192;0,19939964933467;0,20280500564274;0,21971502525952;0,22772635437664;0,22122497798674;0,2132306853453;0,21701236694606;0,22784231234762;0,22338424011303;0,20940873254051;0,21037018263033
FR;1A2g;EM;N2O;FR_EM_1A2g_N2O;;kt;0,96415699467703;0,98345645123673;0,97688820839621;1,04603144935698;0,75583301325677;0,90750910444093;0,93337542690614;0,8327503836663;1,45417242910491;1,26156874765906;1,0834028507406;1,37878177579836;1,87077068814503;1,7860974918475;1,67250565884789;1,59155308823771;1,48263487679149;1,28306077652371;1,10968393788874;0,91687684742694;0,84458795579563;1,23677444965034;1,23028695306459;1,25111450821284;1,20528861828975;1,19568916384644;1,18663960078564;1,22030238982913;1,18979185299069;1,25157056764891;1,19429329908359;1,25411094723093
FR;1A3a;EM;N2O;FR_EM_1A3a_N2O;;kt;0,11414789195259;0,11682719811198;0,11546907870001;0,11510217869426;0,11998069314236;0,13648186973926;0,15126034178689;0,15498473765232;0,16013518955695;0,16453681815548;0,16936619504029;0,15928946545385;0,15387501631021;0,14003149376668;0,14135869472103;0,13666784360052;0,1303856538684;0,12830217342674;0,12863718618443;0,12707257776225;0,12564363001014;0,1268433247366;0,12745084597109;0,1257206625628;0,12079265799982;0,12045775931716;0,12434817134769;0,12848866100052;0,13517479765141;0,13748754158577;0,08440886472017;0,10402518417929
FR;1A3b;EM;N2O;FR_EM_1A3b_N2O;;kt;3,0412784031539;3,09017248541487;3,2874471360222;3,63046066617508;4,33496963208995;5,28417816178361;6,41519527898721;7,38465405078189;7,79395410336067;4,71589346057995;4,47037052905494;4,59739610352497;4,61991567536628;4,66270821758866;4,70846747711079;4,60917873466469;4,59891342585662;4,62295752359941;4,49634181592625;3,94417836792556;4,09864990964115;4,22449018851195;4,36646231030321;4,49405499690103;4,63484938102275;4,74923645815319;4,80422563285057;4,77406511926848;4,57835388193827;4,48223161247177;3,7652980445698;4,16768660064774
FR;1A3c;EM;N2O;FR_EM_1A3c_N2O;;kt;0,04246224674296;0,04113134050176;0,0391666693838;0,03624078820276;0,03365291495599;0,03215300474765;0,03113898094484;0,03084322400235;0,02935387654196;0,02957569424883;0,03010383164613;0,02862504693369;0,02947006676937;0,02820253701585;0,027780027098;0,0251393401115;0,02448083050193;0,02357510991732;0,02451036884686;0,02242225903358;0,02117452540186;0,02153652563322;0,02067637960787;0,02043233527681;0,01746613650844;0,01944503692353;0,01622569747686;0,01721807292854;0,01536112313979;0,01538732929997;0,0128268611847;0,01470484987213
FR;1A3d;EM;N2O;FR_EM_1A3d_N2O;;kt;0,03179971434407;0,03114957214692;0,03086715393079;0,02853352358047;0,02837829097479;0,03003563117569;0,02954587940311;0,03105535745626;0,0327592669696;0,03482916438391;0,03272773192739;0,03286201099071;0,03600670026776;0,03662266666571;0,03646129651859;0,03448102298575;0,03319664934827;0,03294744494611;0,03192794413355;0,03244421193245;0,0336810159112;0,03392193867396;0,0350598161094;0,034950487767;0,034691748348;0,03530099570853;0,03463137679337;0,03539813407057;0,03617375325783;0,03630297618761;0,03558064017794;0,03544649833758
FR;1A3e;EM;N2O;FR_EM_1A3e_N2O;;kt;0,0034981108592;0,00416441768953;0,00449757110469;0,00383126427436;0,00611336516822;0,00627661034165;0,00796902969068;0,00710949387956;0,00705285779898;0,0088485547067;0,00802899730541;0,00739897996799;0,00956832796497;0,01099672788035;0,01385824844161;0,016496206762;0,01317423019328;0,01160060371326;0,00991258498968;0,00928254861907;0,00888375130299;0,00771185368259;0,00969750011819;0,00899208426334;0,00688168471425;0,006265364969;0,00567676839324;0,00551756038533;0,00565681849568;0,00730949762074;0,00418968252923;0,00395409430585
FR;1A4a;EM;N2O;FR_EM_1A4a_N2O;;kt;0,18908044674428;0,19697184587643;0,18102131912191;0,16870771811609;0,15741744144004;0,16010264014153;0,17066948907529;0,16010621621448;0,17040601373838;0,17017214170401;0,15541038632286;0,16315307362703;0,14495540606245;0,15289927761609;0,15291141879115;0,15028605620259;0,13014605741889;0,12996539153658;0,14417865706855;0,14604758770002;0,13387174820533;0,10404564947862;0,12123158847817;0,14074323842971;0,12346959185892;0,12990075888635;0,12899349283732;0,13158627060246;0,12703615914592;0,12561830642586;0,12171270864185;0,12784107636126
FR;1A4b;EM;N2O;FR_EM_1A4b_N2O;;kt;1,6621800247047;1,94217697711452;1,86864029797695;1,79698893713301;1,56955198144504;1,58932959935395;1,7350817733384;1,53545363342196;1,55496487613032;1,48304039319287;1,39690571795176;1,44836992994033;1,33635226502318;1,4273546309393;1,43855989839896;1,40739201448183;1,30097712109262;1,217888157886;1,31194775933499;1,34035891368129;1,46543267195858;1,19965615747969;1,3718198105909;1,48693679544044;1,20740134506784;1,26885143945746;1,33771944529829;1,28985535699691;1,23819253038015;1,24113416639923;1,14866369581687;1,29587979789951
FR;1A4c;EM;N2O;FR_EM_1A4c_N2O;;kt;3,08696707316355;3,11786110121792;3,1434602172331;3,16755556745882;3,18314322526816;3,2013892448038;3,21890352633484;3,23537563962537;3,25353164429171;3,28339042373387;3,30316282223317;3,31633987055182;3,33494167807925;3,35193801615222;3,50707903493617;3,40210287055079;3,32891744787663;3,30916558927511;3,44536487365447;3,50496496214805;3,34603703000007;3,39332079154247;3,27396300280842;3,51767714739851;3,58274099130105;3,57578756505765;3,33084371508089;3,21218061001357;3,2180615085673;3,14050188000861;3,53681269134473;3,31028966295094
FR;1A5a;EM;N2O;FR_EM_1A5a_N2O;;kt;0,11800132;0,10836932;0,07314671500998;0,06105143626948;0,02667920030134;0,01360197872849;0,02436746928304;0,03643584567174;0,0536837189804;0,05236091603869;0,0511857869855;0,05023361020729;0,05130758062165;0,05635841230027;0,05584137659016;0,05100418729223;0,0515426377761;0,04950870117667;0,05046170630493;0,04619781774133;0,04590707674599;0,05467551787449;0,04639269593471;0,04616203213414;0,0440148905965;0,04163949928452;0,02791166372381;0,02827496778755;0,03025068825514;0,03010776890495;0,02726411435755;0,04150925646252
FR;1B1b;EM;N2O;FR_EM_1B1b_N2O;;kt;NE;NE;NE;NE;NE;NE;NE;NE;NE;NE;NE;NE;NE;NE;NE;NE;NE;NE;NE;NE;NE;NE;NE;NE;NE;NE;NE;NE;NE;NE;NE;NE
FR;1B2a;EM;N2O;FR_EM_1B2a_N2O;;kt;0,07222387287049;0,07064151285051;0,07381289754045;0,07113525986179;0,07297183817468;0,06992241736747;0,07945658317856;0,08014746991872;0,08120886899011;0,07408977695696;0,08246616053244;0,08142315607006;0,07705648410434;0,07756888877206;0,08059881076975;0,0770397392305;0,08171047887021;0,08935077300075;0,09104297555195;0,10503850500495;0,06980126182467;0,04882388750815;0,0368867421872;0,03184545133256;0,0329721139177;0,03225121567114;0,03213504144923;0,02988728230538;0,03022543967596;0,0279254237069;0,0202291974919;0,01811626346285
FR;1B2c;EM;N2O;FR_EM_1B2c_N2O;;kt;0,0162729588114;0,01718564611509;0,01636652669195;0,01644533387616;0,01717872082415;0,0169249717257;0,01760909313619;0,0186893867486;0,01872413840179;0,01914562069439;0,01850890511491;0,01966221239293;0,01804498681591;0,01812146032982;0,01966047846765;0,0592727243863;0,05884498699554;0,0919738792562;0,0599207151224;0,0548462546467;0,05760847818054;0,01578605452668;0,01546722015117;0,01625734843668;0,01483627202901;0,01470593624228;0,01397339805065;0,01360638443272;0,0166144687065;0,01360110787001;0,01457568326173;0,00940068070795
FR;2B2;EM;N2O;FR_EM_2B2_N2O;;kt;21,37;21,501;21,2;18,0;20,7;18,8;20,1;19,3;19,2;19,5731455005746;19,7761679508882;16,677245054255;14,7684733552;14,69;14,78834;13,765562;11,859204;10,997242;8,930551;6,423754;3,842138;2,1600094134371;1,61296515261253;1,48877875;1,91597681;1,75430753;1,82468132979998;1,4525551681;1,87897805361647;1,78627134;1,45169883562853;0,952194858
FR;2B3;EM;N2O;FR_EM_2B3_N2O;;kt;47,76;46,775;49,794;54,217;52,736;55,17;56,726;56,196;31,361;14,686;10,337;15,605;12,835;13,35357;3,792;4,90232;4,961;5,066;4,710066;4,564;1,227;0,405578;0,233508;0,52729564;0,477793;0,225993;0,244661;2,621565;0,20257153;0,05344649630208;0,03447213943096;0,06949477249182
FR;2B4;EM;N2O;FR_EM_2B4_N2O;;kt;8,634;9,947;8,546;7,155;8,023;10,175;9,021;8,083;9,248;8,076;7,211;4,943;1,784;0,796;0,996;1,1226;0,9509;0,6379;0,5734;0,7684;0,7881;1,068;0,8265;0,499014;0,471852;0,912773;0,419888;0,819426;0,892718;0,566093313;0,348645176;0,274017252
FR;2B10;EM;N2O;FR_EM_2B10_N2O;;kt;1,79277342263091;1,91191579414801;2,12097772021931;2,29993856962895;2,39186241698255;2,45365901064886;2,38188822862111;2,68384251170697;2,26950318262773;2,19115042977471;2,26215000077012;2,36267593667967;2,43111170117246;2,50232950651647;2,49069715016841;2,45761140627773;2,09824371688962;1,75672158637654;0,91442073847635;0,97429843896887;1,37303249526035;0,57198806084411;0,30608734561521;0,39520502800737;0,65527292835209;0,98744895817238;0,50562272286331;0,21753300631041;0,22955806101751;0,21788326494368;0,19963629498711;0,20208996058795
FR;2D1;EM;N2O;FR_EM_2D1_N2O;;kt;0,0046643224864;0,00473325840898;0,00501888746923;0,00550777398566;0,00666069242057;0,00819263240259;0,01005175817173;0,01190315175352;0,01275581460878;0,0077553422634;0,00733053640666;0,00766335726109;0,00782522157154;0,00811268549711;0,00834463382263;0,00830594313948;0,0083502919919;0,0082609064779;0,00797144493742;0,00686284707944;0,0071889686236;0,00731783983811;0,0074042718172;0,00759149198654;0,00785557902603;0,00833169351602;0,00839653649407;0,0083715304353;0,00820643317511;0,00832228693094;0,00685707238079;0,00744432068611
FR;2D2;EM;N2O;FR_EM_2D2_N2O;;kt;NA;NA;NA;NA;NA;NA;NA;NA;NA;NA;NA;NA;NA;NA;NA;NA;NA;NA;NA;NA;NA;NA;NA;NA;NA;NA;NA;NA;NA;NA;NA;NA
FR;2G3;EM;N2O;FR_EM_2G3_N2O;;kt;0,40996490699511;0,41132509850141;0,41269026112913;0,41390592038622;0,41497632338235;0,41602713261427;0,41705525733693;0,41808897564011;0,4191619963525;0,42061429084981;0,42251216529977;0,42453906122273;0,42657650356932;0,42856490297702;0,43063610501714;0,43276639583421;0,43474225453978;0,43652529871288;0,4381561801296;0,43963331614629;0,44104762952229;0,44247950790445;0,44390522698507;0,44537319672506;0,44681632797095;0,44805516658084;0,44840701866251;0,44951682729642;0,45056831450933;0,45158802470295;0,4523984715699;0,45318981832408
FR;3B;EM;N2O;FR_EM_3B_N2O;;kt;14,58881286443134;14,34661661238764;14,0967988749682;13,99152426280273;14,04315122358033;14,06159611317895;14,01263316507272;13,82444637496976;13,70376767241924;13,59803045857522;13,98599281655992;13,84276517237497;13,54621127723951;13,14957989837473;12,93931233247352;12,85166739536337;12,79743023885188;12,86784021515728;13,00280783517513;12,79309432202307;12,70690846038297;12,63585147655625;12,4861578712834;12,42884045854808;12,49491157191791;12,47777462057961;12,34142970784301;12,10648585610713;11,93394205974244;11,6650671289142;11,48339449704997;11,19592436510481
FR;3D;EM;N2O;FR_EM_3D_N2O;;kt;84,50949131489146;84,27446593789544;84,89509238571559;80,98344737137081;77,36980102880717;77,97161758652545;80,22321955468868;81,65731449352717;82,29338765171474;83,44634143107236;85,09176104443259;83,69722279664838;82,4508522624783;76,43135412005574;80,85789097283028;79,8994485240977;78,02438319438266;78,5753309160076;81,26622041543587;78,89837294258675;74,19879203534931;75,57977368224681;76,92366352940304;74,76735710719811;78,22719622579773;76,62816349657885;75,08652015082825;77,42946306765349;76,0368430251206;73,49255480767553;70,51723390024505;70,81909865501638
FR;3F;EM;N2O;FR_EM_3F_N2O;;kt;0,07178379886668;0,07367425304115;0,07407633324242;0,07118850494013;0,07255097439568;0,07097204575058;0,07534401322256;0,07501344842602;0,07841797844742;0,0769040456773;0,07716880565562;0,06650076097586;0,06695507367152;0,05501454276232;0,05675380402505;0,04933683512419;0,04816110107748;0,04547384653641;0,0477891796908;0,04749499857584;0,04428009812587;0,04199265903051;0,04054070521632;0,03521619917303;0,03402618829733;0,03266558984764;0,02673088228015;0,029616333334;0,02677150554617;0,02856941747832;0,02498933812618;0,02604744984786
FR;4A;EM;N2O;FR_EM_4A_N2O;;kt;1,4743244999286;1,2830741251629;1,3363167582319;1,2973011401733;1,3070103562762;1,2577573150038;1,1667439664438;1,2209328873657;1,2172927348786;1,1846444904224;1,2037575176505;1,0446150444081;1,3114401743752;1,30949288481;1,1975920552181;1,0579600469076;1,0065564514333;0,8966700480667;0,8565715103781;0,9794846132738;0,9857883644076;1,02189445164383;0,93320424604536;0,85892382522335;1,0363000656138;1,05553823623233;1,11513976711811;1,37887772297905;1,1205891865171;1,46840323378904;1,0632231888119;1,169780431119
FR;4B;EM;N2O;FR_EM_4B_N2O;;kt;5,211508466058;5,101459986398;4,936539021328;4,775945858538;4,582568413658;4,333475068148;4,072417759538;3,866400998808;3,657694379635;3,407994848155;3,158443436875;2,936969319491;2,874462721101;2,879168569781;2,977617883651;2,913786877471;2,986820817685;3,000355639305;2,986648688935;2,927753033024;2,893924282724;2,750987854114;2,548732949244;2,447287815704;2,323427289564;2,246665156684;2,099187346838;1,966965977438;1,849571613758;1,738713740678;1,557330831298;1,596991731428
FR;4C;EM;N2O;FR_EM_4C_N2O;;kt;0,23177737434657;0,25444791726575;0,26895118022251;0,27764356162831;0,26193074585422;0,25034637802621;0,24895034758297;0,24810909262692;0,24596263512892;0,3036649786443;0,3404513807173;0,3062133667972;0,3544190035042;0,2766159151042;0,2681931853491;0,2915268534111;0,3067077302261;0,2646400853318;0,3259003035587;0,3448617328787;0,3026313613408;0,2583895183479;0,23876605820767;0,2546025841424;0,23784572423341;0,2345527182781;0,23929782908502;0,24163254603959;0,23083904170083;0,22725070415213;0,22195069792833;0,22621760779133
FR;4D;EM;N2O;FR_EM_4D_N2O;;kt;0,0129031875938;0,01434509514609;0,01520360596518;0,01609915273723;0,01704749091837;0,01801261813742;0,01973036409847;0,02165459870866;0,02359032507075;0,02554940652694;0,02547817733694;0,02705655298499;0,02803692620409;0,02914708852709;0,03011275684209;0,03070157081309;0,03009093305109;0,0328397697748;0,03371160285118;0,03503795276266;0,0362952682679;0,03714126234351;0,03650129879147;0,04729128354413;0,0522824575911;0,0600869537151;0,0648331689099;0,0696400766139;0,0687778580615;0,0671855873191;0,066009549033;0,0621675982048
FR;4E;EM;N2O;FR_EM_4E_N2O;;kt;0,702392598644;0,804458461404;0,922690863354;0,851216577114;0,703662630924;0,572059839094;0,572664736284;0,569374954404;0,568554415334;0,571309020724;0,501629262234;0,68377701017733;0,85455944959352;0,91024751505686;0,90593979673686;0,87717580293257;0,74785376168448;0,84165713619733;0,84043887263495;0,78458029661814;0,73402531077481;0,68334362316481;0,61519237826338;0,8562447429996;0,8878376154077;0,8455238471739;0,800675941721;0,7601428432953;0,66312571246148;0,604459675561;0,6235553823729;0,69260954959965
FR;4F;EM;N2O;FR_EM_4F_N2O;;kt;0,015330626352;0,015331515571;0,015295867819;0,015249610619;0,015173829419;0,015133004333;0,015010367952;0,014864424562;0,0147088942;0,014535642629;0,014324347505;0,0142759804;0,014121298086;0,013988884067;0,013875786152;0,013725065829;0,013517316895;0,013428042362;0,013206429657;0,013032737352;0,012893000686;0,012720476581;0,012540320362;0,012889976;0,012986426829;0,01301750141;0,013102501343;0,013229773124;0,013356565724;0,013475748;0,013612147371;0,013643259143
FR;4H;EM;N2O;FR_EM_4H_N2O;;kt;NA;NA;NA;NA;NA;NA;NA;NA;NA;NA;NA;NA;NA;NA;NA;NA;NA;NA;NA;NA;NA;NA;NA;NA;NA;NA;NA;NA;NA;NA;NA;NA
FR;5B1;EM;N2O;FR_EM_5B1_N2O;;kt;0,2297561599812;0,23414968272398;0,23861590770277;0,24315667495339;0,25928176886082;0,27513717843294;0,28617616874921;0,27725997894729;0,29732083886109;0,35453302124591;0,37521218147605;0,38602099441668;0,39653047875555;0,41491204876032;0,43295889556827;0,44758630473559;0,46429576750744;0,46992171514901;0,47635328937169;0,49796838430999;0,52394302131999;0,59976380306593;0,67561360241806;0,70166589830314;0,72177098633695;0,74763429197008;0,76279500477102;0,78964467424131;0,80951011998156;0,80066386655564;0,80229574539168;0,83094754449946
FR;5B2;EM;N2O;FR_EM_5B2_N2O;;kt;NA;NA;NA;NA;NA;NA;NA;NA;NA;NA;NA;NA;NA;NA;NA;NA;NA;NA;NA;NA;NA;NA;NA;NA;NA;NA;NA;NA;NA;NA;NA;NA
FR;5C1;EM;N2O;FR_EM_5C1_N2O;;kt;0,56835042464549;0,5715136502179;0,5810534145649;0,58347637793773;0,58334855223514;0,57091598649416;0,55795142998485;0,52318836585146;0,49449192001517;0,46828125494449;0,48747551643371;0,45584629729222;0,42988036238042;0,43247584017348;0,42297386036085;0,42674689263494;0,40969802479135;0,35916277887697;0,33159919205181;0,31222274264103;0,38917771623804;0,35432680587831;0,37126439505618;0,26713932756414;0,29187422370501;0,33454293801137;0,25982756723005;0,25011320293794;0,24058932875756;0,34134691676359;0,34484830127314;0,34704480351765
FR;5D1;EM;N2O;FR_EM_5D1_N2O;;kt;1,87289209112165;1,93011817893779;1,89770684396189;1,89077482024399;1,88253097090712;1,91724857139862;1,8913883998613;1,86234198806363;1,83181378926603;1,76155571599191;1,72751300270759;1,64858861213907;1,5740698088928;1,50080190974307;1,42385637522688;1,35998540799436;1,33615499738308;1,20427437707301;1,24353515832944;1,28726218746679;1,32767290655902;1,31079110473202;1,27787196001766;1,24431581938159;1,24799937079148;1,23239212020519;1,21849770854546;1,22837822382144;1,22589939643746;1,22961954836709;1,22338089566103;1,21998018812131
FR;5D2;EM;N2O;FR_EM_5D2_N2O;;kt;0,11371986007663;0,11418488275433;0,11429137418112;0,11461175565687;0,11553025971432;0,11752900054405;0,11529583692603;0,11193114433839;0,12200823352485;0,11208145382961;0,11452402418923;0,12282335494351;0,12586636566725;0,11749621503132;0,12546572640174;0,12143004185952;0,12135062704724;0,11792809685914;0,1153026755895;0,10801106341634;0,11458718582833;0,11908463272688;0,10535317935651;0,09663083910882;0,09498736220213;0,09492435759;0,09442791345106;0,09138684797601;0,09229600962067;0,08629707915595;0,08601929573549;0,09215724224883
FR;2B9;EM;HFC;FR_EM_2B9_HFC;;kt;4202,290266;4824,322448;4101,738666;2373,687372;1301,276878;605,223876;741,66464;759,55527;529,14423;764,64461;616,323223694382;658,7268070786517;641,8695831280899;550,2563393707865;648,371464009528;739,4616520789281;779,9085126139141;517,8251616461602;493,63961161797755;274,2054599369884;187,7852752676839;115,56547370028233;131,51128566436248;114,38161990319826;134,22120299442375;191,77679533897455;258,83840401239604;264,2716477841829;131,66597617665855;116,35020012921355;85,82118726598824;35,16500993024049
FR;2B10;EM;HFC;FR_EM_2B10_HFC;;kt;NA;NA;NA;NA;NA;NA;NA;NA;NA;NA;NA;NA;NA;NA;NA;NA;NA;NA;NA;NA;NA;NA;NA;NA;NA;NA;NA;NA;NA;NA;NA;NA
FR;2E1;EM;HFC;FR_EM_2E1_HFC;;kt;23,91502815878199;26,30653097466022;28,93718407212619;31,83090247933884;35,01399272727272;14,44401920080456;11,4527612606101;19,79640888425526;21,62752480936421;19,97520133333329;21,43071333333329;16,28365933333329;16,47342995169086;16,47342995169086;13,17874396135266;15,2148;17,7692;17,4592;18,0668;8,1592;10,0564;15,0164;8,8784;5,3816;3,01122370193996;2,66296342444157;2,34356370979135;6,35511714089809;6,91489752690752;5,58483764831191;5,54269187897078;5,55455709157387
FR;2E3;EM;HFC;FR_EM_2E3_HFC;;kt;NA;NA;NA;NA;NA;NA;NA;NA;NA;NA;NA;NA;NA;NA;NA;NA;NA;NA;NA;NA;NA;NA;NA;NA;NA;NA;NA;NA;NA;NA;NA;NA
FR;2F1;EM;HFC;FR_EM_2F1_HFC;;kt;;;0,60129476861783;26,09318618018886;111,12495782664111;367,60883189065055;651,814655936142;1032,4605202731752;1631,6052646189698;2506,728484136297;3609,775072602099;4756,913402779856;5791,271440184072;6917,1192954970165;8115,614629668182;8977,815450563894;10305,880020882423;11247,393337714768;12309,670666100368;13054,6186254245;13818,626486041689;14379,469495783458;14644,734468482957;14748,557359549417;14730,916502167987;14478,613486224216;14175,132744708608;13562,50585789277;12770,643686189911;11601,30061395958;10379,336300674464;9218,001191841651
FR;2F2;EM;HFC;FR_EM_2F2_HFC;;kt;;;;;;;;;;;273,8381939389824;282,49435433170135;337,4305430139169;364,64324291155486;368,9540206328982;395,1218981272362;431,67906763961645;462,1837816486113;500,9115763385077;155,58248630038617;183,6714437983737;212,23648787762383;219,5285789145981;204,23221045471234;233,65671840555575;273,0491324981805;302,4504650428342;308,52747427751814;322,67384390281444;262,56732556795987;193,02720063394156;188,68843756934305
FR;2F3;EM;HFC;FR_EM_2F3_HFC;;kt;;;;;;4,65545909183632;19,7493524717182;31,65834985160009;43,5673472314819;55,47634461136382;67,38534199124561;88,27489124290528;103,91088782362255;117,82318389339694;127,44792765460818;137,81183699797924;164,73194850513272;159,2450405468696;152,63794432365583;147,34275024401146;143,26902316005467;159,21223041271358;151,5035851841963;144,65658735303106;122,40618841120848;106,8134537546096;99,24955517798153;89,4366325431863;69,55921807255876;55,16406626375837;47,18628083810903;36,56163022432471
FR;2F4;EM;HFC;FR_EM_2F4_HFC;;kt;;;;;77,85965298712775;572,312632375396;1363,436870904538;1733,5690253130715;1747,7065536993096;1760,3360296845865;1699,7209225464235;1655,335379687462;1665,7174906863247;1825,5267896988596;1914,9568225625328;1903,5474135725972;1935,8730236769213;1928,9904597392333;1925,4974735027395;1871,6835222453433;1918,1204643372216;1975,4861463860389;1852,2620686170758;1764,4390568668555;1731,9437611862709;1781,081779701834;1759,0065249951385;1755,9087364625402;1179,962972933526;584,6351438875391;535,712001547179;469,8665925186273
FR;2F5;EM;HFC;FR_EM_2F5_HFC;;kt;;;;7,8375;21,2394364820786;36,3189255053219;62,1044890232433;62,7;34,82415605625;30,66731221125;39,89976651375;83,65493565;107,53472362875;100,63199598375;110,12282523;141,1682490075;124,09868579625;203,22938446125;223,9626504825;180,5447230325;149,34329578;245,4268355225;304,82996334625;271,02530631375;193,808547575;143,12802417;64,43224344;62,8549196925;44,63736419625;32,950218;33,7611;29,7946125
FR;2G4;EM;HFC;FR_EM_2G4_HFC;;kt;;;;;;;;;;;;;;;;;;;;;;;0,1128795096;0,311709299616;0,49205692763136;0,50877007452611;0,52030167794506;0,66234762042726;0,64061982761017;0,77955132250576;0,81191742960553;0,98680841242131
FR;2B9;EM;PFC;FR_EM_2B9_PFC;;kt;1084,128336;1107,467208;988,589136;1263,255912;1192,511088;288,756936;247,4514;273,6018;293,00652;344,1474;309,657888;402,883848;361,9656;493,272;396,474;228,735;104,754;97,461;88,179;25,55865;11,41023;3,48075;2,94372;2,93709;2,40669;2,16801;1,92933;2,7846;;;;
FR;2B10;EM;PFC;FR_EM_2B10_PFC;;kt;NA;NA;NA;NA;NA;NA;NA;NA;NA;NA;NA;NA;NA;NA;NA;NA;NA;NA;NA;NA;NA;NA;NA;NA;NA;NA;NA;NA;NA;NA;NA;NA
FR;2C3;EM;PFC;FR_EM_2C3_PFC;;kt;3210,976634347824;2828,6084986956507;3011,3435634782604;2625,6198652173894;2248,615280869566;1894,3539860869587;1616,4552795652141;1659,8535834782615;2108,1636808695657;2805,682486956519;1731,1036408695636;1352,94140217391;2704,03363826087;2304,2870308695638;1325,4376826086975;747,43459524;626,5601448;457,64239626;94,28035806;30,2345631;47,1910542;88,38141207843206;120,06997005757508;87,7992405;72,81398385;55,83696379305;98,148170412597;36,9850545;58,12094372961;60,32305340343205;55,08473477089198;38,38322787852934
FR;2E1;EM;PFC;FR_EM_2E1_PFC;;kt;183,50959056708697;201,8605496237953;222,04660458617508;243,88950220604687;267,91668958790547;279,0666787494164;420,6430360009639;537,5506127248161;499,68771524823956;490,1353980536414;528,900142833042;470,5718743338106;511,96398571860874;469,4707680580887;428,2699280634058;323,85407736095414;328,44532736095414;242,04255;222,16206882;143,105922;154,669272048;175,89985944;112,06166;71,18484;77,06563684775325;63,49797564533431;88,48307855781125;101,16427349580745;72,90390128245103;73,22085877995345;69,98730524754383;58,0209750763314
FR;2E4;EM;PFC;FR_EM_2E4_PFC;;kt;IE;IE;IE;IE;IE;IE;IE;IE;IE;IE;IE;IE;IE;IE;IE;IE;IE;IE;IE;IE;IE;IE;IE;IE;IE;IE;IE;IE;IE;IE;IE;IE
FR;2G2;EM;PFC;FR_EM_2G2_PFC;;kt;205,942024;206,4034143;206,841735085;230,43127583075;189,561735039213;295,254148287252;236,686601872889;138,013074779245;150,951516540283;155,320060713268;130,207269677605;162,494112693725;178,107980059039;193,371711056087;217,819625672209;272,686126354543;246,330818867213;253,257689153342;281,772371080783;289,870991775786;326,453015544591;408,120471404879;452,781529432663;419,717190416775;382,244917165088;343,905501575985;391,628472116338;471,690963352172;454,712133266216;399,795262089021;346,51679878457;293,779710710341
FR;2B10;EM;FGAS_IPCC;FR_EM_2B10_FGAS_IPCC;;kt;NA;NA;NA;NA;NA;NA;NA;NA;NA;NA;NA;NA;NA;NA;NA;NA;NA;NA;NA;NA;NA;NA;NA;NA;NA;NA;NA;NA;NA;NA;NA;NA
FR;2E3;EM;FGAS_IPCC;FR_EM_2E3_FGAS_IPCC;;kt;NA;NA;NA;NA;NA;NA;NA;NA;NA;NA;NA;NA;NA;NA;NA;NA;NA;NA;NA;NA;NA;NA;NA;NA;NA;NA;NA;NA;NA;NA;NA;NA
FR;2B9;EM;SF6;FR_EM_2B9_SF6;;kt;0,0057;0,0057;0,0057;0,0057;0,0057;0,0057;0,0057;0,0057;0,0057;0,0057;0,006;0,0042;0,005;0,0065;0,0049;0,004898;0,005239;;0,00246149525384;0,0026903921281;0,00308906795022;0,0038257528585;0,00373205259198;0,00413099216535;0,00469706462231;0,00498428545805;0,00573450571426;0,00580622334635;0,00587794097843;0,00568254440832;0,00678;0,007075751
FR;2B10;EM;SF6;FR_EM_2B10_SF6;;kt;NA;NA;NA;NA;NA;NA;NA;NA;NA;NA;NA;NA;NA;NA;NA;NA;NA;NA;NA;NA;NA;NA;NA;NA;NA;NA;NA;NA;NA;NA;NA;NA
FR;2C4;EM;SF6;FR_EM_2C4_SF6;;kt;IE;IE;IE;IE;IE;IE;IE;IE;IE;IE;IE;IE;IE;IE;IE;IE;IE;IE;IE;IE;IE;IE;IE;IE;IE;IE;IE;IE;IE;IE;IE;IE
FR;2C7;EM;SF6;FR_EM_2C7_SF6;;kt;0,0316046225;0,0321733725;0,0327421225;0,0333108725;0,0344096225;0,0352143725;0,0360171225;0,03884125;0,0475;0,039321;0,032407655625;0,02081331125;0,01473154083333;0,01454377041667;0,02193;0,01508923592394;0,01257569787616;0,01431296431119;0,0115492822972;0,00882560821841;0,00838829763821;0,00352908805228;0,00431685410894;0,00382481516836;0,00225935881729;0,0016506820402;0,00263842857705;0,00235819706594;0,00252;0,00134;0,000336;0,000336
FR;2E1;EM;SF6;FR_EM_2E1_SF6;;kt;0,00243528820063;0,0026788170207;0,00294669872276;0,00324136859504;0,00356550545455;0,00241320279769;0,00365783651717;0,00449379445582;0,00335136290722;0,0029464527027;0,00283954726727;0,00206894078078;0,00157984071028;0,00160856508683;0,00129259694477;0,001545;0,000575;0,000401;0,000225;0,000212;0,000217;0,000238;0,000202;0,000198;8,507408735e-05;0,0001033044501;9,241872638e-05;0,00017024;0,00015526268421;0,00015041314035;0,000179143;0,00019985153
FR;2E3;EM;SF6;FR_EM_2E3_SF6;;kt;NA;NA;NA;NA;NA;NA;NA;NA;NA;NA;NA;NA;NA;NA;NA;NA;NA;NA;NA;NA;NA;NA;NA;NA;NA;NA;NA;NA;NA;NA;NA;NA
FR;2G1;EM;SF6;FR_EM_2G1_SF6;;kt;0,03751452069286;0,03836148644719;0,03920845220152;0,04005541795585;0,04090238371018;0,04174934946451;0,04071203454245;0,03576165599778;0,0345982138305;0,03330870525679;0,03331919668307;0,03202968810936;0,03054017953564;0,02845067096193;0,02926116238821;0,02697371937005;0,0242233120274;0,02397290468475;0,02549029777246;0,02076315136214;0,01850566081941;0,01500444697885;0,01431611375536;0,01338227911765;0,01098416131095;0,01279316419842;0,01164227015831;0,01032556331322;0,01079046413101;0,00980586534787;0,00973933346983;0,00888835798143
FR;2G2;EM;SF6;FR_EM_2G2_SF6;;kt;0,01739857498754;0,01849125864651;0,01850862601982;0,01852617586009;0,02276225713237;0,02326042662035;0,02347613972774;0,02394138074314;0,02274417110055;0,0194020859737;0,02116638868148;0,02104463800286;0,01830804564327;0,01827554419277;0,01336394484602;0,0110007626466;0,01239047693544;0,01179029928306;0,01264449012934;0,01200570700886;0,01133557651396;0,00983589735541;0,00995991864228;0,00824203013659;0,00751922715602;0,00735044841787;0,00790030301306;0,00741599267827;0,00556908699248;0,00565417433601;0,00499845659335;0,00640806265668
FR;2B10;EM;NF3;FR_EM_2B10_NF3;;kt;NA;NA;NA;NA;NA;NA;NA;NA;NA;NA;NA;NA;NA;NA;NA;NA;NA;NA;NA;NA;NA;NA;NA;NA;NA;NA;NA;NA;NA;NA;NA;NA
FR;2E1;EM;NF3;FR_EM_2E1_NF3;;kt;0,00095819088363;0,001054009972;0,0011594109692;0,00127535206612;0,00140288727273;0,00036394906286;0,00066632581657;0,00099865666662;0,00122995187426;0,00165172049383;0,00115649382716;0,00165381944444;0,00206655931294;0,00177133655395;0,00206655931294;0,001818;0,00173;0,002448;0,002695;0,001451;0,001868;0,001823;0,001186;0,000618;0,000370436;0,00036243062;0,00033943943;0,00044403754;0,00071224867791;0,00059829253093;0,0004965398486;0,00072044374754
FR;2E3;EM;NF3;FR_EM_2E3_NF3;;kt;NA;NA;NA;NA;NA;NA;NA;NA;NA;NA;NA;NA;NA;NA;NA;NA;NA;NA;NA;NA;NA;NA;NA;NA;NA;NA;NA;NA;NA;NA;NA;NA
