"DATE","VERSION","REGION","CATEGORY","TYPE","SUBSTANCE","TS:ID","UNIT","1990","1991","1992","1993","1994","1995","1996","1997","1998","1999","2000","2001","2002","2003","2004","2005","2006","2007","2008","2009","2010","2011","2012","2013","2014","2015","2016","2017","2018","2019","2020","2021"
"06.04.2023","v1","SE","1A1a","EM","CO2","SE_EM_1A1a_CO2","kt","7667.860869760486","8546.804823481418","9063.972782062636","9155.679704641632","9605.658257366782","8876.478864582008","13211.804701735635","8575.974589249501","9519.858979580735","7833.070914132565","6328.8166599292545","7668.982132292226","8636.017262483378","9837.278820208901","8759.989228989016","7839.273156182816","7963.236073982085","7693.140566166776","7307.1894172937045","7823.446901566722","10217.37798378608","7968.85497314669","7386.200297516646","7223.418006118713","6202.736215717503","5864.9296443447365","6555.067194117024","6366.556509241967","6669.6549809688295","5638.0754083897","5091.26889265774","5620.2693514850425"
"06.04.2023","v1","SE","1A1b","EM","CO2","SE_EM_1A1b_CO2","kt","1777.893059261","1818.13264365312","1915.78831386012","1956.20177260942","1942.66964628235","1891.06969751485","1988.13276976148","1982.56684622631","2063.971446225","2050.33807566339","2060.6139695209","2198.03003917855","2130.8626520437906","2071.48653846917","2184.832665356798","2224.409984208764","2165.012198482638","1921.07441103247","2192.6929108918","2092.259489218934","2130.362900200535","2022.4665158325602","2198.08819505355","1903.9555396793698","2025.63518231957","2063.1176428462186","2160.074721190064","2066.071416613674","2199.102612283435","1865.17584709392","1894.80324969645","2766.487907527779"
"06.04.2023","v1","SE","1A1c","EM","CO2","SE_EM_1A1c_CO2","kt","300.316041883811","297.506018478354","272.451440928151","285.876793765519","321.902248202659","341.464660877071","327.602737815418","330.578849758208","322.62375162236","325.262862916347","335.498067793242","351.241506725479","359.78069641028","351.00347","355.69524","343.88665","331.580345","305.88435","313.54605","275.339005455","313.217423190562","344.5578611","358.32558755","351.80574135","376.661475069313","457.837482678916","415.733672096972","393.046831858121","361.8552","387.4169","359.501792668326","326.942590246576"
"06.04.2023","v1","SE","1A2a","EM","CO2","SE_EM_1A2a_CO2","kt","1705.6558173744577","1661.7721312112085","1676.8831030364972","1760.8853299570678","1808.37976652842","1908.9733865443914","1847.64685607583","1914.2633788598714","1917.7926458701813","1900.1118002813662","2098.0308765413997","2064.976972069263","2119.347560091775","2218.6048923903077","2165.911671577282","2103.881864629374","1940.7452628508531","2230.4030751382543","2088.2743759044706","1096.4251760131071","1771.2884589186992","1516.300438145257","1158.4067251853812","1262.09678507493","1266.8408594087334","1585.0752435986851","1228.33308347471","1376.115822897617","1341.533722634327","1567.9986564668611","1200.012517515035","1341.1422161019761"
"06.04.2023","v1","SE","1A2b","EM","CO2","SE_EM_1A2b_CO2","kt","128.7915067295828","124.2573874040179","122.54469620499401","114.20643330217459","104.82287958426288","94.17058405345304","88.68612987546189","98.2944763128835","106.1511443679154","122.4367424013896","100.13529570204771","90.3256503428375","92.3937592735689","74.8688080459341","74.8495075061967","72.6078598497382","77.4496678106608","76.6480028357999","86.59759985240422","82.56402009848189","90.1928021392072","83.2446558749186","84.2836286564643","91.9392609083283","94.2535683522805","C","100.8136276895447","100.8459866836974","99.5173939242407","110.9348004504777","106.8466477115154","117.17915225689698"
"06.04.2023","v1","SE","1A2c","EM","CO2","SE_EM_1A2c_CO2","kt","682.528892751211","722.202133070485","669.9260646370092","633.94119702025","757.448933796239","776.183675959857","843.7194083411608","899.5380536144415","923.012820890144","857.622834597047","935.2600514331322","1090.237199926894","911.7391342779861","937.215060263448","801.324988077594","717.389706309029","759.6855411508471","747.7236816106752","659.062373264415","607.775001781324","667.438962101011","628.727672300796","607.587705730529","573.788985470225","518.336526617398","518.195044759886","625.927353937969","501.828098170715","553.505776374789","474.435925236047","468.082846845851","443.062571125681"
"06.04.2023","v1","SE","1A2d","EM","CO2","SE_EM_1A2d_CO2","kt","2155.7770527171174","2320.6834965454905","2072.685417496015","2571.127106576069","3312.504731445672","3265.928409276061","3071.962505565016","3399.163405752161","2919.7724110406807","2417.693829768947","2544.2537437598344","2469.358298133129","2442.314712885098","2499.5237750744154","2382.4881172714936","2105.75930489501","2069.4656188906474","1622.6416272972208","1515.4422348811877","1351.7195365005773","1386.1967767585245","1094.6935620398303","1008.4172711154594","874.557119077827","680.021197300475","C","687.1774055639241","703.063944916718","788.5919302240908","702.7216370954267","616.2244766130736","659.7108806930687"
"06.04.2023","v1","SE","1A2e","EM","CO2","SE_EM_1A2e_CO2","kt","945.4208281191089","926.6738259556801","843.570596548363","898.805400531452","922.520061513807","941.105014546136","945.249828169707","984.310096824258","951.51996143376","925.2624896925654","809.3322123609166","694.5915188859203","759.9385251318332","840.5273873270241","765.559510049392","604.959410561154","638.9500958718219","559.86320226132","490.10293340082103","487.16207082866504","484.575856914271","482.139091706543","492.65704317907097","457.550846887849","437.140908163135","C","392.07172175817703","324.21133031595986","322.01157963343996","283.193718336044","274.45440900836","263.8127326661549"
"06.04.2023","v1","SE","1A2f","EM","CO2","SE_EM_1A2f_CO2","kt","1832.2382475073493","1532.8709738780615","1212.3150311295153","1311.475630818569","1239.6175559542417","1522.036171199485","1541.6253317847556","1479.7392154781357","1610.7645265585988","1507.060282069775","1767.5933423124588","1807.2975016650792","1641.8481751480174","1475.251239879019","1564.116830750592","1625.7051091861103","1735.6017043385523","1594.132658353504","1453.9675439561147","1251.9278599218724","1450.155791490294","1483.152635528199","1428.330880913761","1230.74459490662","1368.034239648812","1285.703523802593","1304.14141251001","1275.58766340046","1292.30637500642","1158.95613133761","1125.60105218285","1064.23891056724"
"06.04.2023","v1","SE","1A2g","EM","CO2","SE_EM_1A2g_CO2","kt","3267.826617098928","3317.817772654543","3169.540690776822","3232.80848040355","3397.282312172819","3406.5697330307257","3493.99006761174","3503.512447221337","3255.452877920189","3184.450984843087","2981.03734295134","3052.293890825656","3034.4027670625896","2847.3959596855557","2788.012297697274","2682.8297153210196","2760.2487037993687","2708.3983854543853","2586.4192335418147","2351.8216790902875","2609.1841348668477","2537.002156377243","2496.779843834109","2427.17992723552","2390.71365389822","2361.54255019387","2333.04553500507","2295.91057694701","2303.66933069804","2415.97157696058","2271.4654988699","2281.2398611780986"
"06.04.2023","v1","SE","1A3a","EM","CO2","SE_EM_1A3a_CO2","kt","673.041919227933","613.4232936398859","635.83477020536","581.9425310131912","613.4438150999265","622.2789179171609","603.9395120919539","654.0291714511079","667.0827606436518","698.6517114030338","643.4921700907529","625.134992758593","600.3876025397489","582.1549737410398","667.1927873370258","662.42890661987","622.921964468444","604.907991973824","589.4584818998379","493.360701561643","477.44599841121595","525.449973345233","515.8259010444859","518.050270163187","516.1776783900909","503.646216935753","545.022767963849","544.87244306363","522.767609929677","469.696471728205","194.77242415412897","189.62135061421188"
"06.04.2023","v1","SE","1A3b","EM","CO2","SE_EM_1A3b_CO2","kt","17401.846142446702","17380.08726888585","18245.93037582001","17521.862980061076","18070.883195447703","18163.0491891221","17922.31567363396","17937.631425760468","18061.574296959","18377.135392070308","18348.274983119376","18559.87123308059","19036.478909121375","19238.712948926197","19498.152243641474","19760.27130171838","19738.14674310511","20079.937411161143","19612.262859001854","19252.876140914064","19381.586462202355","18941.402551068863","17846.1727896272","17392.73517877283","16980.96790041625","17067.143071934188","16307.636935530123","15901.414326607146","15300.738447145166","15187.230369134488","13930.75039322724","13995.88549012375"
"06.04.2023","v1","SE","1A3c","EM","CO2","SE_EM_1A3c_CO2","kt","102.9443968332","90.3599259395","85.5730665855","81.303818616","76.946540958","74.8160826432","67.835550432","65.745737316","69.527864282","74.523534624","75.298546752","71.704071196","69.0491198","67.961150274","67.18912506","64.511242222","68.358628602","65.60354808","69.839568288","62.376225408","60.33081096","59.3254248048","58.830500736","52.495574544","46.84330224","45.707243904","44.0668368","41.410090512","44.255330784","45.307330992","44.056647936","44.484580224"
"06.04.2023","v1","SE","1A3d","EM","CO2","SE_EM_1A3d_CO2","kt","452.298841237789","459.774495332544","467.169746975277","474.43236515715904","482.816946195381","490.899995505711","498.39523540031297","507.021923566559","515.040996800203","522.946819123974","531.426041046853","519.715506236865","526.600652115322","560.551668225252","562.6511847696601","563.873321762524","588.6778626950019","590.800973869933","591.779256978909","609.489549091224","654.261322807815","672.612726422822","636.015728426465","651.4633192538901","640.22289084163","640.869567032751","666.181972455092","639.774303878574","696.961483013361","671.89255112802","623.3521553574041","600.4617033950884"
"06.04.2023","v1","SE","1A3e","EM","CO2","SE_EM_1A3e_CO2","kt","1053.3254275268127","1267.7197114067312","1355.3214875375209","1120.6346831804956","1034.112827922996","951.8616235675864","888.367775648696","841.2779891243243","739.6550434927985","667.8139442529929","634.1128422263747","510.8725155569977","570.6101960333773","559.3598633702289","546.8083803646264","494.1789852156913","505.35066282811283","490.265624435632","382.8906306369861","458.1476962900454","394.34735040273455","391.1404568926931","357.308467078347","332.15584078161584","335.81988690290746","355.7929947851395","332.5166638503804","344.67816889184206","328.6277648848983","355.8845203607357","350.9280926995696","374.44479290833266"
"06.04.2023","v1","SE","1A4a","EM","CO2","SE_EM_1A4a_CO2","kt","2775.972488791046","2714.3401338136073","2262.334781170695","2212.165535410324","2119.960441832214","1878.707567687341","1962.80808723796","1823.533400498326","1737.003591460749","1760.7527014998905","1698.2157299635548","1568.5582129611573","1470.7500379912685","1449.538618277621","1348.701658307185","1100.442371880112","1108.8725133624512","1165.1485407222226","914.3117676122117","825.6435860377308","1007.470079240793","934.5609122721233","796.5369974095296","692.2833355446893","728.1218588497368","677.4701469462275","665.6169239041831","614.5806703563317","617.1249267836117","656.0427606779006","638.8976612026383","648.483646960565"
"06.04.2023","v1","SE","1A4b","EM","CO2","SE_EM_1A4b_CO2","kt","6298.965854497313","6264.981387837674","6053.295432711068","5947.011844228824","6070.005876213083","5909.342687736546","5812.8046042073065","5207.280061222033","5201.95158042995","4748.350479001002","4697.9886782637695","4014.2163720095227","3568.2619357581207","3256.3657927990757","3067.7553409939596","2288.017276317607","1676.008426763467","1377.0696726199121","1139.2940585143017","1040.5828657249522","974.2377293205926","709.5824888960694","681.264473051631","659.9689527267656","579.983506717143","573.4500478802902","498.4292466404783","506.02584324431945","486.8672343758472","457.3326632508998","477.5906024223773","525.0912709327083"
"06.04.2023","v1","SE","1A4c","EM","CO2","SE_EM_1A4c_CO2","kt","1800.5898547961006","1558.0881932882576","1639.5185444405763","1755.3222471752035","1785.242729517676","1698.3634569755914","1773.664143606123","1767.5587522413944","1780.6955107115696","1669.679554811131","1579.653383193791","1577.4692979607241","1654.7148037293418","1704.471171129285","1728.0383580731811","1625.0665633001536","1595.7762568839316","1588.316269267321","1529.3912304933149","1455.9214972762452","1597.5713828392038","1551.2933513281107","1513.3628144380884","1458.5049595339478","1366.484035536415","1332.4902820140644","1255.532793403462","1227.0795311488394","1084.5063368878493","1145.724922344343","1114.0642177016489","1118.8958801291753"
"06.04.2023","v1","SE","1A5b","EM","CO2","SE_EM_1A5b_CO2","kt","NO,IE","NO,IE","NO,IE","NO,IE","NO,IE","NO,IE","NO,IE","NO,IE","NO,IE","NO,IE","NO,IE","NO,IE","NO,IE","NO,IE","NO,IE","NO,IE","NO,IE","NO,IE","NO,IE","NO,IE","NO,IE","NO,IE","NO,IE","NO,IE","NO,IE","NO,IE","NO,IE","NO,IE","NO,IE","NO,IE","NO,IE","NO,IE"
"06.04.2023","v1","SE","1B1b","EM","CO2","SE_EM_1B1b_CO2","kt","NE","NE","NE","NE","NE","NE","NE","NE","NE","NE","NE","NE","NE","NE","NE","NE","NE","NE","NE","NE","NE","NE","NE","NE","NE","NE","NE","NE","NE","NE","NE","NE"
"06.04.2023","v1","SE","1B1c","EM","CO2","SE_EM_1B1c_CO2","kt","5.31599414315009","5.17946339469821","4.57108757050461","4.72486238898798","5.56490865505766","6.05541630646029","5.88607169191315","5.70000046575495","5.53548655966479","5.60931586946877","5.51861243478587","5.90944354689702","6.1125155247004","4.99653","7.30476","5.390505","5.14485","4.58865","4.4496","14.5428744035418","5.008530942","5.84923095","8.65006875","3.2971536","7.10587800522817","23.7197649857751","9.73948984995505","5.32202230686285","4.4368","7.4721","6.5664009663433","9.3813648230171"
"06.04.2023","v1","SE","1B2a","EM","CO2","SE_EM_1B2a_CO2","kt","254.8244157316189","228.0492036747989","252.8560750747009","274.0183741300779","234.9383353426179","264.45491795405786","282.0307996806409","308.2770646514295","308.2340646514295","317.4867004301325","309.5291160085995","306.3121591440005","284.0849637471845","311.0423599896825","313.8883207095225","296.04658","685.4340759","771.41635056023","822.5015021826","811.0248817154201","782.071701458575","793.74070782379","795.067634848069","612.392456","714.278011501788","756.517249","579.668868731368","756.41139","783.122013","469.740663","401.67028","NO,NE,IE,NA"
"06.04.2023","v1","SE","1B2b","EM","CO2","SE_EM_1B2b_CO2","kt","2.60183061609791","3.12121331789334","3.12121331789334","2.54835045076523","2.61609124934887","2.52578847423114","2.75233977059396","2.66214654516774","2.79850461610434","2.6849824900662","2.45930766747271","2.75376418109202","2.50550909230399","2.00662517212384","2.59163060860274","2.32079525362016","2.11777747359803","2.11940258178473","1.66569748365412","1.59647908633291","1.4798542533705","0.04380418657988","0.04896976405975","0.04200746397819","0.03723851536583","0.03316343167151","0.03391206608888","0.03099239186113","0.02861505138599","0.02801614385209","0.03181408085273","0.033161622804"
"06.04.2023","v1","SE","1B2c","EM","CO2","SE_EM_1B2c_CO2","kt","73.48264821448895","47.38507380769965","50.73044447994275","63.40306899579005","51.99868634184465","63.74128162706829","31.31569806697589","41.18543296294139","48.45577089189113","49.38071316134139","56.83764484863209","57.6852440854658","75.1029143244631","77.6765076323377","63.15341678344941","60.40251130429641","119.08982494155669","69.90759849625569","32.79718222658455","37.24303639217945","36.78116947807975","33.95084543561985","34.54092978613467","83.18888218169405","51.19772854670307","41.52318383715657","50.259070584297","38.91098021636018","37.44447479933808","58.94668238142534","36.65880037256324","0.00378357997058"
"06.04.2023","v1","SE","2A1","EM","CO2","SE_EM_2A1_CO2","kt","1271.95391111134","1137.05209300746","1089.03641612395","1092.10124656332","1109.4686190531","1296.19960242537","1224.91056560283","1105.40567550064","1133.43763630929","1139.19338787444","1287.70864177102","1331.58740800468","1280.32695526988","1206.00762215242","1284.426854978","1315.1049647203","1442.26029033581","1339.47738532354","1396.012220152","1263.16454783556","1323.6795311136","1361.02567346451","1479.0222257761","1402.116968","1399.259051","1536.917896","1553.613001","1484.312004","1607.177126","1356.99109717674","1272.06216376668","1258.57230589026"
"06.04.2023","v1","SE","2A2","EM","CO2","SE_EM_2A2_CO2","kt","331.60240482648","332.082985292298","294.98825371296","317.619920908696","375.850834842476","310.860635800508","317.445603983973","346.479851191413","444.920983698157","440.523415696701","400.125115125731","397.475019969594","460.282100960062","447.759111275336","450.231072413354","545.60170233152","492.76781008352","538.949868186846","512.21414929766","368.041704319512","498.945038180375","497.230237623014","456.152302145626","479.50279782912","415.072661","420.063775","427.801177","464.894763","388.210617","372.617033","388.2739215069","374.93166262609"
"06.04.2023","v1","SE","2A3","EM","CO2","SE_EM_2A3_CO2","kt","53.5039902777934","47.6901267609735","46.4562957453204","46.4442720366668","56.8180531460854","59.8303948541154","51.2873468187382","56.3833628533662","57.4907458293929","42.6088268766915","60.8570795563375","60.594418342024","60.6124600681656","60.7852277262015","59.8375369712058","59.98816","63.90515506874","64.67658287811","63.58503926223","47.47294680286","57.14412962586","56.896770542","48.73413551643","17.57873129473","17.2292","17.596493","15.671925","17.155937","16.049004","16.453932","15.548490103","15.128644961277"
"06.04.2023","v1","SE","2A4","EM","CO2","SE_EM_2A4_CO2","kt","15.44271404376843","19.88772707674347","22.07591406573021","18.63633659499687","20.79170423977867","22.30584978079264","22.23982769470964","20.08937947234222","20.49936156773766","20.45204408092366","19.033793588707","20.89921536231939","26.86657937892667","27.37887648832461","26.75754054998374","26.66080628766702","26.64220614962441","28.59758689368953","21.8562396052549","19.31610160557489","21.71990708394506","21.63916362495849","19.19902273721893","21.03432270808757","18.83334715623997","19.85669580674709","14.73521068469468","17.78009390735132","18.69303698622012","10.45229635655539","5.56839604917275","6.87598220869776"
"06.04.2023","v1","SE","2B5","EM","CO2","SE_EM_2B5_CO2","kt","67.9837524452155","68.7021570825636","52.614992403761","54.1105363815918","56.4602354556242","57.0854868321843","58.1974768508088","57.6809347083915","53.4319666666667","53.2527333333333","48.0751","47.6665666666667","50.124","48.7222666666667","54.2066","55.6554333333333","50.43157","50.0033","55.3082666666667","31.4539666666667","44.02754","42.4220966666667","42.1408366666667","47.4333266666667","47.699","43.7892866666667","47.3320866666667","43.39561","45.6260133333333","47.16385","39.00299","43.9702166666667"
"06.04.2023","v1","SE","2B8","EM","CO2","SE_EM_2B8_CO2","kt","NO,IE,NA","NO,IE,NA","NO,IE,NA","NO,IE,NA","NO,IE,NA","NO,IE,NA","NO,IE,NA","NO,IE,NA","NO,IE,NA","NO,IE,NA","NO,IE,NA","NO,IE,NA","NO,IE,NA","NO,IE,NA","NO,IE,NA","NO,IE,NA","NO,IE,NA","NO,IE,NA","NO,IE,NA","NO,IE,NA","NO,IE,NA","NO,IE,NA","NO,IE,NA","NO,IE,NA","NO,IE,NA","NO,IE,NA","NO,IE,NA","NO,IE,NA","NO,IE,NA","NO,IE,NA","NO,IE,NA","NO,IE,NA"
"06.04.2023","v1","SE","2B10","EM","CO2","SE_EM_2B10_CO2","kt","514.0153609919469","508.4621599248211","527.0009339067715","499.38876880984435","556.5991177464672","577.7256161848971","632.5389742403341","633.5157391415579","630.7218527649783","447.3137141518424","662.1090774496031","682.500504161792","709.6280517564998","674.6327844426148","739.3691713633546","733.9666359865793","733.1395105803334","705.6805951166424","645.3157804821826","589.3783989147346","748.5150568752736","704.0644286174623","679.8921217162482","802.0860091528712","758.241129520215","703.7827925080119","814.6190337993457","806.387060489599","823.3901793911552","859.1937502477471","479.923112579941","886.4712712098324"
"06.04.2023","v1","SE","2C1","EM","CO2","SE_EM_2C1_CO2","kt","2626.045955839984","2582.0726323639756","2385.733610371998","2460.6611354787333","2772.35552321577","2877.165771100209","2674.862942623843","2698.751807893193","2610.450071018322","2619.5257526009673","2686.3348641320367","2786.6207907510407","2870.6052776559477","2671.5938360821033","2851.2446994975667","2605.475142746076","2570.346836623242","2706.4258915463383","2500.408776591437","1381.460316755093","2758.7057963263483","2564.5913481241655","2162.8083311062837","2227.250765331948","2193.237918987702","2112.28803323536","2497.74346053175","2239.59650194603","1978.93125992782","2962.22387954329","2090.2954689216","2337.132964771574"
"06.04.2023","v1","SE","2C2","EM","CO2","SE_EM_2C2_CO2","kt","227.578787827026","231.314465256844","240.324091234681","232.587403501457","249.196696362001","265.891364570144","267.094638536342","211.299965660478","241.564610144368","240.429479179752","240.393233491966","215.271286815752","238.099528015985","199.268847630339","257.478454282241","226.025564845891","217.430145657814","224.810566303888","194.799031244692","48.2098859995005","107.399308121555","117.559995732245","101.023976145866","87.865045053488","109.266086536664","C","C","C","C","C","C","162.91565481776"
"06.04.2023","v1","SE","2C3","EM","CO2","SE_EM_2C3_CO2","kt","132.860118448695","133.180564323459","99.8161743459293","120.316563401796","119.355225777504","128.830104227089","136.702753302855","135.969529691107","138.826386133917","139.660088536904","144.605274451692","145.845","145.95","141.785","141.039","143.531","142.341","139.793","114.275","97.591","134.558","158.63","199.822317","197.5133","173.1964","180.2371","190.2275","206.1209","187.66569","177.16216","172.320005","173.708268"
"06.04.2023","v1","SE","2C5","EM","CO2","SE_EM_2C5_CO2","kt","IE","IE","IE","IE","IE","IE","IE","IE","IE","IE","IE","IE","IE","IE","IE","IE","IE","IE","IE","IE","IE","IE","IE","IE","IE","IE","IE","IE","IE","IE","IE","IE"
"06.04.2023","v1","SE","2C6","EM","CO2","SE_EM_2C6_CO2","kt","IE","IE","IE","IE","IE","IE","IE","IE","IE","IE","IE","IE","IE","IE","IE","IE","IE","IE","IE","IE","IE","IE","IE","IE","IE","IE","IE","IE","IE","IE","IE","IE"
"06.04.2023","v1","SE","2C7","EM","CO2","SE_EM_2C7_CO2","kt","275.782883153408","235.394122288808","248.277145203523","254.042831122742","254.091694565509","244.539081998862","252.596798204684","236.747241656895","249.703696019998","234.964912099791","238.2042646405","236.296665032197","244.372155795291","236.249621928651","245.195494406066","244.137382335495","224.499038050582","249.2401925212","282.140834564034","265.38513548427","254.598797862427","249.264916756816","292.486746188322","293.6907686","274.9275026","C","C","C","C","C","C","278.084705220554"
"06.04.2023","v1","SE","2D1","EM","CO2","SE_EM_2D1_CO2","kt","157.872","111.7248","91.08","119.0112","84.4008","117.888428690496","107.001044825662","157.332731728249","153.049788697651","213.502008131763","224.024873278486","247.64321608227","243.148297686655","224.672130931866","278.675663419014","235.98198645207","228.163420421811","222.718919771257","260.407253258559","230.952743636835","248.960285617473","227.557539964103","289.924984982016","290.751222448011","267.992680076441","232.875971233871","253.86784640381","251.217776081117","235.999053926994","197.496802107371","C","C"
"06.04.2023","v1","SE","2D2","EM","CO2","SE_EM_2D2_CO2","kt","17.72754016","17.72754016","17.72754016","17.72754016","17.72754016","17.72754016","18.3239528266667","17.01689616","17.4583408266667","20.8323488266667","22.92548016","23.5797088266667","22.3826154933333","24.0456333333333","28.34020904","53.0959305066667","34.94092448","49.17089144","49.1488668","34.3438371466667","51.2091184","40.67446504","37.9072490133333","51.44129232","55.1862675466667","39.32922752","38.6401969066667","37.3121968266667","36.5768969866667","34.85883632","C","C"
"06.04.2023","v1","SE","2D3","EM","CO2","SE_EM_2D3_CO2","kt","217.38508795398903","201.76143527721297","186.1377826004367","170.51412992366053","154.89047724688407","149.25389995706993","143.65779267925578","135.28413238144145","130.2875878457373","133.535375932056","134.32229098354483","133.11139531734597","134.54703440287975","139.68108315358117","155.7206173069365","163.5268466809041","162.39554354653905","178.22101096533822","166.68997391753678","148.87003564032182","141.54223482196824","149.11971762981966","160.24062284422322","152.8681891260314","159.77932176805263","167.50374270323644","157.16807125981822","158.5031173137216","138.99697547379867","140.05969671073302","147.17693908657245","148.55492475146832"
"06.04.2023","v1","SE","2G4","EM","CO2","SE_EM_2G4_CO2","kt","NE,NA","NE,NA","NE,NA","NE,NA","NE,NA","NE,NA","NE,NA","NE,NA","NE,NA","NE,NA","NE,NA","NE,NA","NE,NA","NE,NA","NE,NA","NE,NA","NE,NA","NE,NA","NE,NA","NE,NA","NE,NA","NE,NA","NE,NA","NE,NA","NE,NA","NE,NA","NE,NA","NE,NA","NE,NA","NE,NA","NE,NA","NE,NA"
"06.04.2023","v1","SE","2H","EM","CO2","SE_EM_2H_CO2","kt","19.01914044728971","18.67307482906841","18.84994463636001","14.86836280539871","14.91853325779701","15.16199753738941","15.21641337253041","12.36435534650001","8.5672726100684","9.00221407511175","13.85392136844491","13.51711185409221","11.13045241808351","10.38915599725923","10.62686727708571","11.57575712931162","12.46050651618868","12.29981195095381","13.47288702900906","10.00526357873194","12.75621952797894","10.91688428365916","11.5932147888716","11.01601465225794","10.33632105884616","8.41399731953766","9.49872886188119","12.11136521791394","13.34163030861637","10.94809326310899","10.29675466380584","8.60757745753279"
"06.04.2023","v1","SE","3G","EM","CO2","SE_EM_3G_CO2","kt","173.4010666666666","137.0416666666666","110.6761333333332","131.8738666666665","158.9595333333333","171.4533333333333","196.2473333333323","177.5561333333333","133.1322666666666","159.7398","159.1956666666666","139.5577333333333","132.9504","129.6489333333333","122.8846666666665","116.1204","89.4476","115.3826666666666","104.4193333333333","113.7414666666666","123.0635999999999","123.0635999999999","141.6532333333333","141.6532333333333","123.1178666666666","123.1178666666666","126.7011533333333","126.7011533333333","126.7011533333333","122.4398831956666","122.4398831956666","122.4398831956666"
"06.04.2023","v1","SE","3H","EM","CO2","SE_EM_3H_CO2","kt","4.35057971014492","3.43391304347826","2.18565217391304","2.56666666666666","2.24463768115942","1.4331884057971","1.08086956521739","0.80985507246376","0.65202898550724","0.54681159420289","0.47985507246376","0.40492753623188","0.35550724637681","0.28057971014492","0.3491304347826","0.38101449275362","0.16579710144927","0.19927536231884","0.17217391304347","0.79869565217391","0.73652173913043","0.80188405797101","0.46550724637681","0.91028985507246","0.20724637681159","1.36463768115942","1.41405797101449","0.83695652173913","1.84768115942029","0.40652173913043","0.13072463768115","0.35250727536231"
"06.04.2023","v1","SE","4A","EM","CO2","SE_EM_4A_CO2","kt","-48152.89275866671","-47984.62281800005","-47185.76316666671","-43586.89033233337","-43390.449237666704","-43120.79108333337","-45120.42587800004","-45008.08104466671","-46346.301470333376","-45910.46515000004","-47108.65951000004","-48430.08221700005","-47128.66427866671","-44072.27919600004","-41225.816162666706","-38022.36490800003","-44300.786680333375","-42525.5536456667","-44018.32233333337","-46979.330926000046","-49602.93921000005","-50158.57115500005","-50830.58478666671","-49441.124153666715","-46838.704106333375","-46193.24965566671","-43614.85495400004","-38359.0414936667","-37172.5654006667","-37240.6413976667","-38117.47515033337","-37620.0562246667"
"06.04.2023","v1","SE","4B","EM","CO2","SE_EM_4B_CO2","kt","2686.1117910000025","2299.3070100000023","2715.518446666669","2788.250538333336","3528.8452796666697","2948.5875650000025","2345.702604666669","2842.109574333336","3535.1417420000034","2864.181910333336","3216.7892386666695","2915.693249333336","3353.4476213333364","2994.4941070000027","2899.7143046666692","2472.1134643333357","2039.260285333335","1887.2330876666683","1896.235579333335","1777.734064333335","2160.820192666669","2281.598968000002","2646.847232333336","2338.814940000002","2163.1691363333352","2276.0055523333353","2512.3413260000025","2622.130734666669","2590.8753090000023","1080.8042153333342","1454.682947666668","1076.131078000001"
"06.04.2023","v1","SE","4C","EM","CO2","SE_EM_4C_CO2","kt","-123.29769833333344","-476.2249433333338","-300.05766266666694","-366.96582633333367","-541.1908956666672","-536.6569523333338","-656.9523180000006","-296.4989610000003","-636.7234316666672","-627.8351053333339","-604.5185666666672","-585.5026980000006","-331.595938666667","-576.7438453333339","-525.2404043333338","-543.4675473333339","-266.7057176666669","-50.18910600000005","-279.43964400000027","-140.29703233333345","270.09748333333357","-149.90268333333347","-184.93856700000015","-29.58773766666669","-416.98044666666704","-249.03401600000024","-73.69984966666674","-163.2963236666668","1045.5074556666675","1215.3690523333344","93.47181433333343","234.3943690000002"
"06.04.2023","v1","SE","4D","EM","CO2","SE_EM_4D_CO2","kt","75.29302000000007","74.43485866666673","84.87479000000008","87.8180783333334","100.11764766666676","113.32045633333344","109.46132266666677","129.74906633333345","117.9152810000001","157.73522600000015","170.1126753333335","178.31228066666682","184.43589266666683","183.29305500000018","173.31036800000015","205.40203933333353","169.8367183333335","219.50596433333354","213.72966266666685","211.78547866666685","207.12378866666685","222.5380410000002","229.39749066666687","231.8328760000002","253.40718700000022","263.9402040000002","273.6433113333336","265.60356533333356","303.22989766666694","257.70229100000023","251.27131700000024","239.48159033333354"
"06.04.2023","v1","SE","4E","EM","CO2","SE_EM_4E_CO2","kt","2350.1714023333357","2726.9644380000027","1648.0282866666682","3715.486001333337","1879.1023240000018","2679.2874423333355","2292.2276776666686","2370.848656000002","2408.1643300000023","2100.756665333335","2667.6375440000024","2040.466967000002","1703.9809526666681","2727.745225333336","2979.103552333336","1547.3286913333347","2025.1606136666685","2490.8665540000025","2507.2779930000024","3251.6149453333364","2949.0926886666693","2530.0279473333358","2672.7865010000023","2616.1915120000026","3287.1811096666697","3776.57985466667","2758.117402333336","2339.823291666669","2686.4139426666693","2211.631400000002","2431.4035863333356","1739.4846296666683"
"06.04.2023","v1","SE","4F","EM","CO2","SE_EM_4F_CO2","kt","224.28936566666687","0.941204","34.87782100000003","1.81883533333333","1.81883533333333","1.81883533333333","1.81883533333333","1.81883533333333","1.81883533333333","1.81883533333333","2.065096","1.35719466666667","1.704318","1.704318","0.510697","0.510697","0.68354","0.75915033333333","0.75915033333333","65.70961466666672","7.62209066666667","6.17112833333334","5.78446733333334","3.44234366666667","3.18273633333334","-6.25967833333334","-6.03013766666667","-5.316289","21.83505500000002","16.16677333333335","24.71869033333336","39.20653733333337"
"06.04.2023","v1","SE","4G","EM","CO2","SE_EM_4G_CO2","kt","-5027.621360307319","-4330.889456508994","-3694.403686420331","-5342.245907507657","-5789.0569562576575","-6353.07046172333","-5809.90538447366","-7681.782511919993","-7306.429627009327","-7196.5484634303275","-8196.818281970987","-6862.970795622317","-7520.57077527432","-8205.021734942977","-8827.242007822317","-10666.984299425656","-11692.203578890987","-11921.074238476323","-9944.175660022986","-7648.464876440656","-7834.34015256566","-7381.599748104991","-7207.056481599321","-6581.833248188001","-7830.3279612469905","-7725.100368600981","-8519.284731495984","-6964.158197406658","-6534.982433044991","-7383.512129374318","-8983.099396234316","-8998.483301250651"
"06.04.2023","v1","SE","5A1","EM","CO2","SE_EM_5A1_CO2","kt","NO,NA","NO,NA","NO,NA","NO,NA","NO,NA","NO,NA","NO,NA","NO,NA","NO,NA","NO,NA","NO,NA","NO,NA","NO,NA","NO,NA","NO,NA","NO,NA","NO,NA","NO,NA","NO,NA","NO,NA","NO,NA","NO,NA","NO,NA","NO,NA","NO,NA","NO,NA","NO,NA","NO,NA","NO,NA","NO,NA","NO,NA","NO,NA"
"06.04.2023","v1","SE","5C1","EM","CO2","SE_EM_5C1_CO2","kt","43.854513","52.202679","58.326976","48.015","49.08","42.741","49.118","50.603","49.164","48.2","44.439","47.471","60.725","81.3158278888203","94.3302332056825","94.8526651612106","88.8644760445879","98.5022927733169","102.718384546747","105.474714353189","100.229055727983","105.426164329765","126.310476485282","123.757134781133","122.169488764716","118.802665126996","123.311277","132.293","127.871","119.819","112.91173666198","127.49499891671"
"06.04.2023","v1","SE","5C2","EM","CO2","SE_EM_5C2_CO2","kt","NE","NE","NE","NE","NE","NE","NE","NE","NE","NE","NE","NE","NE","NE","NE","NE","NE","NE","NE","NE","NE","NE","NE","NE","NE","NE","NE","NE","NE","NE","NE","NE"
"06.04.2023","v1","SE","1A1a","EM","CH4","SE_EM_1A1a_CH4","kt","0.41300624708613","0.4951048227448","0.50273619402899","0.61742672636267","0.70956773655692","0.78200010604354","1.0500279356357","0.88096164838797","0.95614136955936","0.95155221113335","0.91800612586275","1.10697238114589","1.18288376566225","1.27869352106257","1.32751682111975","1.44795759307756","1.47698398199779","1.51073212959029","1.66179461337521","1.78043520945026","2.01458017611607","1.7481044388652","1.78530878116115","1.79244448554485","1.62359672704023","1.64782567569498","1.78169219993044","1.79479128372964","1.79218527117186","1.77654898178331","1.58734132421111","1.9329003940221"
"06.04.2023","v1","SE","1A1b","EM","CH4","SE_EM_1A1b_CH4","kt","0.02840272902399","0.02900402924615","0.03098515886063","0.0315798106535","0.03127227546058","0.03019164445463","0.03186183066291","0.03169534386405","0.03301525513251","0.03304278273519","0.03330163605068","0.03549677070361","0.03468090798459","0.03350505108149","0.03521024972686","0.03621971655246","0.03534393809632","0.03143795079148","0.03662306587737","0.03702339567774","0.03687519074427","0.03522309880307","0.03950412463045","0.03636360575736","0.03459885352009","0.03849007997623","0.03080877452905","0.02795118652592","0.02963286826417","0.02579863183926","NO,C","0.39025353560126"
"06.04.2023","v1","SE","1A1c","EM","CH4","SE_EM_1A1c_CH4","kt","0.00442422347116","0.00431956188578","0.00383027512453","0.00396691823551","0.00464514119497","0.00503846565182","0.0048896747254","0.00475948172211","0.00462501354608","0.0046836568489","0.00463625573569","0.00494993820377","0.00511358109043","0.0041822","0.0045094","0.0048336","0.0051998","0.004205867","0.0043524","0.0033522","0.0040686","0.004489","0.0045742","0.0040802","0.0040978","0.004601","0.0044926","0.004494","0.00448","0.0045302","0.004256","0.003679"
"06.04.2023","v1","SE","1A2a","EM","CH4","SE_EM_1A2a_CH4","kt","0.01528984796986","0.01502041873456","0.01519602760416","0.01566458317455","0.016104465285","0.01723294287966","0.01692779132172","0.01731268929381","0.0175531873511","0.01736357816134","0.01919664159862","0.01848729675664","0.01924257909464","0.01962948946649","0.01937600294392","0.01878141592422","0.01941120153819","0.01921284244283","0.01821173149088","0.01175387311783","0.01623640381084","0.01498537577669","0.01319188136177","0.01394748745978","0.01340115586481","0.01535028028915","0.01464266051148","0.015398722177","0.01492004389663","0.01497050244358","0.01298331700307","0.01482291820203"
"06.04.2023","v1","SE","1A2b","EM","CH4","SE_EM_1A2b_CH4","kt","0.0020383431151","0.00204941208175","0.00216709390526","0.00205350840607","0.0020726732112","0.00141538958247","0.00134154176758","0.00142490489283","0.00153125304194","0.00175433746943","0.00133975538429","0.00126476928222","0.00130360754742","0.00104854793378","0.00108880457387","0.00103324115913","0.00111713639716","0.00111656946958","0.00128113348517","0.00120343763367","0.00128920736198","0.00121855703816","0.00123074527891","0.00136100803005","0.00139055109123","C","0.00144637587484","0.00145759345508","0.0014385570113","0.00157636214604","0.00152459275379","0.00176932782273"
"06.04.2023","v1","SE","1A2c","EM","CH4","SE_EM_1A2c_CH4","kt","0.0175363501842","0.01565936807156","0.02059932967826","0.02373622854754","0.02479145695874","0.0260165859235","0.02749350280271","0.02747429542319","0.02785949277805","0.02808924269802","0.02442525077465","0.04975918192607","0.03322922718225","0.0296289675142","0.03553113099367","0.03560132853061","0.03494907938442","0.03187124919703","0.03135545757063","0.02802549413942","0.03138648443103","0.03004327245209","0.03063637594107","0.0287828675225","0.02665863941779","0.0285069291683","0.02947625733657","0.02980684796654","0.03026728143126","0.03021241785467","0.02646970922051","0.02766525415225"
"06.04.2023","v1","SE","1A2d","EM","CH4","SE_EM_1A2d_CH4","kt","0.45407299761085","0.46130173290462","0.49242201717135","0.51474256668609","0.54572534962068","0.49802909851474","0.44877104098372","0.43127745447031","0.4242019486099","0.3754107155912","0.44257955837921","0.59816572594439","0.50266515251448","0.45342547174685","0.4637207629358","0.47715012976456","0.49806846485244","0.50382995506604","0.52874747372615","0.53129353235813","0.56277585169116","0.53698313650856","0.53841617587293","0.52801404928721","0.48706046591751","C","0.49575018493802","0.49558722583303","0.47657373212208","0.49653006341381","0.462730933671","0.47504871955295"
"06.04.2023","v1","SE","1A2e","EM","CH4","SE_EM_1A2e_CH4","kt","0.016088717205","0.01797539851493","0.01412467059883","0.01501788342713","0.01450552279822","0.0145356486644","0.01487829828962","0.0160355388126","0.01524197893684","0.01415862623114","0.01366235304792","0.01758733403437","0.01510376556308","0.01514779493275","0.0138359299137","0.01430109593934","0.01562882936591","0.01490772313191","0.01920777777702","0.02040440333957","0.02130397384348","0.01782885562877","0.01742058298946","0.01930347709873","0.02000907099549","C","0.02162951500299","0.02227329268703","0.02330915304328","0.02190010138808","0.02333301294398","0.02462282801069"
"06.04.2023","v1","SE","1A2f","EM","CH4","SE_EM_1A2f_CH4","kt","0.02240563865954","0.0199817121038","0.01542111192036","0.01576586713607","0.01573360736035","0.02017584695297","0.02015456113571","0.02012772732102","0.02452483759897","0.0255761017774","0.03098078331384","0.03404953593115","0.03113877235797","0.02813827247631","0.0282591476065","0.03132015590527","0.02940039259668","0.02833637365793","0.03966318923101","0.03840843953056","0.04243193222074","0.04386702718792","0.0447616175988","0.04889718747172","0.05179094858715","0.05768077713329","0.06435543507555","0.0593569051464","0.06532504934692","0.05961476299213","0.06221644665868","0.0609376711715"
"06.04.2023","v1","SE","1A2g","EM","CH4","SE_EM_1A2g_CH4","kt","0.37402169041185","0.38373732784908","0.44530821169402","0.43209503164563","0.50685118043764","0.52097241212084","0.53976710280737","0.51770691941989","0.51921489912164","0.51335460617066","0.3151572050033","0.34158339862239","0.32866246801357","0.31180274268923","0.29815040613671","0.2725770892566","0.34138721428167","0.30263009571445","0.26116045507981","0.24740773710859","0.26460213350447","0.25159698331939","0.24217830527707","0.263317925066","0.25185249803084","0.25295982145303","0.26123921437626","0.26765204984591","0.25782066221019","0.25935827184754","0.23689112848512","0.23323643321852"
"06.04.2023","v1","SE","1A3a","EM","CH4","SE_EM_1A3a_CH4","kt","0.02239543312883","0.01960522229211","0.01951626555692","0.01715732243718","0.01737185420348","0.02303665525304","0.0215548488041","0.02049833665855","0.0219738401741","0.02521887564204","0.02137658843257","0.01755962339895","0.01562618012461","0.01436686246951","0.01729911637744","0.0171076024081","0.0146141484089","0.01178579845417","0.01347949262033","0.01138562494817","0.01067472300599","0.0133933108229","0.01269515427816","0.01278038621103","0.01237317910362","0.01178006949498","0.01257123338797","0.01157329088242","0.0108854751571","0.00835315159515","0.00229515089136","0.00227270387476"
"06.04.2023","v1","SE","1A3b","EM","CH4","SE_EM_1A3b_CH4","kt","6.34899117513761","6.64227521718859","6.20736364135022","5.42790209417124","5.64392485247482","5.18304887138753","5.06517403955838","4.58338206223443","4.34599299861459","4.03191923326698","3.57478371295333","3.33093696654956","3.09443426559604","2.88823686670518","2.66831188112039","2.48757322082211","2.28842940946135","2.09053782104802","1.94046376198592","1.80259120025626","1.67469146684716","1.4735500611676","1.14695145206025","1.08364949153141","1.02172391173016","1.0163323616021","1.03868629965847","1.01858975628172","0.97859542837964","0.9283514605306","0.86561674627365","0.83439659914967"
"06.04.2023","v1","SE","1A3c","EM","CH4","SE_EM_1A3c_CH4","kt","0.00580515","0.00514245","0.00491985","0.00472965","0.004473","0.0043569","0.00398565","0.00386505","0.00408855","0.0043848","0.0044304","0.00422129999999","0.004065","0.00400095","0.0039555","0.00379785","0.00402435","0.00386325","0.0041127","0.0036732","0.00355275","0.003493545","0.0034644","0.00309135","0.0027585","0.0026916","0.002595","0.00243855","0.0026061","0.00266805","0.0025944","0.0026196"
"06.04.2023","v1","SE","1A3d","EM","CH4","SE_EM_1A3d_CH4","kt","0.1133503487263","0.11168972629025","0.11002902797526","0.10836820157083","0.10670932346473","0.10504987392193","0.10338968363611","0.10173195655338","0.10007137363655","0.09841021689486","0.09675163676731","0.09495407236822","0.09328397998092","0.09179865625852","0.09009188323829","0.09773329943656","0.10552401788988","0.11317103061009","0.1207966831416","0.12856954969083","0.13646420945946","0.14030633693589","0.14391145578106","0.14785295452012","0.1515343889878","0.15549108030086","0.15001619307956","0.14423379061419","0.18976844546099","0.60778426538696","1.00282374036771","1.30963590502869"
"06.04.2023","v1","SE","1A3e","EM","CH4","SE_EM_1A3e_CH4","kt","0.05336201706591","0.05800354379904","0.05421599584106","0.04156891006156","0.03907531518099","0.03938775340554","0.03427657892917","0.03345815403047","0.02850819758274","0.02496913553135","0.01981541489583","0.01543349394766","0.01527116253254","0.01390913874234","0.0126046517382","0.01155401796228","0.01065438630758","0.00881352868296","0.00700105352184","0.00720977043844","0.00606561833726","0.00580448986377","0.00514327465044","0.00466378472327","0.00475464025843","0.00479671613863","0.00492319223546","0.00507663673899","0.00524430749623","0.00534497310424","0.00530550975819","0.00571990111132"
"06.04.2023","v1","SE","1A4a","EM","CH4","SE_EM_1A4a_CH4","kt","0.25374841655823","0.24770225035112","0.21921976575253","0.21741822923749","0.21263659880616","0.20451172804248","0.20723513262984","0.20120904704008","0.19712900532193","0.19510288436331","0.19123467954865","0.18328739090336","0.18311731465444","0.17642518309542","0.18392619174253","0.15441788977506","0.33310661265787","0.23958474550757","0.20470466488322","0.17612867278515","0.15621236922883","0.21397048495499","0.15906501696554","0.12681864823574","0.13113457205377","0.12601154522266","0.12491551482407","0.09184832303961","0.08733899789086","0.07597677544416","0.07238544814623","0.07001074738562"
"06.04.2023","v1","SE","1A4b","EM","CH4","SE_EM_1A4b_CH4","kt","4.11938580842184","4.28251878037743","4.37646549096486","4.39005600593429","4.31613179095137","4.57692086291307","4.5935940854461","4.3012109293949","4.10284809952246","3.70991653587823","3.67117635208898","3.42498166306048","3.462085418769","3.51677279687009","3.50945345781158","3.40468228310369","3.28871572360352","3.0916374190388","2.99227116952636","3.09207409458089","3.02133470528121","2.98703930216196","2.79332805745099","2.79491313696267","2.63421659104536","2.4937015251368","2.53782888564491","2.47251983820107","2.12516064553102","2.15158155359405","2.05351831064216","2.02293227168783"
"06.04.2023","v1","SE","1A4c","EM","CH4","SE_EM_1A4c_CH4","kt","0.3540420341444","0.29490212500426","0.24033696333883","0.2566950546125","0.22790771355332","0.224761464977","0.23212144283397","0.21755341397406","0.20208205279979","0.18563890688905","0.20504258551163","0.21241432404969","0.22009077101923","0.21579177860039","0.21489180179087","0.28732133271336","0.30144950473641","0.35046634620589","0.36890432045743","0.31129935883873","0.32300570925999","0.29483814337028","0.2710326223224","0.23421752738883","0.23202496765162","0.22386759663677","0.22879264470059","0.24155559949385","0.23787378079822","0.24709558025033","0.2379075275619","0.235025627903"
"06.04.2023","v1","SE","1A5b","EM","CH4","SE_EM_1A5b_CH4","kt","NO,IE","NO,IE","NO,IE","NO,IE","NO,IE","NO,IE","NO,IE","NO,IE","NO,IE","NO,IE","NO,IE","NO,IE","NO,IE","NO,IE","NO,IE","NO,IE","NO,IE","NO,IE","NO,IE","NO,IE","NO,IE","NO,IE","NO,IE","NO,IE","NO,IE","NO,IE","NO,IE","NO,IE","NO,IE","NO,IE","NO,IE","NO,IE"
"06.04.2023","v1","SE","1B1b","EM","CH4","SE_EM_1B1b_CH4","kt","NE","NE","NE","NE","NE","NE","NE","NE","NE","NE","NE","NE","NE","NE","NE","NE","NE","NE","NE","NE","NE","NE","NE","NE","NE","NE","NE","NE","NE","NE","NE","NE"
"06.04.2023","v1","SE","1B1c","EM","CH4","SE_EM_1B1c_CH4","kt","0.00011545790849","0.00011252739621","9.938020137e-05","0.00010275365674","0.000120917472","0.00013151297031","0.00012780449892","0.00012385894181","0.00012029537025","0.00012188799664","0.00012002701081","0.00012847049692","0.00013286019681","0.0001078","0.0001576","0.000115","0.0001126","9.92e-05","9.64e-05","0.0003138","0.0001086","0.0001276","0.000188","7.1e-05","0.0001528","0.0005104","0.0002186","0.0001152","0.0001004","0.000162","0.00014","0.000177"
"06.04.2023","v1","SE","1B2a","EM","CH4","SE_EM_1B2a_CH4","kt","0.48498966518543","0.46667281531983","0.45545925202703","0.44707043623722","0.44240590157287","0.43340809986505","0.4518475805087","0.4598770271413","0.4496184174613","0.47945460274219","0.57652559933888","0.51184049879454","0.52996178250739","0.49074572703807","0.50608885122484","0.41582868601497","0.46385882384706","0.45226030635472","0.49099997439395","0.46461274525276","0.49465682023538","0.44691943578049","0.45960068545582","0.4034776214534","0.41040895282147","0.48673976136789","0.41549313216821","0.46479984597358","0.42080535153381","0.41033580325296","0.39776244944986","0.0433756511598"
"06.04.2023","v1","SE","1B2b","EM","CH4","SE_EM_1B2b_CH4","kt","2.69206192736281","3.18754069580229","3.18762658855993","3.23875425621671","3.30317382444795","3.2180787728063","3.46583078157751","3.38672089893475","3.55347338439508","3.4196125194019","3.21149171478139","3.52989425984168","3.29926955271906","2.73621387908281","3.20847295566382","2.95637505913078","2.77204534282898","2.84461076888912","2.32581453661955","2.19999294796679","1.93388249164479","1.89491013025499","2.11622966115287","1.81792942385573","1.61362066612436","1.43905607329272","1.47113136762575","1.34603771972694","1.24419448386126","1.21853424839484","1.38124164949327","1.43897717929272"
"06.04.2023","v1","SE","1B2c","EM","CH4","SE_EM_1B2c_CH4","kt","0.00621853528927","0.00382134065401","0.00406052663528","0.00496794464344","0.00415327055715","0.00500614108338","0.00268463198646","0.00339127588536","0.00451752958449","0.0039774534591","0.00451387888036","0.00459871097363","0.00584642677523","0.00603039810378","0.00567670302535","0.00582050516959","0.04388596413522","0.03731903927502","0.01007982731581","0.00549142033034","0.00543762746011","0.00524588894098","0.02459819263526","0.0740882764434","0.00507881124885","0.0070089632691","0.00552835686552","0.00383745474756","0.00489481003735","0.01577585546826","0.01219681128501","0.00522662085317"
"06.04.2023","v1","SE","2B5","EM","CH4","SE_EM_2B5_CH4","kt","NO,NA","NO,NA","NO,NA","NO,NA","NO,NA","NO,NA","NO,NA","NO,NA","NO,NA","NO,NA","NO,NA","NO,NA","NO,NA","NO,NA","NO,NA","NO,NA","NO,NA","NO,NA","NO,NA","NO,NA","NO,NA","NO,NA","NO,NA","NO,NA","NO,NA","NO,NA","NO,NA","NO,NA","NO,NA","NO,NA","NO,NA","NO,NA"
"06.04.2023","v1","SE","2B8","EM","CH4","SE_EM_2B8_CH4","kt","NO,IE","NO,IE","NO,IE","NO,IE","NO,IE","NO,IE","NO,IE","NO,IE","NO,IE","NO,IE","NO,IE","NO,IE","NO,IE","NO,IE","NO,IE","NO,IE","NO,IE","NO,IE","NO,IE","NO,IE","NO,IE","NO,IE","NO,IE","NO,IE","NO,IE","NO,IE","NO,IE","NO,IE","NO,IE","NO,IE","NO,IE","NO,IE"
"06.04.2023","v1","SE","2B10","EM","CH4","SE_EM_2B10_CH4","kt","0.02829900575337","0.02793966575337","0.02933909424766","0.02724492771147","0.0316620949437","0.03336917539072","0.03435280948431","0.03392712833393","0.03471025102021","0.02089913071363","0.03043001296658","0.03992832980373","0.03959660310888","0.03985404307842","0.04120077050737","0.03423254732234","0.04134993218194","0.04062576124859","0.03547916437938","0.03369699662677","0.03379885506477","0.03357398772305","0.03381360855344","0.03180172323336","0.03332801469644","0.0320371045245","0.03116773763171","0.03122089605931","0.03081420714","0.031252262089","0.0321246493758","0.03231988303971"
"06.04.2023","v1","SE","2C1","EM","CH4","SE_EM_2C1_CH4","kt","0.7515323956047","0.82143433777608","0.78351794402786","0.78276668079348","0.78893839302927","0.40677710782407","0.01168806489772","0.01156556183382","0.01130043917024","0.01140562961478","0.01147603401049","0.01205914087024","0.01236743595379","0.0112529","0.0119327","0.0121895","0.0114115","0.0104516957375","0.0103297","0.0067945","0.0100947","0.0100899","0.0082111","0.0088521","0.0091921","0.0089489","0.0105497","0.0092529","0.0086123","0.0118039","0.0090487","0.0092737"
"06.04.2023","v1","SE","2C2","EM","CH4","SE_EM_2C2_CH4","kt","0.0268346","0.0264472","0.0213681","0.0249951","0.0256997","0.0303849","0.0294073","0.0309946","0.0281515","0.0296504","0.0261963","0.029315","0.0297518","0.0237029","0.0261937","0.0136227","0.0063011","0.0059605","NA","NA","NA","NA","0.01274","0.00117","NA","NA","NA","NA","NA","NA","NA","NA"
"06.04.2023","v1","SE","2C7","EM","CH4","SE_EM_2C7_CH4","kt","NE","NE","NE","NE","NE","NE","NE","NE","NE","NE","NE","NE","NE","NE","NE","NE","NE","NE","NE","NE","NE","NE","NE","NE","NE","NE","NE","NE","NE","NE","NE","NE"
"06.04.2023","v1","SE","2D1","EM","CH4","SE_EM_2D1_CH4","kt","NA","NA","NA","NA","NA","NA","NA","NA","NA","NA","NA","NA","NA","NA","NA","NA","NA","NA","NA","NA","NA","NA","NA","NA","NA","NA","NA","NA","NA","NA","NA","NA"
"06.04.2023","v1","SE","2D2","EM","CH4","SE_EM_2D2_CH4","kt","NA","NA","NA","NA","NA","NA","NA","NA","NA","NA","NA","NA","NA","NA","NA","NA","NA","NA","NA","NA","NA","NA","NA","NA","NA","NA","NA","NA","NA","NA","NA","NA"
"06.04.2023","v1","SE","2D3","EM","CH4","SE_EM_2D3_CH4","kt","NA","NA","NA","NA","NA","NA","NA","NA","NA","NA","NA","NA","NA","NA","NA","NA","NA","NA","NA","NA","NA","NA","NA","NA","NA","NA","NA","NA","NA","NA","NA","NA"
"06.04.2023","v1","SE","2G4","EM","CH4","SE_EM_2G4_CH4","kt","NA","NA","NA","NA","NA","NA","NA","NA","NA","NA","NA","NA","NA","NA","NA","NA","NA","NA","NA","NA","NA","NA","NA","NA","NA","NA","NA","NA","NA","NA","NA","NA"
"06.04.2023","v1","SE","2H","EM","CH4","SE_EM_2H_CH4","kt","0.2433859969278","0.2590309969278","0.2580229969278","0.2654079969278","0.2631279969278","0.2651349969278","0.2611879969278","0.2793139969278","0.2742289969278","0.2781889969278","0.3100109969278","0.3062949969278","0.3037689969278","0.3227169969278","0.3170491169278","0.3163373809278","0.3189607329278","0.31876095501075","0.30911702909831","0.29834175542027","0.30532248112749","0.29805573193241","0.31131530777112","0.3102100541321","0.3150368904639","0.3160499038003","0.31549469816129","0.32363808694162","0.32717491785867","0.33914765430261","0.34929962913671","0.34743045355145"
"06.04.2023","v1","SE","3A1","EM","CH4","SE_EM_3A1_CH4","kt","115.3437500893256","112.1661847531207","117.1480802193425","120.5585078265967","122.7796253914504","120.3150014322035","121.6925625479648","121.6218369839696","120.0615586054594","118.6381231394578","117.0530238590865","115.5608372235336","113.7851983062271","111.4471403337261","113.1725194918275","111.5332571717019","110.5676671761476","107.9821394727417","108.27017676479","106.1862323883956","105.9557426053779","104.3692085269661","103.3209277234926","103.9193397417804","103.9718878672914","103.4768691615532","103.337483165113","104.2001562024665","103.900950684385","102.3176042403577","101.8574768046608","102.1184203806308"
"06.04.2023","v1","SE","3A2","EM","CH4","SE_EM_3A2_CH4","kt","3.248","3.352","3.576","3.768","3.872","3.688","3.752","3.536","3.368","3.504","3.456","3.616","3.408","3.584","3.728","3.768","4.048","4.071368","4.19824","4.323888","4.519376","4.981688","4.884272","4.614152","4.710056","4.758024","4.625392","4.848632","4.697176","4.39112","4.009224","4.187592"
"06.04.2023","v1","SE","3A3","EM","CH4","SE_EM_3A3_CH4","kt","3.538203059358","3.442108767126","3.562679021553","3.557769114756","3.644621709495","3.613667981448","3.666143762475","3.671937387414","3.567460836423","3.295562082441","2.986114519146","2.947907887476","2.931704512734","2.961619196277","2.828952065958","2.819432795868","2.539974","2.5187085","2.524314","2.461212","2.4300975","2.357439","2.14633049999999","2.1330015","2.1340905","2.127615","2.1000645","2.13426","2.1709365","2.109618","2.146245","2.159937"
"06.04.2023","v1","SE","3A4","EM","CH4","SE_EM_3A4_CH4","kt","8.873345","8.7187325","8.539045","8.5402825","8.459895","8.4756825","8.4493825","8.583145","8.693295","8.840295","8.9762575","8.9550325","8.8224075","8.92791142857142","8.84784035714285","8.98080678571428","9.14901071428571","9.36368964285714","9.39303107142857","9.61396","9.71070142857142","9.68544285714285","9.76527178571428","9.69728821428571","9.60801714285714","9.60173357142857","9.571725","9.6535875","9.586125","9.4921625","9.477425","9.481925"
"06.04.2023","v1","SE","3B","EM","CH4","SE_EM_3B_CH4","kt","9.82619214724888","9.5213143715634","9.78019650161663","10.18920527147021","10.25672678507021","10.26753507936281","10.39310789147573","10.35307498562223","10.12190090777525","9.89861673579292","9.54443786510055","10.0340410926267","9.9579268700527","10.23361351962449","10.23456620655374","10.60788589942433","10.40348764995138","10.28207721760589","10.18590654965712","10.05579825152402","10.06674011089649","10.13218700956162","9.99578973024605","10.52445747486806","10.31003659733305","10.27108611737399","10.49041520126974","10.53521149748308","10.50939521955185","10.64163329534914","10.61629351483187","10.60015271321939"
"06.04.2023","v1","SE","4A","EM","CH4","SE_EM_4A_CH4","kt","9.230705","9.226718","9.227565","9.230014","9.226663","9.307121","9.314427","9.644644","9.268693","9.394941","9.449756","9.457538","9.549651","9.597537","9.483449","9.320831","9.626208","9.003308","9.394613","8.733719","8.728705","8.459878","8.175065","8.305101","9.484765","8.464518","8.544872","8.667402","11.034495","9.201332","8.951241","8.849973"
"06.04.2023","v1","SE","4B","EM","CH4","SE_EM_4B_CH4","kt","9.544261","9.489794","9.378775","9.242495","9.139303","9.029756","8.925237","8.828587","8.716742","8.614454","8.508487","8.466874","8.355606","8.251852","8.15046","8.133872","8.022051","7.92085","7.81352","7.685111","7.581865","7.382274","7.202862","7.08329","6.980132","6.904097","6.889633","6.780045","6.852767","6.918115","6.847991","7.047371"
"06.04.2023","v1","SE","4C","EM","CH4","SE_EM_4C_CH4","kt","0.367063","0.434356","0.434356","0.435509","0.435509","0.435509","0.435509","0.441974","0.481695","0.481907","0.484214","0.485549","0.494526","0.438131","0.423974","0.447441","0.410497","0.407392","0.409699","0.461153","0.462636","0.445629","0.378374","0.330674","0.344825","0.322382","0.329949","0.335539","0.500892","0.577751","0.542704","0.777237"
"06.04.2023","v1","SE","4D","EM","CH4","SE_EM_4D_CH4","kt","0.21318","0.19703","0.21318","0.20672","0.2261","0.24871","0.21964","0.26163","0.21641","0.31331","0.33592","0.33915","0.32946","0.30362","0.2584","0.33269","0.20026","0.33269","0.295836","0.275035","0.245383","0.270222","0.280784","0.263439","0.309596","0.327102","0.335145","0.29028","0.384564","0.247321","0.20349","0.144026"
"06.04.2023","v1","SE","4E","EM","CH4","SE_EM_4E_CH4","kt","IE","IE","IE","IE","IE","IE","IE","IE","IE","IE","IE","IE","IE","IE","IE","IE","IE","IE","IE","IE","IE","IE","IE","IE","IE","IE","IE","IE","IE","IE","IE","IE"
"06.04.2023","v1","SE","5A1","EM","CH4","SE_EM_5A1_CH4","kt","136.867802226995","138.952956405599","138.994291885664","134.314894888729","128.760120115474","128.424144591064","127.32180265856","126.075657202517","124.020631442671","118.710730302055","114.97409527249","112.88607597498","105.429248699385","99.4175108240116","98.4269825795978","91.5532514213272","87.9381652093166","80.0760491219973","68.9750566983482","64.8090145750967","60.3587598694218","55.3956147385056","50.2839914981887","46.4725335481809","41.6437931541001","37.618245300887","34.0311729400739","31.6978560381676","29.4689087612899","25.3100831156528","22.900431923128","19.38869317316"
"06.04.2023","v1","SE","5B1","EM","CH4","SE_EM_5B1_CH4","kt","0.2838","0.42384","0.56388","0.70392","0.84396","0.984","0.96","0.94","1.03","1.12","1.16","1.18305","1.2061","1.172752","1.095808","1.83932","1.80956","2.06116","2.2748","2.522","2.26484","2.7604","2.235324","2.11388","1.87168","1.67336","1.904552","1.801448","1.40702","1.41932","1.4130484","1.358904"
"06.04.2023","v1","SE","5B2","EM","CH4","SE_EM_5B2_CH4","kt","0.01078827797236","0.01456417526268","0.01834007255301","0.02211596984333","0.02589186713366","0.03572","0.05579611428571","0.07587222857142","0.09594834285714","0.11602445714285","0.13610057142857","0.15617668571428","0.1762528","0.1787704","0.1954992","0.25807","0.312103","0.320481","0.567812","0.643116","0.860106","0.88808","0.904722","0.75644","0.859593","1.131256","1.291936","1.249768","1.30512","1.368","1.410408","1.386816"
"06.04.2023","v1","SE","5C1","EM","CH4","SE_EM_5C1_CH4","kt","0.00023203623635","0.00027070894241","0.00027070894241","0.00024286459405","0.0002601590282","0.0002530277812","0.00019072605174","0.00022069739894","0.00022307963763","0.00022429032537","0.0002163737904","0.00024072212614","0.00025329075561","0.00094539297234","0.00100248162102","0.00097135009264","0.00094140194907","0.00108076291263","0.001127","0.000863","0.0009","0.00099","0.00123","0.0011809","0.00080713","0.00055525","0.0007058","0.001","0.001432","0.001281","0.001429","0.000752"
"06.04.2023","v1","SE","5C2","EM","CH4","SE_EM_5C2_CH4","kt","NE","NE","NE","NE","NE","NE","NE","NE","NE","NE","NE","NE","NE","NE","NE","NE","NE","NE","NE","NE","NE","NE","NE","NE","NE","NE","NE","NE","NE","NE","NE","NE"
"06.04.2023","v1","SE","5D1","EM","CH4","SE_EM_5D1_CH4","kt","1.25514480255779","1.24356363755058","1.23140455878562","1.21901208108951","1.20862389993602","1.19046877581121","1.16990819444489","1.14843868625451","1.12712147927862","1.10539498096227","1.08514481947063","1.06505093852952","1.04511231051405","1.02502950918815","1.00449336357966","0.98346929184958","0.96510052832784","0.94643214846003","0.9273747138844","0.90861220522527","0.8880303025377","0.89464930360155","0.90183424229073","0.91058655177504","0.92066885894655","0.93086636044436","0.94504539495933","0.95735072637162","0.96816610623285","0.97774799193729","0.98283444610995","0.99001869619085"
"06.04.2023","v1","SE","5D2","EM","CH4","SE_EM_5D2_CH4","kt","0.23790789473684","0.26056578947368","0.28322368421052","0.30588157894736","0.32853947368421","0.35119736842105","0.35572894736842","0.36026052631578","0.36479210526315","0.36932368421052","0.37385526315789","0.34577087525837","0.31859593373493","0.29231192804495","0.2669006942135","0.24106216006216","0.21255263157894","0.26392528392417","0.24588383838383","0.17762694327032","0.16692857142857","0.18889285714285","0.17717857142857","0.17132142857142","0.18010714285714","0.17717857142857","0.18742857142857","0.18303571428571","0.20939285714285","0.20792857142857","0.19767857142857","0.21946084921364"
"06.04.2023","v1","SE","1A1a","EM","N2O","SE_EM_1A1a_N2O","kt","0.36970120684098","0.45110864781497","0.47397831722835","0.48167827445656","0.46800053197225","0.47400774056636","0.60037821374936","0.4757746485213","0.51306485814703","0.48487830924282","0.47385878995567","0.55053662109926","0.58825694358051","0.62563129940632","0.71269809255848","0.7338069173207","0.74339872429106","0.77259944938224","0.80401403827159","0.84175128989905","0.92534626002915","0.81982406158906","0.79518919400254","0.84946202437877","0.76328972748886","0.80288752846603","0.76935903614481","0.81770839493908","0.82459098081682","0.76050643376546","0.59074239952486","0.67769569352716"
"06.04.2023","v1","SE","1A1b","EM","N2O","SE_EM_1A1b_N2O","kt","0.00455668014028","0.00469946806703","0.00453163971692","0.00467959852897","0.0047414120584","0.00487192339297","0.00500628135629","0.00505004381452","0.00523053059761","0.00496150360998","0.00488775011031","0.00528488135339","0.00485338626553","0.00478230408881","0.00517289702123","0.00502800001161","0.00479711273148","0.00419754102884","0.00463625385879","0.00454250151295","0.00463622799144","0.00434806494851","0.00459213496543","0.004426880684","0.00404475440417","0.00447237218356","0.00367463166807","0.00340744373525","0.00349730536787","0.0031473628242","NO,C","0.00820086099436"
"06.04.2023","v1","SE","1A1c","EM","N2O","SE_EM_1A1c_N2O","kt","0.00044242234711","0.00043195618857","0.00038302751245","0.00039669182355","0.00046451411949","0.00050384656518","0.00048896747254","0.00047594817221","0.0004625013546","0.00046836568489","0.00046362557356","0.00049499382037","0.00051135810904","0.00041822","0.00045094","0.00048336","0.00051998","0.0004205867","0.00043524","0.00033522","0.00040686","0.0004489","0.00045742","0.00040802","0.00040978","0.0004601","0.00044926","0.0004494","0.000448","0.00045302","0.0004256","0.0003679"
"06.04.2023","v1","SE","1A2a","EM","N2O","SE_EM_1A2a_N2O","kt","0.00483623562578","0.00457650986016","0.00439333915281","0.0046141057565","0.00440760777163","0.00491540541436","0.00489026159663","0.00458241804674","0.00456127106598","0.00444775561281","0.00500769282677","0.0048538503652","0.00491130665679","0.00515512979763","0.0048890030636","0.00459101169693","0.00464045167032","0.00466478431343","0.00452214935646","0.00327861643944","0.00436847129109","0.00382194241869","0.0036206625315","0.00360059632718","0.00300796226069","0.00245387127089","0.00248038317116","0.00249291201926","0.00258159586905","0.00248720040089","0.00197883995833","0.00225332181657"
"06.04.2023","v1","SE","1A2b","EM","N2O","SE_EM_1A2b_N2O","kt","0.0006723808463","0.00064196363517","0.00060854314881","0.0005804389032","0.00050051580151","0.00043399855963","0.00041630401394","0.00038636034288","0.00042196967719","0.00051212667537","0.00054210758696","0.00043591320687","0.00037776962091","0.00031901309511","0.00028072527049","0.00029581332364","0.00029337131621","0.00027623058855","0.00028957601857","0.00030666569896","0.00035252238854","0.00028983933666","0.00029660774304","0.00028904592894","0.00030222128918","C","0.00039695696549","0.00038833458498","0.00038025297838","0.00045983070727","0.00045523881366","0.00054823703399"
"06.04.2023","v1","SE","1A2c","EM","N2O","SE_EM_1A2c_N2O","kt","0.00734330029489","0.0062484322358","0.00827515340321","0.01036223931405","0.00938165884604","0.01073327419355","0.01089879953563","0.01010447724266","0.01000058669451","0.01049925455756","0.00566775917538","0.01420886611434","0.01013208587435","0.00964261052256","0.00971057846943","0.00925126953012","0.00890736955361","0.00774229198107","0.00750683085402","0.00711703283526","0.00767346475783","0.00736900396417","0.00733429112588","0.00695082986004","0.00669440883812","0.00715424615498","0.00795370828956","0.00747116348045","0.00804357985728","0.00755901167218","0.00690845858038","0.00663659903666"
"06.04.2023","v1","SE","1A2d","EM","N2O","SE_EM_1A2d_N2O","kt","0.21210257993423","0.20908255329446","0.2294036035843","0.23558895851054","0.25134199770848","0.22867773146217","0.20492691020923","0.20317521755882","0.19879438114652","0.17520625303356","0.20529602113935","0.27844231908455","0.23524827261783","0.21019788914063","0.21405312095773","0.21911873303939","0.2309896956218","0.23010343122521","0.24140607950309","0.24300052960462","0.25660898991315","0.24475442909631","0.24448746378747","0.24059197449756","0.22071071819667","C","0.22476682535739","0.22453146582843","0.21624727775898","0.22353244382183","0.20775770140896","0.20969253494273"
"06.04.2023","v1","SE","1A2e","EM","N2O","SE_EM_1A2e_N2O","kt","0.00733403780929","0.00721339168868","0.00589562481656","0.00668992853049","0.0061764319761","0.00658153093703","0.00648463015115","0.00696851735454","0.00632347464348","0.00628585589595","0.00525465432905","0.0060578393472","0.00437685602438","0.00500396432081","0.00436564106779","0.00386553837475","0.0052830776014","0.00488635846438","0.00651688555205","0.00691390931353","0.0072961802705","0.00590798179498","0.00582248917773","0.00635536492428","0.00668759695176","C","0.0069749148416","0.00701784712545","0.00708289452497","0.00709009086051","0.0069757686583","0.00760698702672"
"06.04.2023","v1","SE","1A2f","EM","N2O","SE_EM_1A2f_N2O","kt","0.02302583166722","0.01822650363794","0.01352124242691","0.01549389016997","0.0150631071557","0.01919638097539","0.01886751991811","0.01815198320727","0.01942984645532","0.01809790075141","0.02163806400856","0.02134757143747","0.01982360110232","0.01692175139891","0.01859813356953","0.01906811540331","0.02011958038076","0.01857293144761","0.01926686301528","0.0166369758853","0.01800841859855","0.01887199734378","0.01857978406316","0.01718054123666","0.01778417902476","0.0190727917858","0.01855647821844","0.01875479339176","0.01857066157083","0.01624786976525","0.01520397954943","0.01490921013568"
"06.04.2023","v1","SE","1A2g","EM","N2O","SE_EM_1A2g_N2O","kt","0.17850542507205","0.18548445124276","0.21240360934349","0.20784325593412","0.24212923311335","0.24987184122927","0.25747204224822","0.24841229587467","0.24851884209624","0.24661267508289","0.15761388599697","0.17082231974487","0.16458646743097","0.15973797348835","0.15437573714265","0.14089617647077","0.17382765075911","0.15618295534778","0.13971396892695","0.13300580281065","0.14291821247933","0.13908986421712","0.1373146214685","0.14936977188804","0.14722925019811","0.1490061145874","0.15449619565662","0.1639998140733","0.16286957793114","0.16696308799563","0.15905990022904","0.16136271319698"
"06.04.2023","v1","SE","1A3a","EM","N2O","SE_EM_1A3a_N2O","kt","0.04599208520636","0.04075937960895","0.04120607848272","0.03833409045429","0.03793137521491","0.03716622162538","0.03759114569388","0.03905626458518","0.03939223602697","0.04105855474131","0.03857130782235","0.03729386647272","0.03551742538791","0.03379601532228","0.03617890120227","0.03768059677584","0.04058443039529","0.03065728095559","0.03004227575303","0.02687078004272","0.02627912656559","0.02825517464285","0.02766143495972","0.02775205491419","0.02763598746154","0.02638252037015","0.02765624961442","0.02797067524532","0.02637939772586","0.02380466241989","0.01024831289519","0.01045795729482"
"06.04.2023","v1","SE","1A3b","EM","N2O","SE_EM_1A3b_N2O","kt","0.51975155997112","0.51713324923634","0.56681856647842","0.61304184501295","0.61286414104671","0.66862826789761","0.65504177545822","0.6841801224079","0.61752557300258","0.63881733934036","0.42878129873939","0.38595582121594","0.35905392873422","0.33902864452475","0.32086290301554","0.31605405094073","0.30216281862903","0.30340587467142","0.31352417624685","0.31807953373761","0.34057309812822","0.3540555623102","0.39115382254313","0.41432716100407","0.44016488840439","0.48217645325823","0.52829315953547","0.55603703830456","0.59326486798499","0.59839909626933","0.58572143758496","0.60214154783308"
"06.04.2023","v1","SE","1A3c","EM","N2O","SE_EM_1A3c_N2O","kt","0.00077402","0.00068566","0.00065598","0.00063062","0.0005964","0.00058092","0.00053142","0.00051534","0.00054514","0.00058464","0.00059072","0.00056284","0.000542","0.00053346","0.0005274","0.00050638","0.00053658","0.0005151","0.00054836","0.00048976","0.0004737","0.000465806","0.00046192","0.00041218","0.0003678","0.00035888","0.000346","0.00032514","0.00034748","0.00035574","0.00034592","0.00034928"
"06.04.2023","v1","SE","1A3d","EM","N2O","SE_EM_1A3d_N2O","kt","0.02225622262329","0.0227038814142","0.02314998170947","0.02359443396747","0.02406896216812","0.02453503564262","0.02498874090248","0.025477878626","0.02592750022792","0.02637005959059","0.02685039293672","0.02628528355389","0.02668730735006","0.02850197222347","0.02867287095063","0.02855129475222","0.02961709920825","0.02942611932838","0.02924416180625","0.02985688422902","0.03214267952912","0.02990628509907","0.02795299386424","0.02873469988679","0.02799949565011","0.02789931647673","0.02939786389744","0.02867137990881","0.0318182960513","0.02928878059101","0.02612452167034","0.02414408609944"
"06.04.2023","v1","SE","1A3e","EM","N2O","SE_EM_1A3e_N2O","kt","0.05886022349168","0.07062466006597","0.07287905605696","0.05324593162437","0.04529519833765","0.04148228843186","0.03988356063087","0.03722378560379","0.03145971883265","0.02847391661939","0.02696013054662","0.02139951367883","0.02373711696342","0.02309635395601","0.02189912202265","0.01871069808099","0.0199494453229","0.01945754547573","0.01447997888108","0.01862516157549","0.01517134001006","0.01557167170154","0.01478578689123","0.01402996532014","0.01481728332146","0.01617015557129","0.01597816338083","0.01704733802529","0.01725240511951","0.01840704104903","0.01881262013863","0.02026768168386"
"06.04.2023","v1","SE","1A4a","EM","N2O","SE_EM_1A4a_N2O","kt","0.03076531793308","0.03025510644719","0.02550827483145","0.02539188192233","0.02454484541883","0.02288770461052","0.02426940727747","0.02351514425091","0.02318163264677","0.02339328183082","0.02301115614779","0.02172977000782","0.02167737669674","0.02151441265081","0.02483849164587","0.01850548562082","0.02251124991461","0.02243852347588","0.01951875301085","0.02179208070253","0.01972508435962","0.0225774988939","0.02362881886053","0.02215516783178","0.0189286655219","0.0190428187359","0.02306830558787","0.02346795354393","0.02391815005598","0.01976297661348","0.01981135113359","0.0202411680802"
"06.04.2023","v1","SE","1A4b","EM","N2O","SE_EM_1A4b_N2O","kt","0.2110636192014","0.22004059184305","0.22311914837697","0.22716784667773","0.21961236144125","0.22674515095698","0.22519432002261","0.21000803343453","0.19304738959158","0.19183475848022","0.19217378881177","0.18170707335264","0.18531498518825","0.20135827666592","0.19200539456483","0.19313758257146","0.17663606295303","0.18686733542639","0.18901799262513","0.20390031870114","0.19885313748706","0.19912275492742","0.19275322649031","0.18670656080699","0.17579004504703","0.17534836258582","0.17620103554458","0.17614505350939","0.15299247889389","0.15265977277652","0.15446915512878","0.15692134096181"
"06.04.2023","v1","SE","1A4c","EM","N2O","SE_EM_1A4c_N2O","kt","0.0715812348871","0.06129101825559","0.05646798207058","0.05882368048364","0.0565847166195","0.05524600921083","0.06034618658864","0.05802945084712","0.05599597680107","0.05285525180456","0.05456571403999","0.05527999447122","0.05645092325306","0.05669626861872","0.05687761270924","0.06171778802787","0.0606796359799","0.06266622799827","0.06465864024671","0.05862564505191","0.06396614125351","0.06597493240736","0.06664772343088","0.06495605898767","0.06477655214316","0.06352814213763","0.06472776497042","0.06661358562663","0.06564995669606","0.06922509348039","0.06923527536892","0.06968596854207"
"06.04.2023","v1","SE","1A5b","EM","N2O","SE_EM_1A5b_N2O","kt","NO,IE","NO,IE","NO,IE","NO,IE","NO,IE","NO,IE","NO,IE","NO,IE","NO,IE","NO,IE","NO,IE","NO,IE","NO,IE","NO,IE","NO,IE","NO,IE","NO,IE","NO,IE","NO,IE","NO,IE","NO,IE","NO,IE","NO,IE","NO,IE","NO,IE","NO,IE","NO,IE","NO,IE","NO,IE","NO,IE","NO,IE","NO,IE"
"06.04.2023","v1","SE","1B1b","EM","N2O","SE_EM_1B1b_N2O","kt","NA","NA","NA","NA","NA","NA","NA","NA","NA","NA","NA","NA","NA","NA","NA","NA","NA","NA","NA","NA","NA","NA","NA","NA","NA","NA","NA","NA","NA","NA","NA","NA"
"06.04.2023","v1","SE","1B1c","EM","N2O","SE_EM_1B1c_N2O","kt","1.154579084e-05","1.125273962e-05","9.93802014e-06","1.027536567e-05","1.20917472e-05","1.315129703e-05","1.278044989e-05","1.238589418e-05","1.202953702e-05","1.218879966e-05","1.200270108e-05","1.284704969e-05","1.328601968e-05","1.078e-05","1.576e-05","1.15e-05","1.126e-05","9.92e-06","9.64e-06","3.138e-05","1.086e-05","1.276e-05","1.88e-05","7.1e-06","1.528e-05","5.104e-05","2.186e-05","1.152e-05","1.004e-05","1.62e-05","1.4e-05","1.77e-05"
"06.04.2023","v1","SE","1B2a","EM","N2O","SE_EM_1B2a_N2O","kt","0.00380929270019","0.00336612090179","0.00377671696259","0.00412690366019","0.00348018110339","0.00396862991939","0.00425955420419","0.00421205440559","0.00421138888559","0.00436447247279","0.00423282178799","0.00417953551919","0.00381172494959","0.00425781962159","0.00430496596079","0.00399481022841","0.00424976189962","0.00407733934835","0.0047018919587","0.00464353666571","0.00458409053118","0.00400917415727","0.00426653730362","0.00348502860348","0.0042637792763","0.00467830586653","0.0044728530861","0.00407780887546","0.0045707337019","0.00291378536345","0.00111321166003","IE,NA"
"06.04.2023","v1","SE","1B2c","EM","N2O","SE_EM_1B2c_N2O","kt","0.00043855912377","0.00028277364039","0.00030271912535","0.00037838819255","0.00031045408366","0.00038051821168","0.0001869293143","0.00024585552168","0.00028921357435","0.00029473655959","0.0003394685656","0.00034443144708","0.00044847811369","0.00046381950351","0.00043270163122","0.00044419139234","0.00119609585973","0.00041420483219","0.00017942899343","0.00024292466638","0.00022343789785","0.00020389130182","0.00022896699915","0.0004580862821","0.00028575101038","0.00024644773173","0.00028592072064","0.00019805738922","0.00018825244056","0.00036692453757","0.00026300787341","6.43352e-09"
"06.04.2023","v1","SE","2B2","EM","N2O","SE_EM_2B2_N2O","kt","2.625","2.765","2.66","2.583","2.496","2.285","2.193","2.166","2.44","2.14","2.061","1.545","1.422","1.3903","1.3776","1.4184","1.4742","0.788","0.866","0.983","1.007","0.132264","0.217783","0.160688","0.174264","0.12072","0.173122","0.139589","0.102766","0.093172","0.018418","0.037345"
"06.04.2023","v1","SE","2B10","EM","N2O","SE_EM_2B10_N2O","kt","0.06954307621827","0.06806065047569","0.06819991795161","0.06926203464178","0.0701469080639","0.07034762367757","0.07098677936735","0.07174798108939","0.07089823419072","0.08751624447004","0.05898808510083","0.05595617289577","0.05347358900443","0.04763831853692","0.05569904445429","0.02933194818074","0.02938855050191","0.02570930020485","0.02411621756193","0.02363334194067","0.02194378143047","0.0247363357763","0.02089574177174","0.02225204438093","0.03504149924224","0.01688620067645","0.02212566240317","0.02143636820593","0.00378865581159","0.00346956336182","0.00250437754658","0.00287647518841"
"06.04.2023","v1","SE","2C7","EM","N2O","SE_EM_2C7_N2O","kt","NA","NA","NA","NA","NA","NA","NA","NA","NA","NA","NA","NA","NA","NA","NA","NA","NA","NA","NA","NA","NA","NA","NA","NA","NA","NA","NA","NA","NA","NA","NA","NA"
"06.04.2023","v1","SE","2D1","EM","N2O","SE_EM_2D1_N2O","kt","NA","NA","NA","NA","NA","NA","NA","NA","NA","NA","NA","NA","NA","NA","NA","NA","NA","NA","NA","NA","NA","NA","NA","NA","NA","NA","NA","NA","NA","NA","NA","NA"
"06.04.2023","v1","SE","2D2","EM","N2O","SE_EM_2D2_N2O","kt","NA","NA","NA","NA","NA","NA","NA","NA","NA","NA","NA","NA","NA","NA","NA","NA","NA","NA","NA","NA","NA","NA","NA","NA","NA","NA","NA","NA","NA","NA","NA","NA"
"06.04.2023","v1","SE","2D3","EM","N2O","SE_EM_2D3_N2O","kt","NA","NA","NA","NA","NA","NA","NA","NA","NA","NA","NA","NA","NA","NA","NA","NA","NA","NA","NA","NA","NA","NA","NA","NA","NA","NA","NA","NA","NA","NA","NA","NA"
"06.04.2023","v1","SE","2G3","EM","N2O","SE_EM_2G3_N2O","kt","0.29104","0.28727518518518","0.347","0.346","0.309","0.399","0.443","0.457","0.465","0.434","0.394","0.382","0.41012","0.43994","0.47154","0.44019","0.4235","0.37075","0.39689","0.35","0.40405","0.31707","0.30975","0.25822","0.28682","0.29654","0.25592","0.39236","0.29728","0.2815","0.27","0.2585"
"06.04.2023","v1","SE","2G4","EM","N2O","SE_EM_2G4_N2O","kt","NA","NA","NA","NA","NA","NA","NA","NA","NA","NA","NA","NA","NA","NA","NA","NA","NA","NA","NA","NA","NA","NA","NA","NA","NA","NA","NA","NA","NA","NA","NA","NA"
"06.04.2023","v1","SE","2H","EM","N2O","SE_EM_2H_N2O","kt","0.21366419969278","0.22838419969278","0.22745619969278","0.23385619969278","0.23177619969278","0.23324819969278","0.22969619969278","0.24579219969278","0.24115219969278","0.24451219969278","0.27222419969277","0.26876819969278","0.26563219969278","0.28192019969278","0.27671731969278","0.27598058369278","0.27842893569278","0.27827911630107","0.26965948160983","0.26049544628202","0.26666820071275","0.26026443239324","0.27177118387711","0.27058120141321","0.27492509184639","0.27565980698003","0.27523251251612","0.28222745779416","0.28518540518586","0.29550957133026","0.30427423411367","0.30262760115514"
"06.04.2023","v1","SE","3B","EM","N2O","SE_EM_3B_N2O","kt","1.24113064467877","1.2077702910045","1.23997653603523","1.24360350891108","1.26451123469971","1.2447663621165","1.25866361962598","1.26440643724702","1.24166861737714","1.20504772963258","1.1807094460578","1.17753288716204","1.18461111189697","1.17973764977162","1.18440242358416","1.17610183862498","1.15615242324965","1.15957061631602","1.16066999630197","1.14134363562199","1.14713448083956","1.1353401261955","1.11235370085205","1.14719931349474","1.14128867633436","1.14340760814505","1.12055672906273","1.12227731823276","1.11604927776903","1.10710365492524","1.10416723087809","1.09017342446566"
"06.04.2023","v1","SE","3D","EM","N2O","SE_EM_3D_N2O","kt","12.06202329181837","11.40637154419544","10.75886320399434","11.45884498298515","11.59681429458878","11.13551032577554","11.13534876424624","11.36321992753566","11.3351159875639","10.66508015238189","10.83378037229925","10.79320808000944","10.68033966257625","10.44451222100106","10.38712437842013","9.98470546710183","9.70955094228079","9.86589961029653","10.18960228200958","9.49570035329008","9.78687640957921","9.81143746822979","9.56011521713628","9.66574698636922","10.06545467686462","10.16385065691897","10.08055203670792","10.39085467595727","9.74983920226299","10.08271811416873","10.54560192955391","10.04740076508521"
"06.04.2023","v1","SE","4A","EM","N2O","SE_EM_4A_N2O","kt","3.997956","3.955532","3.927933","3.925137","3.919098","3.95621","3.953846","3.945842","3.966664","3.985155","4.004956","3.999364","3.991079","3.971004","3.952637","3.917299","3.886468","3.838605","3.782912","3.712936","3.777155","3.560246","3.371499","3.343559","3.404259","3.483273","3.515184","3.598543","3.809919","3.919645","3.854218","3.902965"
"06.04.2023","v1","SE","4B","EM","N2O","SE_EM_4B_N2O","kt","0.004556","0.00593","0.006422","0.007352","0.007765","0.009856","0.009856","0.010335","0.010335","0.010335","0.011454","0.011946","0.011946","0.011946","0.012375","0.012754","0.012606","0.013599","0.013394","0.014267","0.012833","0.013682","0.012857","0.012365","0.013406","0.013329","0.011745","0.011822","0.013336","0.012803","0.012797","0.011777"
"06.04.2023","v1","SE","4C","EM","N2O","SE_EM_4C_N2O","kt","7.3e-05","7.3e-05","7.3e-05","7.3e-05","7.3e-05","7.3e-05","7.3e-05","0.000118","1.8e-05","1.9e-05","3.5e-05","4.4e-05","0.000106","0.000132","3.5e-05","3.4e-05","4.2e-05","2e-05","3.6e-05","2e-05","2e-05","2.3e-05","2.3e-05","5.7e-05","0.000162","8e-06","2.6e-05","6.4e-05","0.000149","2e-05","1.8e-05","1.3e-05"
"06.04.2023","v1","SE","4D","EM","N2O","SE_EM_4D_N2O","kt","0.003111","0.002876","0.003111","0.003017","0.0033","0.00363","0.003206","0.003819","0.003159","0.004573","0.004903","0.00495","0.004809","0.004431","0.003771","0.004856","0.002923","0.004856","0.004318","0.004014","0.003581","0.003944","0.004098","0.003845","0.004519","0.004774","0.004892","0.004237","0.005613","0.00361","0.00297","0.002102"
"06.04.2023","v1","SE","4E","EM","N2O","SE_EM_4E_N2O","kt","0.083566","0.099766","0.111779","0.128057","0.138066","0.150633","0.158585","0.164291","0.172186","0.185143","0.201959","0.210955","0.222113","0.230244","0.241982","0.248349","0.252943","0.251754","0.25433","0.252993","0.243667","0.24248","0.242525","0.248015","0.246908","0.246307","0.240088","0.239693","0.246498","0.247037","0.24559","0.247286"
"06.04.2023","v1","SE","4F","EM","N2O","SE_EM_4F_N2O","kt","0.000129","0.000129","0.00025","0.00025","0.00025","0.00025","0.00025","0.00025","0.00025","0.00025","0.000283","0.000283","0.000331","0.000331","0.000331","0.000331","0.000355","0.000472","0.000472","0.000714","0.001063","0.000983","0.000983","0.000892","0.00093","0.00093","0.000961","0.001068","0.001209","0.001192","0.001272","0.001409"
"06.04.2023","v1","SE","5B1","EM","N2O","SE_EM_5B1_N2O","kt","0.017028","0.0254304","0.0338328","0.0422352","0.0506376","0.05904","0.0576","0.0564","0.0618","0.0672","0.0696","0.070983","0.072366","0.07036512","0.06574848","0.1103592","0.1085736","0.1236696","0.136488","0.15132","0.1358904","0.165624","0.13411944","0.1268328","0.1123008","0.1004016","0.11427312","0.10808688","0.0844212","0.0851592","0.084782904","0.08153424"
"06.04.2023","v1","SE","5B2","EM","N2O","SE_EM_5B2_N2O","kt","NO,NA","NO,NA","NO,NA","NO,NA","NO,NA","NO,NA","NO,NA","NO,NA","NO,NA","NO,NA","NO,NA","NO,NA","NO,NA","NO,NA","NO,NA","NO,NA","NO,NA","NO,NA","NO,NA","NO,NA","NO,NA","NO,NA","NO,NA","NO,NA","NO,NA","NO,NA","NO,NA","NO,NA","NO,NA","NO,NA","NO,NA","NO,NA"
"06.04.2023","v1","SE","5C1","EM","N2O","SE_EM_5C1_N2O","kt","0.00331010543829","0.003861789678","0.003861789678","0.00346457702541","0.00371129021741","0.0036095596436","0.00272079633342","0.0031483516192","0.00318233536837","0.00319960639518","0.0030866733212","0.00343401371853","0.00361331109643","0.011841574215","0.01321650675","0.016490070345","0.013530588615","0.013725479835","0.01784537055","0.0166111506","0.01510590939","0.01844407599","0.017916275385","0.01693004679","0.01802448636","0.017439750765","0.0170065116","0.01737819174","0.01775756322","0.017517148065","0.01229946924","0.01738570870225"
"06.04.2023","v1","SE","5C2","EM","N2O","SE_EM_5C2_N2O","kt","NE","NE","NE","NE","NE","NE","NE","NE","NE","NE","NE","NE","NE","NE","NE","NE","NE","NE","NE","NE","NE","NE","NE","NE","NE","NE","NE","NE","NE","NE","NE","NE"
"06.04.2023","v1","SE","5D1","EM","N2O","SE_EM_5D1_N2O","kt","0.69707548874327","0.69935084710167","0.70162620546007","0.70435974927692","0.70709329309376","0.70982683691061","0.69737260949045","0.6849183820703","0.67246415465014","0.67221961309895","0.67197507154776","0.66755688651865","0.66313870148954","0.6657225831134","0.66830646473725","0.67305161677653","0.6777967688158","0.67353173319012","0.66926669756444","0.67111200235634","0.67295730714825","0.67020488396351","0.66745246077877","0.66333616768003","0.65921987458129","0.64918899272215","0.639158110863","0.63817768851925","0.6371972661755","0.65357177861921","0.66994629106291","0.66994629106291"
"06.04.2023","v1","SE","5D2","EM","N2O","SE_EM_5D2_N2O","kt","0.06007571428571","0.05272928571428","0.04538285714285","0.04369357142857","0.04200428571428","0.04706428571428","0.04596559523809","0.0448669047619","0.04439285714285","0.04145821428571","0.04216928571428","0.03997714285714","0.04078957142857","0.04036607142857","0.03904214285714","0.04046821428571","0.04028357142857","0.03721535714285","0.03713285714285","0.0345125","0.03362071428571","0.03232821428571","0.03221428571428","0.03079764285714","0.03237142857142","0.0330275","0.03018714285714","0.02993571428571","0.02756285714285","0.02437090303214","0.02743545899285","0.02743545899285"
"06.04.2023","v1","SE","2C4","EM","HFC","SE_EM_2C4_HFC","kt","","","","","","","","","","","","","","","","","","","","","","","0.2457","0.1638","","","","0.2964","0.3744","0.9464","0.52","0.52"
"06.04.2023","v1","SE","2E1","EM","HFC","SE_EM_2E1_HFC","kt","","0.20088","0.20088","0.238545","0.384183","0.381672","0.60264","0.457002","0.489645","0.188325","0.188325","0.32643","0.382636224","0.164052","0.060264","","","","","","","","","","","","","","","","",""
"06.04.2023","v1","SE","2F1","EM","HFC","SE_EM_2F1_HFC","kt","4.6488172270393","7.38259645944371","8.91411640778493","25.24793473378267","65.6494531988381","121.68412053722294","194.3993246134684","267.66606218953694","357.7406484138516","478.8470386526682","587.0953392234461","666.1605384475391","747.7362747135277","820.6529138955146","879.9435743938353","923.0540368150758","963.5993808816672","985.5835101701128","1001.2564959861093","1012.7981706398572","1001.3387770281902","979.1617065737374","968.2082299922902","957.0962535688145","982.5268597371643","1003.8462316707711","1023.082846663283","985.5032106231885","932.8673656102322","892.05250803675","848.7562131069147","810.5217602996299"
"06.04.2023","v1","SE","2F2","EM","HFC","SE_EM_2F2_HFC","kt","","","","","","","12.3259401","76.8417354508","83.3917047526","99.1694917672","110.6998414476","109.43668641","103.9300422536","96.6997266768","106.2053657808","86.789845269","74.0192517022","53.9061563112","50.6056598788","39.404850952","32.109050612","36.19090103","34.50941302","36.894542902","35.22558813","33.58488748","32.75700075","31.75796883","31.32610851199981","27.02032752957398","26.00673815816144","15.93174803220645"
"06.04.2023","v1","SE","2F3","EM","HFC","SE_EM_2F3_HFC","kt","","","","","","","","0.9720075","2.4260675","3.802553","5.487902","5.25998005","5.7821521","6.007464","6.3825898","5.95383783495864","6.22231789908725","7.06796946760603","9.24532224430806","6.09014577797439","5.14653103680164","2.12806063209843","1.92508386586844","1.19929452865454","1.03814238662647","0.83221766751559","0.79985222570931","3.41730726327605","1.53262726333424","1.34250780379544","0.62221225025158","0.19497021996858"
"06.04.2023","v1","SE","2F4","EM","HFC","SE_EM_2F4_HFC","kt","1.3","2.6","2.6","2.86166933","3.13836458","6.65803048","8.3150520676","7.0845278272","13.7805357324","20.5398984002","21.898347942","22.6013082832","22.9725868922","23.8027444334","29.6692878174","29.060664532","23.9064847818","25.9327040119","26.309389641805","25.72705858673625","25.07819182394681","21.37287269557569","17.872515720797","18.441790775352","20.2113669661","20.284462779105","20.25808111491","21.178222850535","21.292248862145","16.458912188465","12.6802038984","13.660405204678"
"06.04.2023","v1","SE","2C3","EM","PFC","SE_EM_2C3_PFC","kt","510.94360417690484","514.6236439437994","348.9778749754524","404.1605654611265","431.5863113884766","468.102670521379","406.3118026884711","371.7391048236842","360.64679771850416","396.1405472864457","326.1944495464673","319.0040248036669","347.87310075723514","349.19276715912065","351.16050378688954","360.0465815875372","343.1539349087352","346.30113714843105","301.6823431245674","35.476086558627","165.80582167181174","191.32783644370969","69.177330679743","44.806257452385","72.739739665593","30.756353564079","27.38600695653377","32.42883967568495","55.35877110382011","44.32181803075051","58.65346824782805","41.68542959221407"
"06.04.2023","v1","SE","2E1","EM","PFC","SE_EM_2E1_PFC","kt","","0.8714061","0.8714061","2.94213708","4.1503347","9.8122914","14.1749919","15.2948493","14.4542475","8.4465099","7.4339505","8.31689289","13.33708259346","8.9842419","3.5552412","","","","","","","","","","","","","","","","",""
"06.04.2023","v1","SE","2F1","EM","PFC","SE_EM_2F1_PFC","kt","","","","","","0.3738","1.72215","3.0171","3.3642","3.93825","4.5924","4.57905","5.554935","6.2305785","6.21162149999982","5.49699599999991","5.29674599999991","4.88556599999991","4.73337599999991","4.40897099999991","3.43855949999991","2.33878649999991","1.76487","1.40976","1.14543","0.93717","0.72891","0.52065","0.31239","0.10413","",""
"06.04.2023","v1","SE","2G2","EM","PFC","SE_EM_2G2_PFC","kt","","","","","","","","","","","","","","","","","4.895","9.79","9.79","4.895","","","","","","","","","","","",""
"06.04.2023","v1","SE","2C4","EM","SF6","SE_EM_2C4_SF6","kt","0.001","0.001","0.001","0.001","0.0011","0.0011","0.0013","0.0017","0.0016","0.0016","0.0022","0.002322","0.002756","0.001467","0.00169202","0.0041780604","0.003219121608","0.00473520404016","0.00200130812096","0.00122243428338","0.00143358296905","0.00109875462843","0.001072049721","0.00049088871542","0.00069071208973","0.00075541208973","0.00086841208973","0.00056341208973","","","",""
"06.04.2023","v1","SE","2E1","EM","SF6","SE_EM_2E1_SF6","kt","","3.375e-05","3.375e-05","3.375e-05","6.75e-05","0.00010395","0.00010395","0.00013905","7.02e-05","6.885e-05","6.885e-05","0.0001188","7.92e-05","8.865e-05","4.545e-05","","","","","","","","","","","","","","","","",""
"06.04.2023","v1","SE","2G1","EM","SF6","SE_EM_2G1_SF6","kt","0.00335870199962","0.00336471060962","0.00337085703662","0.00287728445372","0.00288981117497","0.00391850524049","0.00294734700759","0.00438244157893","0.00222200040414","0.00226491367807","0.00128748946375","0.00177187702802","0.00103570969214","0.00090270394663","0.00113797321019","0.00114619684564","0.00090387743028","0.00118252991073","0.00114710767099","0.00180181541841","0.00130359422311","0.00128728339498","0.00121322052911","0.00130916906032","0.00127734547457","0.00153140005075","0.00160862342396","0.00140298763169","0.00140418283994","0.00146077565427","0.00140177860181","0.0014635854742"
"06.04.2023","v1","SE","2G2","EM","SF6","SE_EM_2G2_SF6","kt","0.000103094","0.00010556306","9.43394294e-05","0.00044629603511","0.00060823307475","0.00080675074401","0.00077481323657","0.0007782751042","0.00098580435316","0.00138262130963","0.00165320609653","0.00117220003557","0.00137469663521","0.00127537906886","0.00127757327817","0.00132445954539","0.00081720494993","0.00010763040044","4.690659643e-05","4.643753047e-05","4.597315516e-05","4.551342361e-05","4.505828937e-05","4.460770648e-05","4.416162942e-05","4.372001312e-05","4.328281299e-05","4.284998486e-05","4.242148501e-05","4.199727016e-05","0.00022428848473","0.00022204634715"
