Vorgang gestartet
Berechne Variable Additional Information (for Tier 2), Ereignis #13368 (1/1019)
Berechne Variable Additional Information (for Tier 2), Ereignis #13369 (2/1019)
Berechne Variable Additional Information (for Tier 2), Ereignis #13370 (3/1019)
Berechne Variable Additional Information (for Tier 2), Ereignis #13371 (4/1019)
Berechne Variable Additional Information (for Tier 2), Ereignis #13372 (5/1019)
Berechne Variable Additional Information (for Tier 2), Ereignis #13373 (6/1019)
Berechne Variable Additional Information (for Tier 2), Ereignis #13374 (7/1019)
Berechne Variable Additional Information (for Tier 2), Ereignis #13375 (8/1019)
Berechne Variable Additional Information (for Tier 2), Ereignis #13376 (9/1019)
Berechne Variable Additional Information (for Tier 2), Ereignis #13377 (10/1019)
Berechne Variable Additional Information (for Tier 2), Ereignis #13378 (11/1019)
Berechne Variable Additional Information (for Tier 2), Ereignis #13379 (12/1019)
Berechne Variable Additional Information (for Tier 2), Ereignis #13380 (13/1019)
Berechne Variable Additional Information (for Tier 2), Ereignis #13381 (14/1019)
Berechne Variable Additional Information (for Tier 2), Ereignis #13382 (15/1019)
Berechne Variable Additional Information (for Tier 2), Ereignis #13383 (16/1019)
Berechne Variable Additional Information (for Tier 2), Ereignis #13384 (17/1019)
Berechne Variable Additional Information (for Tier 2), Ereignis #13385 (18/1019)
Berechne Variable Additional Information (for Tier 2), Ereignis #13386 (19/1019)
Berechne Variable Additional Information (for Tier 2), Ereignis #13387 (20/1019)
Berechne Variable Additional Information (for Tier 2), Ereignis #13388 (21/1019)
Berechne Variable Additional Information (for Tier 2), Ereignis #13389 (22/1019)
Berechne Variable Additional Information (for Tier 2), Ereignis #13390 (23/1019)
Berechne Variable Additional Information (for Tier 2), Ereignis #13391 (24/1019)
Berechne Variable Additional Information (for Tier 2), Ereignis #13392 (25/1019)
Berechne Variable Additional Information (for Tier 2), Ereignis #13393 (26/1019)
Berechne Variable Additional Information (for Tier 2), Ereignis #13394 (27/1019)
Berechne Variable Additional Information (for Tier 2), Ereignis #13395 (28/1019)
Berechne Variable Additional Information (for Tier 2), Ereignis #13396 (29/1019)
Berechne Variable Additional Information (for Tier 2), Ereignis #13397 (30/1019)
Berechne Variable Additional Information (for Tier 2), Ereignis #13398 (31/1019)
Berechne Variable Additional Information (for Tier 2), Ereignis #13399 (32/1019)
Berechne Variable Additional Information (for Tier 2), Ereignis #13400 (33/1019)
Berechne Variable Additional Information (for Tier 2), Ereignis #13401 (34/1019)
Berechne Variable Additional Information (for Tier 2), Ereignis #13402 (35/1019)
Berechne Variable Additional Information (for Tier 2), Ereignis #13403 (36/1019)
Berechne Variable Additional Information (for Tier 2), Ereignis #13404 (37/1019)
Berechne Variable Additional Information (for Tier 2), Ereignis #13405 (38/1019)
Berechne Variable Additional Information (for Tier 2), Ereignis #13406 (39/1019)
Berechne Variable Additional Information (for Tier 2), Ereignis #13407 (40/1019)
Berechne Variable Additional Information (for Tier 2), Ereignis #13408 (41/1019)
Berechne Variable Additional Information (for Tier 2), Ereignis #13409 (42/1019)
Berechne Variable Additional Information (for Tier 2), Ereignis #13410 (43/1019)
Berechne Variable Additional Information (for Tier 2), Ereignis #13411 (44/1019)
Berechne Variable Additional Information (for Tier 2), Ereignis #13412 (45/1019)
Berechne Variable Additional Information (for Tier 2), Ereignis #13413 (46/1019)
Berechne Variable Additional Information (for Tier 2), Ereignis #13414 (47/1019)
Berechne Variable Additional Information (for Tier 2), Ereignis #13415 (48/1019)
Berechne Variable Additional Information (for Tier 2), Ereignis #13416 (49/1019)
Berechne Variable Additional Information (for Tier 2), Ereignis #13417 (50/1019)
Berechne Variable Additional Information (for Tier 2), Ereignis #13418 (51/1019)
Berechne Variable Additional Information (for Tier 2), Ereignis #13419 (52/1019)
Berechne Variable Additional Information (for Tier 2), Ereignis #13420 (53/1019)
Berechne Variable Additional Information (for Tier 2), Ereignis #13421 (54/1019)
Berechne Variable CH4 Emissions, Ereignis #13422 (55/1019)
Berechne Variable CH4 Emissions, Ereignis #13423 (56/1019)
Berechne Variable CH4 Emissions, Ereignis #13424 (57/1019)
Berechne Variable CH4 Emissions, Ereignis #13425 (58/1019)
Berechne Variable CH4 Emissions, Ereignis #13426 (59/1019)
Berechne Variable CH4 Emissions, Ereignis #13428 (60/1019)
Berechne Variable CH4 Emissions, Ereignis #13430 (61/1019)
Berechne Variable CH4 Emissions, Ereignis #13431 (62/1019)
Berechne Variable CH4 Emissions, Ereignis #13432 (63/1019)
Berechne Variable N2O and NMVOC Emissions, Ereignis #13433 (64/1019)
Berechne Variable N2O and NMVOC Emissions, Ereignis #13435 (65/1019)
Berechne Variable N2O and NMVOC Emissions, Ereignis #13436 (66/1019)
Berechne Variable N2O and NMVOC Emissions, Ereignis #13439 (67/1019)
Berechne Variable N2O and NMVOC Emissions, Ereignis #13440 (68/1019)
Berechne Variable N2O and NMVOC Emissions, Ereignis #13441 (69/1019)
Berechne Variable N2O and NMVOC Emissions, Ereignis #13442 (70/1019)
Berechne Variable N2O and NMVOC Emissions, Ereignis #13443 (71/1019)
Berechne Variable N2O and NMVOC Emissions, Ereignis #13444 (72/1019)
Berechne Variable N2O and NMVOC Emissions, Ereignis #13445 (73/1019)
Berechne Variable N2O and NMVOC Emissions, Ereignis #13446 (74/1019)
Berechne Variable N2O and NMVOC Emissions, Ereignis #13447 (75/1019)
Berechne Variable N2O and NMVOC Emissions, Ereignis #13448 (76/1019)
Berechne Variable CH4 Emissions, Ereignis #13458 (77/1019)
Berechne Variable CH4 Emissions, Ereignis #13459 (78/1019)
Berechne Variable Additional Information (for Tier 2), Ereignis #13496 (79/1019)
Berechne Variable Additional Information (for Tier 2), Ereignis #13497 (80/1019)
Berechne Variable Additional Information (for Tier 2), Ereignis #13498 (81/1019)
Berechne Variable Additional Information (for Tier 2), Ereignis #13499 (82/1019)
Berechne Variable Additional Information (for Tier 2), Ereignis #13500 (83/1019)
Berechne Variable Additional Information (for Tier 2), Ereignis #13501 (84/1019)
Berechne Variable Additional Information (for Tier 2), Ereignis #13502 (85/1019)
Berechne Variable Additional Information (for Tier 2), Ereignis #13503 (86/1019)
Berechne Variable Additional Information (for Tier 2), Ereignis #13504 (87/1019)
Berechne Variable Additional Information (for Tier 2), Ereignis #13505 (88/1019)
Berechne Variable Additional Information (for Tier 2), Ereignis #13506 (89/1019)
Berechne Variable Additional Information (for Tier 2), Ereignis #13507 (90/1019)
Berechne Variable Additional Information (for Tier 2), Ereignis #13508 (91/1019)
Berechne Variable Additional Information (for Tier 2), Ereignis #13509 (92/1019)
Berechne Variable Additional Information (for Tier 2), Ereignis #13510 (93/1019)
Berechne Variable Additional Information (for Tier 2), Ereignis #13511 (94/1019)
Berechne Variable Additional Information (for Tier 2), Ereignis #13512 (95/1019)
Berechne Variable Additional Information (for Tier 2), Ereignis #13513 (96/1019)
Berechne Variable Additional Information (for Tier 2), Ereignis #13514 (97/1019)
Berechne Variable Additional Information (for Tier 2), Ereignis #13515 (98/1019)
Berechne Variable Additional Information (for Tier 2), Ereignis #13516 (99/1019)
Berechne Variable Additional Information (for Tier 2), Ereignis #13517 (100/1019)
Berechne Variable Additional Information (for Tier 2), Ereignis #13518 (101/1019)
Berechne Variable Additional Information (for Tier 2), Ereignis #13519 (102/1019)
Berechne Variable Additional Information (for Tier 2), Ereignis #13520 (103/1019)
Berechne Variable Additional Information (for Tier 2), Ereignis #13521 (104/1019)
Berechne Variable Additional Information (for Tier 2), Ereignis #13522 (105/1019)
Berechne Variable Additional Information (for Tier 2), Ereignis #13523 (106/1019)
Berechne Variable Additional Information (for Tier 2), Ereignis #13525 (107/1019)
Berechne Variable Additional Information (for Tier 2), Ereignis #13526 (108/1019)
Berechne Variable Additional Information (for Tier 2), Ereignis #13527 (109/1019)
Berechne Variable Additional Information (for Tier 2), Ereignis #13529 (110/1019)
Berechne Variable Additional Information (for Tier 2), Ereignis #13530 (111/1019)
Berechne Variable Additional Information (for Tier 2), Ereignis #13531 (112/1019)
Berechne Variable Additional Information (for Tier 2), Ereignis #13533 (113/1019)
Berechne Variable Additional Information (for Tier 2), Ereignis #13534 (114/1019)
Berechne Variable Additional Information (for Tier 2), Ereignis #13535 (115/1019)
Berechne Variable Additional Information (for Tier 2), Ereignis #13537 (116/1019)
Berechne Variable Additional Information (for Tier 2), Ereignis #13538 (117/1019)
Berechne Variable Additional Information (for Tier 2), Ereignis #13539 (118/1019)
Berechne Variable Additional Information (for Tier 2), Ereignis #13541 (119/1019)
Berechne Variable Additional Information (for Tier 2), Ereignis #13542 (120/1019)
Berechne Variable Additional Information (for Tier 2), Ereignis #13543 (121/1019)
Berechne Variable Additional Information (for Tier 2), Ereignis #13545 (122/1019)
Berechne Variable Additional Information (for Tier 2), Ereignis #13546 (123/1019)
Berechne Variable Additional Information (for Tier 2), Ereignis #13547 (124/1019)
Berechne Variable Additional Information (for Tier 2), Ereignis #13549 (125/1019)
Berechne Variable Additional Information (for Tier 2), Ereignis #13550 (126/1019)
Berechne Variable Additional Information (for Tier 2), Ereignis #13551 (127/1019)
Berechne Variable Additional Information (for Tier 2), Ereignis #13553 (128/1019)
Berechne Variable Additional Information (for Tier 2), Ereignis #13554 (129/1019)
Berechne Variable Additional Information (for Tier 2), Ereignis #13555 (130/1019)
Berechne Variable Additional Information (for Tier 2), Ereignis #13557 (131/1019)
Berechne Variable Additional Information (for Tier 2), Ereignis #13558 (132/1019)
Berechne Variable CH4 Emissions, Ereignis #13559 (133/1019)
Berechne Variable CH4 Emissions, Ereignis #13560 (134/1019)
Berechne Variable CH4 Emissions, Ereignis #13561 (135/1019)
Berechne Variable CH4 Emissions, Ereignis #13562 (136/1019)
Berechne Variable CH4 Emissions, Ereignis #13565 (137/1019)
Berechne Variable CH4 Emissions, Ereignis #13567 (138/1019)
Berechne Variable CH4 Emissions, Ereignis #13568 (139/1019)
Berechne Variable CH4 Emissions, Ereignis #13569 (140/1019)
Berechne Variable N2O and NMVOC Emissions, Ereignis #13572 (141/1019)
Berechne Variable N2O and NMVOC Emissions, Ereignis #13573 (142/1019)
Berechne Variable N2O and NMVOC Emissions, Ereignis #13576 (143/1019)
Berechne Variable N2O and NMVOC Emissions, Ereignis #13577 (144/1019)
Berechne Variable N2O and NMVOC Emissions, Ereignis #13578 (145/1019)
Berechne Variable N2O and NMVOC Emissions, Ereignis #13579 (146/1019)
Berechne Variable N2O and NMVOC Emissions, Ereignis #13580 (147/1019)
Berechne Variable N2O and NMVOC Emissions, Ereignis #13581 (148/1019)
Berechne Variable N2O and NMVOC Emissions, Ereignis #13582 (149/1019)
Berechne Variable N2O and NMVOC Emissions, Ereignis #13583 (150/1019)
Berechne Variable N2O and NMVOC Emissions, Ereignis #13584 (151/1019)
Berechne Variable N2O and NMVOC Emissions, Ereignis #13585 (152/1019)
Berechne Variable Additional Information (for Tier 2), Ereignis #13587 (153/1019)
Berechne Variable Additional Information (for Tier 2), Ereignis #13588 (154/1019)
Berechne Variable Additional Information (for Tier 2), Ereignis #13589 (155/1019)
Berechne Variable Additional Information (for Tier 2), Ereignis #13590 (156/1019)
Berechne Variable Additional Information (for Tier 2), Ereignis #13591 (157/1019)
Berechne Variable Additional Information (for Tier 2), Ereignis #13592 (158/1019)
Berechne Variable Additional Information (for Tier 2), Ereignis #13593 (159/1019)
Berechne Variable Additional Information (for Tier 2), Ereignis #13594 (160/1019)
Berechne Variable Additional Information (for Tier 2), Ereignis #13595 (161/1019)
Berechne Variable Additional Information (for Tier 2), Ereignis #13596 (162/1019)
Berechne Variable Additional Information (for Tier 2), Ereignis #13597 (163/1019)
Berechne Variable Additional Information (for Tier 2), Ereignis #13598 (164/1019)
Berechne Variable Additional Information (for Tier 2), Ereignis #13599 (165/1019)
Berechne Variable Additional Information (for Tier 2), Ereignis #13600 (166/1019)
Berechne Variable Additional Information (for Tier 2), Ereignis #13601 (167/1019)
Berechne Variable Additional Information (for Tier 2), Ereignis #13602 (168/1019)
Berechne Variable Additional Information (for Tier 2), Ereignis #13603 (169/1019)
Berechne Variable Additional Information (for Tier 2), Ereignis #13604 (170/1019)
Berechne Variable Additional Information (for Tier 2), Ereignis #13605 (171/1019)
Berechne Variable Additional Information (for Tier 2), Ereignis #13606 (172/1019)
Berechne Variable Additional Information (for Tier 2), Ereignis #13607 (173/1019)
Berechne Variable Additional Information (for Tier 2), Ereignis #13608 (174/1019)
Berechne Variable Additional Information (for Tier 2), Ereignis #13609 (175/1019)
Berechne Variable Additional Information (for Tier 2), Ereignis #13610 (176/1019)
Berechne Variable Additional Information (for Tier 2), Ereignis #13611 (177/1019)
Berechne Variable Additional Information (for Tier 2), Ereignis #13612 (178/1019)
Berechne Variable Additional Information (for Tier 2), Ereignis #13613 (179/1019)
Berechne Variable Additional Information (for Tier 2), Ereignis #13614 (180/1019)
Berechne Variable Additional Information (for Tier 2), Ereignis #13615 (181/1019)
Berechne Variable Additional Information (for Tier 2), Ereignis #13616 (182/1019)
Berechne Variable Additional Information (for Tier 2), Ereignis #13617 (183/1019)
Berechne Variable Additional Information (for Tier 2), Ereignis #13618 (184/1019)
Berechne Variable Additional Information (for Tier 2), Ereignis #13619 (185/1019)
Berechne Variable Additional Information (for Tier 2), Ereignis #13620 (186/1019)
Berechne Variable Additional Information (for Tier 2), Ereignis #13621 (187/1019)
Berechne Variable Additional Information (for Tier 2), Ereignis #13622 (188/1019)
Berechne Variable Additional Information (for Tier 2), Ereignis #13623 (189/1019)
Berechne Variable Additional Information (for Tier 2), Ereignis #13624 (190/1019)
Berechne Variable Additional Information (for Tier 2), Ereignis #13625 (191/1019)
Berechne Variable Additional Information (for Tier 2), Ereignis #13626 (192/1019)
Berechne Variable Additional Information (for Tier 2), Ereignis #13627 (193/1019)
Berechne Variable Additional Information (for Tier 2), Ereignis #13628 (194/1019)
Berechne Variable Additional Information (for Tier 2), Ereignis #13629 (195/1019)
Berechne Variable Additional Information (for Tier 2), Ereignis #13630 (196/1019)
Berechne Variable Additional Information (for Tier 2), Ereignis #13631 (197/1019)
Berechne Variable Additional Information (for Tier 2), Ereignis #13632 (198/1019)
Berechne Variable Additional Information (for Tier 2), Ereignis #13633 (199/1019)
Berechne Variable Additional Information (for Tier 2), Ereignis #13634 (200/1019)
Berechne Variable Additional Information (for Tier 2), Ereignis #13635 (201/1019)
Berechne Variable Additional Information (for Tier 2), Ereignis #13636 (202/1019)
Berechne Variable Additional Information (for Tier 2), Ereignis #13637 (203/1019)
Berechne Variable Additional Information (for Tier 2), Ereignis #13638 (204/1019)
Berechne Variable Additional Information (for Tier 2), Ereignis #13639 (205/1019)
Berechne Variable Additional Information (for Tier 2), Ereignis #13640 (206/1019)
Berechne Variable CH4 Emissions, Ereignis #13641 (207/1019)
Berechne Variable CH4 Emissions, Ereignis #13642 (208/1019)
Berechne Variable CH4 Emissions, Ereignis #13643 (209/1019)
Berechne Variable CH4 Emissions, Ereignis #13644 (210/1019)
Berechne Variable CH4 Emissions, Ereignis #13647 (211/1019)
Berechne Variable CH4 Emissions, Ereignis #13649 (212/1019)
Berechne Variable CH4 Emissions, Ereignis #13650 (213/1019)
Berechne Variable CH4 Emissions, Ereignis #13651 (214/1019)
Berechne Variable N2O and NMVOC Emissions, Ereignis #13654 (215/1019)
Berechne Variable N2O and NMVOC Emissions, Ereignis #13655 (216/1019)
Berechne Variable N2O and NMVOC Emissions, Ereignis #13658 (217/1019)
Berechne Variable N2O and NMVOC Emissions, Ereignis #13659 (218/1019)
Berechne Variable N2O and NMVOC Emissions, Ereignis #13660 (219/1019)
Berechne Variable N2O and NMVOC Emissions, Ereignis #13661 (220/1019)
Berechne Variable N2O and NMVOC Emissions, Ereignis #13662 (221/1019)
Berechne Variable N2O and NMVOC Emissions, Ereignis #13663 (222/1019)
Berechne Variable N2O and NMVOC Emissions, Ereignis #13664 (223/1019)
Berechne Variable N2O and NMVOC Emissions, Ereignis #13665 (224/1019)
Berechne Variable N2O and NMVOC Emissions, Ereignis #13666 (225/1019)
Berechne Variable N2O and NMVOC Emissions, Ereignis #13667 (226/1019)
Berechne Variable Additional Information (for Tier 2), Ereignis #13669 (227/1019)
Berechne Variable Additional Information (for Tier 2), Ereignis #13670 (228/1019)
Berechne Variable Additional Information (for Tier 2), Ereignis #13671 (229/1019)
Berechne Variable Additional Information (for Tier 2), Ereignis #13672 (230/1019)
Berechne Variable Additional Information (for Tier 2), Ereignis #13673 (231/1019)
Berechne Variable Additional Information (for Tier 2), Ereignis #13674 (232/1019)
Berechne Variable Additional Information (for Tier 2), Ereignis #13675 (233/1019)
Berechne Variable Additional Information (for Tier 2), Ereignis #13676 (234/1019)
Berechne Variable Additional Information (for Tier 2), Ereignis #13677 (235/1019)
Berechne Variable Additional Information (for Tier 2), Ereignis #13678 (236/1019)
Berechne Variable Additional Information (for Tier 2), Ereignis #13679 (237/1019)
Berechne Variable Additional Information (for Tier 2), Ereignis #13680 (238/1019)
Berechne Variable Additional Information (for Tier 2), Ereignis #13681 (239/1019)
Berechne Variable Additional Information (for Tier 2), Ereignis #13682 (240/1019)
Berechne Variable Additional Information (for Tier 2), Ereignis #13683 (241/1019)
Berechne Variable Additional Information (for Tier 2), Ereignis #13684 (242/1019)
Berechne Variable Additional Information (for Tier 2), Ereignis #13685 (243/1019)
Berechne Variable Additional Information (for Tier 2), Ereignis #13686 (244/1019)
Berechne Variable Additional Information (for Tier 2), Ereignis #13687 (245/1019)
Berechne Variable Additional Information (for Tier 2), Ereignis #13688 (246/1019)
Berechne Variable Additional Information (for Tier 2), Ereignis #13689 (247/1019)
Berechne Variable Additional Information (for Tier 2), Ereignis #13690 (248/1019)
Berechne Variable Additional Information (for Tier 2), Ereignis #13691 (249/1019)
Berechne Variable Additional Information (for Tier 2), Ereignis #13692 (250/1019)
Berechne Variable Additional Information (for Tier 2), Ereignis #13693 (251/1019)
Berechne Variable Additional Information (for Tier 2), Ereignis #13694 (252/1019)
Berechne Variable Additional Information (for Tier 2), Ereignis #13695 (253/1019)
Berechne Variable Additional Information (for Tier 2), Ereignis #13696 (254/1019)
Berechne Variable Additional Information (for Tier 2), Ereignis #13697 (255/1019)
Berechne Variable Additional Information (for Tier 2), Ereignis #13698 (256/1019)
Berechne Variable Additional Information (for Tier 2), Ereignis #13699 (257/1019)
Berechne Variable Additional Information (for Tier 2), Ereignis #13700 (258/1019)
Berechne Variable Additional Information (for Tier 2), Ereignis #13701 (259/1019)
Berechne Variable Additional Information (for Tier 2), Ereignis #13702 (260/1019)
Berechne Variable Additional Information (for Tier 2), Ereignis #13703 (261/1019)
Berechne Variable Additional Information (for Tier 2), Ereignis #13704 (262/1019)
Berechne Variable Additional Information (for Tier 2), Ereignis #13705 (263/1019)
Berechne Variable Additional Information (for Tier 2), Ereignis #13706 (264/1019)
Berechne Variable Additional Information (for Tier 2), Ereignis #13707 (265/1019)
Berechne Variable Additional Information (for Tier 2), Ereignis #13708 (266/1019)
Berechne Variable Additional Information (for Tier 2), Ereignis #13709 (267/1019)
Berechne Variable Additional Information (for Tier 2), Ereignis #13710 (268/1019)
Berechne Variable Additional Information (for Tier 2), Ereignis #13711 (269/1019)
Berechne Variable Additional Information (for Tier 2), Ereignis #13712 (270/1019)
Berechne Variable Additional Information (for Tier 2), Ereignis #13713 (271/1019)
Berechne Variable Additional Information (for Tier 2), Ereignis #13714 (272/1019)
Berechne Variable Additional Information (for Tier 2), Ereignis #13715 (273/1019)
Berechne Variable Additional Information (for Tier 2), Ereignis #13716 (274/1019)
Berechne Variable Additional Information (for Tier 2), Ereignis #13717 (275/1019)
Berechne Variable Additional Information (for Tier 2), Ereignis #13718 (276/1019)
Berechne Variable Additional Information (for Tier 2), Ereignis #13719 (277/1019)
Berechne Variable Additional Information (for Tier 2), Ereignis #13720 (278/1019)
Berechne Variable Additional Information (for Tier 2), Ereignis #13721 (279/1019)
Berechne Variable Additional Information (for Tier 2), Ereignis #13722 (280/1019)
Berechne Variable CH4 Emissions, Ereignis #13723 (281/1019)
Berechne Variable CH4 Emissions, Ereignis #13724 (282/1019)
Berechne Variable CH4 Emissions, Ereignis #13725 (283/1019)
Berechne Variable CH4 Emissions, Ereignis #13726 (284/1019)
Berechne Variable CH4 Emissions, Ereignis #13729 (285/1019)
Berechne Variable CH4 Emissions, Ereignis #13731 (286/1019)
Berechne Variable CH4 Emissions, Ereignis #13732 (287/1019)
Berechne Variable CH4 Emissions, Ereignis #13733 (288/1019)
Berechne Variable N2O and NMVOC Emissions, Ereignis #13736 (289/1019)
Berechne Variable N2O and NMVOC Emissions, Ereignis #13737 (290/1019)
Berechne Variable N2O and NMVOC Emissions, Ereignis #13740 (291/1019)
Berechne Variable N2O and NMVOC Emissions, Ereignis #13741 (292/1019)
Berechne Variable N2O and NMVOC Emissions, Ereignis #13742 (293/1019)
Berechne Variable N2O and NMVOC Emissions, Ereignis #13743 (294/1019)
Berechne Variable N2O and NMVOC Emissions, Ereignis #13744 (295/1019)
Berechne Variable N2O and NMVOC Emissions, Ereignis #13745 (296/1019)
Berechne Variable N2O and NMVOC Emissions, Ereignis #13746 (297/1019)
Berechne Variable N2O and NMVOC Emissions, Ereignis #13747 (298/1019)
Berechne Variable N2O and NMVOC Emissions, Ereignis #13748 (299/1019)
Berechne Variable N2O and NMVOC Emissions, Ereignis #13749 (300/1019)
Berechne Variable Additional Information (for Tier 2), Ereignis #13751 (301/1019)
Berechne Variable Additional Information (for Tier 2), Ereignis #13752 (302/1019)
Berechne Variable Additional Information (for Tier 2), Ereignis #13753 (303/1019)
Berechne Variable Additional Information (for Tier 2), Ereignis #13754 (304/1019)
Berechne Variable Additional Information (for Tier 2), Ereignis #13755 (305/1019)
Berechne Variable Additional Information (for Tier 2), Ereignis #13756 (306/1019)
Berechne Variable Additional Information (for Tier 2), Ereignis #13757 (307/1019)
Berechne Variable Additional Information (for Tier 2), Ereignis #13758 (308/1019)
Berechne Variable Additional Information (for Tier 2), Ereignis #13759 (309/1019)
Berechne Variable Additional Information (for Tier 2), Ereignis #13760 (310/1019)
Berechne Variable Additional Information (for Tier 2), Ereignis #13761 (311/1019)
Berechne Variable Additional Information (for Tier 2), Ereignis #13762 (312/1019)
Berechne Variable Additional Information (for Tier 2), Ereignis #13763 (313/1019)
Berechne Variable Additional Information (for Tier 2), Ereignis #13764 (314/1019)
Berechne Variable Additional Information (for Tier 2), Ereignis #13765 (315/1019)
Berechne Variable Additional Information (for Tier 2), Ereignis #13766 (316/1019)
Berechne Variable Additional Information (for Tier 2), Ereignis #13767 (317/1019)
Berechne Variable Additional Information (for Tier 2), Ereignis #13768 (318/1019)
Berechne Variable Additional Information (for Tier 2), Ereignis #13769 (319/1019)
Berechne Variable Additional Information (for Tier 2), Ereignis #13770 (320/1019)
Berechne Variable Additional Information (for Tier 2), Ereignis #13771 (321/1019)
Berechne Variable Additional Information (for Tier 2), Ereignis #13772 (322/1019)
Berechne Variable Additional Information (for Tier 2), Ereignis #13773 (323/1019)
Berechne Variable Additional Information (for Tier 2), Ereignis #13774 (324/1019)
Berechne Variable Additional Information (for Tier 2), Ereignis #13775 (325/1019)
Berechne Variable Additional Information (for Tier 2), Ereignis #13776 (326/1019)
Berechne Variable Additional Information (for Tier 2), Ereignis #13777 (327/1019)
Berechne Variable Additional Information (for Tier 2), Ereignis #13778 (328/1019)
Berechne Variable Additional Information (for Tier 2), Ereignis #13779 (329/1019)
Berechne Variable Additional Information (for Tier 2), Ereignis #13780 (330/1019)
Berechne Variable Additional Information (for Tier 2), Ereignis #13781 (331/1019)
Berechne Variable Additional Information (for Tier 2), Ereignis #13782 (332/1019)
Berechne Variable Additional Information (for Tier 2), Ereignis #13783 (333/1019)
Berechne Variable Additional Information (for Tier 2), Ereignis #13784 (334/1019)
Berechne Variable Additional Information (for Tier 2), Ereignis #13785 (335/1019)
Berechne Variable Additional Information (for Tier 2), Ereignis #13786 (336/1019)
Berechne Variable Additional Information (for Tier 2), Ereignis #13787 (337/1019)
Berechne Variable Additional Information (for Tier 2), Ereignis #13788 (338/1019)
Berechne Variable Additional Information (for Tier 2), Ereignis #13789 (339/1019)
Berechne Variable Additional Information (for Tier 2), Ereignis #13790 (340/1019)
Berechne Variable Additional Information (for Tier 2), Ereignis #13791 (341/1019)
Berechne Variable Additional Information (for Tier 2), Ereignis #13792 (342/1019)
Berechne Variable Additional Information (for Tier 2), Ereignis #13793 (343/1019)
Berechne Variable Additional Information (for Tier 2), Ereignis #13794 (344/1019)
Berechne Variable Additional Information (for Tier 2), Ereignis #13795 (345/1019)
Berechne Variable Additional Information (for Tier 2), Ereignis #13796 (346/1019)
Berechne Variable Additional Information (for Tier 2), Ereignis #13797 (347/1019)
Berechne Variable Additional Information (for Tier 2), Ereignis #13798 (348/1019)
Berechne Variable Additional Information (for Tier 2), Ereignis #13799 (349/1019)
Berechne Variable Additional Information (for Tier 2), Ereignis #13800 (350/1019)
Berechne Variable Additional Information (for Tier 2), Ereignis #13801 (351/1019)
Berechne Variable Additional Information (for Tier 2), Ereignis #13802 (352/1019)
Berechne Variable Additional Information (for Tier 2), Ereignis #13803 (353/1019)
Berechne Variable Additional Information (for Tier 2), Ereignis #13804 (354/1019)
Berechne Variable CH4 Emissions, Ereignis #13805 (355/1019)
Berechne Variable CH4 Emissions, Ereignis #13806 (356/1019)
Berechne Variable CH4 Emissions, Ereignis #13807 (357/1019)
Berechne Variable CH4 Emissions, Ereignis #13808 (358/1019)
Berechne Variable CH4 Emissions, Ereignis #13811 (359/1019)
Berechne Variable CH4 Emissions, Ereignis #13813 (360/1019)
Berechne Variable CH4 Emissions, Ereignis #13814 (361/1019)
Berechne Variable CH4 Emissions, Ereignis #13815 (362/1019)
Berechne Variable N2O and NMVOC Emissions, Ereignis #13818 (363/1019)
Berechne Variable N2O and NMVOC Emissions, Ereignis #13819 (364/1019)
Berechne Variable N2O and NMVOC Emissions, Ereignis #13822 (365/1019)
Berechne Variable N2O and NMVOC Emissions, Ereignis #13823 (366/1019)
Berechne Variable N2O and NMVOC Emissions, Ereignis #13824 (367/1019)
Berechne Variable N2O and NMVOC Emissions, Ereignis #13825 (368/1019)
Berechne Variable N2O and NMVOC Emissions, Ereignis #13826 (369/1019)
Berechne Variable N2O and NMVOC Emissions, Ereignis #13827 (370/1019)
Berechne Variable N2O and NMVOC Emissions, Ereignis #13828 (371/1019)
Berechne Variable N2O and NMVOC Emissions, Ereignis #13829 (372/1019)
Berechne Variable N2O and NMVOC Emissions, Ereignis #13830 (373/1019)
Berechne Variable N2O and NMVOC Emissions, Ereignis #13831 (374/1019)
Berechne Variable Additional Information (for Tier 2), Ereignis #13833 (375/1019)
Berechne Variable Additional Information (for Tier 2), Ereignis #13834 (376/1019)
Berechne Variable Additional Information (for Tier 2), Ereignis #13835 (377/1019)
Berechne Variable Additional Information (for Tier 2), Ereignis #13836 (378/1019)
Berechne Variable Additional Information (for Tier 2), Ereignis #13837 (379/1019)
Berechne Variable Additional Information (for Tier 2), Ereignis #13838 (380/1019)
Berechne Variable Additional Information (for Tier 2), Ereignis #13839 (381/1019)
Berechne Variable Additional Information (for Tier 2), Ereignis #13840 (382/1019)
Berechne Variable Additional Information (for Tier 2), Ereignis #13841 (383/1019)
Berechne Variable Additional Information (for Tier 2), Ereignis #13842 (384/1019)
Berechne Variable Additional Information (for Tier 2), Ereignis #13843 (385/1019)
Berechne Variable Additional Information (for Tier 2), Ereignis #13844 (386/1019)
Berechne Variable Additional Information (for Tier 2), Ereignis #13845 (387/1019)
Berechne Variable Additional Information (for Tier 2), Ereignis #13846 (388/1019)
Berechne Variable Additional Information (for Tier 2), Ereignis #13847 (389/1019)
Berechne Variable Additional Information (for Tier 2), Ereignis #13848 (390/1019)
Berechne Variable Additional Information (for Tier 2), Ereignis #13849 (391/1019)
Berechne Variable Additional Information (for Tier 2), Ereignis #13850 (392/1019)
Berechne Variable Additional Information (for Tier 2), Ereignis #13851 (393/1019)
Berechne Variable Additional Information (for Tier 2), Ereignis #13852 (394/1019)
Berechne Variable Additional Information (for Tier 2), Ereignis #13853 (395/1019)
Berechne Variable Additional Information (for Tier 2), Ereignis #13854 (396/1019)
Berechne Variable Additional Information (for Tier 2), Ereignis #13855 (397/1019)
Berechne Variable Additional Information (for Tier 2), Ereignis #13856 (398/1019)
Berechne Variable Additional Information (for Tier 2), Ereignis #13857 (399/1019)
Berechne Variable Additional Information (for Tier 2), Ereignis #13858 (400/1019)
Berechne Variable Additional Information (for Tier 2), Ereignis #13859 (401/1019)
Berechne Variable Additional Information (for Tier 2), Ereignis #13860 (402/1019)
Berechne Variable Additional Information (for Tier 2), Ereignis #13861 (403/1019)
Berechne Variable Additional Information (for Tier 2), Ereignis #13862 (404/1019)
Berechne Variable Additional Information (for Tier 2), Ereignis #13863 (405/1019)
Berechne Variable Additional Information (for Tier 2), Ereignis #13864 (406/1019)
Berechne Variable Additional Information (for Tier 2), Ereignis #13865 (407/1019)
Berechne Variable Additional Information (for Tier 2), Ereignis #13866 (408/1019)
Berechne Variable Additional Information (for Tier 2), Ereignis #13867 (409/1019)
Berechne Variable Additional Information (for Tier 2), Ereignis #13868 (410/1019)
Berechne Variable Additional Information (for Tier 2), Ereignis #13869 (411/1019)
Berechne Variable Additional Information (for Tier 2), Ereignis #13870 (412/1019)
Berechne Variable Additional Information (for Tier 2), Ereignis #13871 (413/1019)
Berechne Variable Additional Information (for Tier 2), Ereignis #13872 (414/1019)
Berechne Variable Additional Information (for Tier 2), Ereignis #13873 (415/1019)
Berechne Variable Additional Information (for Tier 2), Ereignis #13874 (416/1019)
Berechne Variable Additional Information (for Tier 2), Ereignis #13875 (417/1019)
Berechne Variable Additional Information (for Tier 2), Ereignis #13876 (418/1019)
Berechne Variable Additional Information (for Tier 2), Ereignis #13877 (419/1019)
Berechne Variable Additional Information (for Tier 2), Ereignis #13878 (420/1019)
Berechne Variable Additional Information (for Tier 2), Ereignis #13879 (421/1019)
Berechne Variable Additional Information (for Tier 2), Ereignis #13880 (422/1019)
Berechne Variable Additional Information (for Tier 2), Ereignis #13881 (423/1019)
Berechne Variable Additional Information (for Tier 2), Ereignis #13882 (424/1019)
Berechne Variable Additional Information (for Tier 2), Ereignis #13883 (425/1019)
Berechne Variable Additional Information (for Tier 2), Ereignis #13884 (426/1019)
Berechne Variable Additional Information (for Tier 2), Ereignis #13885 (427/1019)
Berechne Variable Additional Information (for Tier 2), Ereignis #13886 (428/1019)
Berechne Variable CH4 Emissions, Ereignis #13888 (429/1019)
Berechne Variable CH4 Emissions, Ereignis #13889 (430/1019)
Berechne Variable CH4 Emissions, Ereignis #13890 (431/1019)
Berechne Variable CH4 Emissions, Ereignis #13893 (432/1019)
Berechne Variable CH4 Emissions, Ereignis #13895 (433/1019)
Berechne Variable CH4 Emissions, Ereignis #13896 (434/1019)
Berechne Variable CH4 Emissions, Ereignis #13897 (435/1019)
Berechne Variable N2O and NMVOC Emissions, Ereignis #13900 (436/1019)
Berechne Variable N2O and NMVOC Emissions, Ereignis #13901 (437/1019)
Berechne Variable N2O and NMVOC Emissions, Ereignis #13904 (438/1019)
Berechne Variable N2O and NMVOC Emissions, Ereignis #13905 (439/1019)
Berechne Variable N2O and NMVOC Emissions, Ereignis #13906 (440/1019)
Berechne Variable N2O and NMVOC Emissions, Ereignis #13907 (441/1019)
Berechne Variable N2O and NMVOC Emissions, Ereignis #13908 (442/1019)
Berechne Variable N2O and NMVOC Emissions, Ereignis #13909 (443/1019)
Berechne Variable N2O and NMVOC Emissions, Ereignis #13910 (444/1019)
Berechne Variable N2O and NMVOC Emissions, Ereignis #13911 (445/1019)
Berechne Variable N2O and NMVOC Emissions, Ereignis #13912 (446/1019)
Berechne Variable N2O and NMVOC Emissions, Ereignis #13913 (447/1019)
Berechne Variable Additional Information (for Tier 2), Ereignis #13915 (448/1019)
Berechne Variable Additional Information (for Tier 2), Ereignis #13916 (449/1019)
Berechne Variable Additional Information (for Tier 2), Ereignis #13917 (450/1019)
Berechne Variable Additional Information (for Tier 2), Ereignis #13918 (451/1019)
Berechne Variable Additional Information (for Tier 2), Ereignis #13919 (452/1019)
Berechne Variable Additional Information (for Tier 2), Ereignis #13920 (453/1019)
Berechne Variable Additional Information (for Tier 2), Ereignis #13921 (454/1019)
Berechne Variable Additional Information (for Tier 2), Ereignis #13922 (455/1019)
Berechne Variable Additional Information (for Tier 2), Ereignis #13923 (456/1019)
Berechne Variable Additional Information (for Tier 2), Ereignis #13924 (457/1019)
Berechne Variable Additional Information (for Tier 2), Ereignis #13925 (458/1019)
Berechne Variable Additional Information (for Tier 2), Ereignis #13926 (459/1019)
Berechne Variable Additional Information (for Tier 2), Ereignis #13927 (460/1019)
Berechne Variable Additional Information (for Tier 2), Ereignis #13928 (461/1019)
Berechne Variable Additional Information (for Tier 2), Ereignis #13929 (462/1019)
Berechne Variable Additional Information (for Tier 2), Ereignis #13930 (463/1019)
Berechne Variable Additional Information (for Tier 2), Ereignis #13931 (464/1019)
Berechne Variable Additional Information (for Tier 2), Ereignis #13932 (465/1019)
Berechne Variable Additional Information (for Tier 2), Ereignis #13933 (466/1019)
Berechne Variable Additional Information (for Tier 2), Ereignis #13934 (467/1019)
Berechne Variable Additional Information (for Tier 2), Ereignis #13935 (468/1019)
Berechne Variable Additional Information (for Tier 2), Ereignis #13936 (469/1019)
Berechne Variable Additional Information (for Tier 2), Ereignis #13937 (470/1019)
Berechne Variable Additional Information (for Tier 2), Ereignis #13938 (471/1019)
Berechne Variable Additional Information (for Tier 2), Ereignis #13939 (472/1019)
Berechne Variable Additional Information (for Tier 2), Ereignis #13940 (473/1019)
Berechne Variable Additional Information (for Tier 2), Ereignis #13941 (474/1019)
Berechne Variable Additional Information (for Tier 2), Ereignis #13942 (475/1019)
Berechne Variable Additional Information (for Tier 2), Ereignis #13943 (476/1019)
Berechne Variable Additional Information (for Tier 2), Ereignis #13944 (477/1019)
Berechne Variable Additional Information (for Tier 2), Ereignis #13945 (478/1019)
Berechne Variable Additional Information (for Tier 2), Ereignis #13946 (479/1019)
Berechne Variable Additional Information (for Tier 2), Ereignis #13947 (480/1019)
Berechne Variable Additional Information (for Tier 2), Ereignis #13948 (481/1019)
Berechne Variable Additional Information (for Tier 2), Ereignis #13949 (482/1019)
Berechne Variable Additional Information (for Tier 2), Ereignis #13950 (483/1019)
Berechne Variable Additional Information (for Tier 2), Ereignis #13951 (484/1019)
Berechne Variable Additional Information (for Tier 2), Ereignis #13952 (485/1019)
Berechne Variable Additional Information (for Tier 2), Ereignis #13953 (486/1019)
Berechne Variable Additional Information (for Tier 2), Ereignis #13954 (487/1019)
Berechne Variable Additional Information (for Tier 2), Ereignis #13955 (488/1019)
Berechne Variable Additional Information (for Tier 2), Ereignis #13956 (489/1019)
Berechne Variable Additional Information (for Tier 2), Ereignis #13957 (490/1019)
Berechne Variable Additional Information (for Tier 2), Ereignis #13958 (491/1019)
Berechne Variable Additional Information (for Tier 2), Ereignis #13959 (492/1019)
Berechne Variable Additional Information (for Tier 2), Ereignis #13960 (493/1019)
Berechne Variable Additional Information (for Tier 2), Ereignis #13961 (494/1019)
Berechne Variable Additional Information (for Tier 2), Ereignis #13962 (495/1019)
Berechne Variable Additional Information (for Tier 2), Ereignis #13963 (496/1019)
Berechne Variable Additional Information (for Tier 2), Ereignis #13964 (497/1019)
Berechne Variable Additional Information (for Tier 2), Ereignis #13965 (498/1019)
Berechne Variable Additional Information (for Tier 2), Ereignis #13966 (499/1019)
Berechne Variable Additional Information (for Tier 2), Ereignis #13967 (500/1019)
Berechne Variable Additional Information (for Tier 2), Ereignis #13968 (501/1019)
Berechne Variable CH4 Emissions, Ereignis #13969 (502/1019)
Berechne Variable CH4 Emissions, Ereignis #13970 (503/1019)
Berechne Variable CH4 Emissions, Ereignis #13971 (504/1019)
Berechne Variable CH4 Emissions, Ereignis #13972 (505/1019)
Berechne Variable CH4 Emissions, Ereignis #13973 (506/1019)
Berechne Variable CH4 Emissions, Ereignis #13975 (507/1019)
Berechne Variable CH4 Emissions, Ereignis #13977 (508/1019)
Berechne Variable CH4 Emissions, Ereignis #13978 (509/1019)
Berechne Variable CH4 Emissions, Ereignis #13979 (510/1019)
Berechne Variable N2O and NMVOC Emissions, Ereignis #13980 (511/1019)
Berechne Variable N2O and NMVOC Emissions, Ereignis #13982 (512/1019)
Berechne Variable N2O and NMVOC Emissions, Ereignis #13983 (513/1019)
Berechne Variable N2O and NMVOC Emissions, Ereignis #13986 (514/1019)
Berechne Variable N2O and NMVOC Emissions, Ereignis #13987 (515/1019)
Berechne Variable N2O and NMVOC Emissions, Ereignis #13988 (516/1019)
Berechne Variable N2O and NMVOC Emissions, Ereignis #13989 (517/1019)
Berechne Variable N2O and NMVOC Emissions, Ereignis #13990 (518/1019)
Berechne Variable N2O and NMVOC Emissions, Ereignis #13991 (519/1019)
Berechne Variable N2O and NMVOC Emissions, Ereignis #13992 (520/1019)
Berechne Variable N2O and NMVOC Emissions, Ereignis #13993 (521/1019)
Berechne Variable N2O and NMVOC Emissions, Ereignis #13994 (522/1019)
Berechne Variable N2O and NMVOC Emissions, Ereignis #13995 (523/1019)
Berechne Variable Additional Information (for Tier 2), Ereignis #13997 (524/1019)
Berechne Variable Additional Information (for Tier 2), Ereignis #13998 (525/1019)
Berechne Variable Additional Information (for Tier 2), Ereignis #13999 (526/1019)
Berechne Variable Additional Information (for Tier 2), Ereignis #14000 (527/1019)
Berechne Variable Additional Information (for Tier 2), Ereignis #14001 (528/1019)
Berechne Variable Additional Information (for Tier 2), Ereignis #14002 (529/1019)
Berechne Variable Additional Information (for Tier 2), Ereignis #14003 (530/1019)
Berechne Variable Additional Information (for Tier 2), Ereignis #14004 (531/1019)
Berechne Variable Additional Information (for Tier 2), Ereignis #14005 (532/1019)
Berechne Variable Additional Information (for Tier 2), Ereignis #14006 (533/1019)
Berechne Variable Additional Information (for Tier 2), Ereignis #14007 (534/1019)
Berechne Variable Additional Information (for Tier 2), Ereignis #14008 (535/1019)
Berechne Variable Additional Information (for Tier 2), Ereignis #14009 (536/1019)
Berechne Variable Additional Information (for Tier 2), Ereignis #14010 (537/1019)
Berechne Variable Additional Information (for Tier 2), Ereignis #14011 (538/1019)
Berechne Variable Additional Information (for Tier 2), Ereignis #14012 (539/1019)
Berechne Variable Additional Information (for Tier 2), Ereignis #14013 (540/1019)
Berechne Variable Additional Information (for Tier 2), Ereignis #14014 (541/1019)
Berechne Variable Additional Information (for Tier 2), Ereignis #14015 (542/1019)
Berechne Variable Additional Information (for Tier 2), Ereignis #14016 (543/1019)
Berechne Variable Additional Information (for Tier 2), Ereignis #14017 (544/1019)
Berechne Variable Additional Information (for Tier 2), Ereignis #14018 (545/1019)
Berechne Variable Additional Information (for Tier 2), Ereignis #14019 (546/1019)
Berechne Variable Additional Information (for Tier 2), Ereignis #14020 (547/1019)
Berechne Variable Additional Information (for Tier 2), Ereignis #14021 (548/1019)
Berechne Variable Additional Information (for Tier 2), Ereignis #14022 (549/1019)
Berechne Variable Additional Information (for Tier 2), Ereignis #14023 (550/1019)
Berechne Variable Additional Information (for Tier 2), Ereignis #14024 (551/1019)
Berechne Variable Additional Information (for Tier 2), Ereignis #14026 (552/1019)
Berechne Variable Additional Information (for Tier 2), Ereignis #14027 (553/1019)
Berechne Variable Additional Information (for Tier 2), Ereignis #14028 (554/1019)
Berechne Variable Additional Information (for Tier 2), Ereignis #14030 (555/1019)
Berechne Variable Additional Information (for Tier 2), Ereignis #14031 (556/1019)
Berechne Variable Additional Information (for Tier 2), Ereignis #14032 (557/1019)
Berechne Variable Additional Information (for Tier 2), Ereignis #14034 (558/1019)
Berechne Variable Additional Information (for Tier 2), Ereignis #14035 (559/1019)
Berechne Variable Additional Information (for Tier 2), Ereignis #14036 (560/1019)
Berechne Variable Additional Information (for Tier 2), Ereignis #14038 (561/1019)
Berechne Variable Additional Information (for Tier 2), Ereignis #14039 (562/1019)
Berechne Variable Additional Information (for Tier 2), Ereignis #14040 (563/1019)
Berechne Variable Additional Information (for Tier 2), Ereignis #14042 (564/1019)
Berechne Variable Additional Information (for Tier 2), Ereignis #14043 (565/1019)
Berechne Variable Additional Information (for Tier 2), Ereignis #14044 (566/1019)
Berechne Variable Additional Information (for Tier 2), Ereignis #14046 (567/1019)
Berechne Variable Additional Information (for Tier 2), Ereignis #14047 (568/1019)
Berechne Variable Additional Information (for Tier 2), Ereignis #14048 (569/1019)
Berechne Variable Additional Information (for Tier 2), Ereignis #14050 (570/1019)
Berechne Variable Additional Information (for Tier 2), Ereignis #14051 (571/1019)
Berechne Variable Additional Information (for Tier 2), Ereignis #14052 (572/1019)
Berechne Variable Additional Information (for Tier 2), Ereignis #14054 (573/1019)
Berechne Variable Additional Information (for Tier 2), Ereignis #14055 (574/1019)
Berechne Variable Additional Information (for Tier 2), Ereignis #14056 (575/1019)
Berechne Variable Additional Information (for Tier 2), Ereignis #14058 (576/1019)
Berechne Variable Additional Information (for Tier 2), Ereignis #14059 (577/1019)
Berechne Variable CH4 Emissions, Ereignis #14060 (578/1019)
Berechne Variable CH4 Emissions, Ereignis #14061 (579/1019)
Berechne Variable CH4 Emissions, Ereignis #14062 (580/1019)
Berechne Variable CH4 Emissions, Ereignis #14063 (581/1019)
Berechne Variable CH4 Emissions, Ereignis #14064 (582/1019)
Berechne Variable CH4 Emissions, Ereignis #14066 (583/1019)
Berechne Variable CH4 Emissions, Ereignis #14068 (584/1019)
Berechne Variable CH4 Emissions, Ereignis #14069 (585/1019)
Berechne Variable CH4 Emissions, Ereignis #14070 (586/1019)
Berechne Variable N2O and NMVOC Emissions, Ereignis #14071 (587/1019)
Berechne Variable N2O and NMVOC Emissions, Ereignis #14073 (588/1019)
Berechne Variable N2O and NMVOC Emissions, Ereignis #14074 (589/1019)
Berechne Variable N2O and NMVOC Emissions, Ereignis #14077 (590/1019)
Berechne Variable N2O and NMVOC Emissions, Ereignis #14078 (591/1019)
Berechne Variable N2O and NMVOC Emissions, Ereignis #14079 (592/1019)
Berechne Variable N2O and NMVOC Emissions, Ereignis #14080 (593/1019)
Berechne Variable N2O and NMVOC Emissions, Ereignis #14081 (594/1019)
Berechne Variable N2O and NMVOC Emissions, Ereignis #14082 (595/1019)
Berechne Variable N2O and NMVOC Emissions, Ereignis #14083 (596/1019)
Berechne Variable N2O and NMVOC Emissions, Ereignis #14084 (597/1019)
Berechne Variable N2O and NMVOC Emissions, Ereignis #14085 (598/1019)
Berechne Variable N2O and NMVOC Emissions, Ereignis #14086 (599/1019)
Berechne Variable Additional Information (for Tier 2), Ereignis #14088 (600/1019)
Berechne Variable Additional Information (for Tier 2), Ereignis #14089 (601/1019)
Berechne Variable Additional Information (for Tier 2), Ereignis #14090 (602/1019)
Berechne Variable Additional Information (for Tier 2), Ereignis #14091 (603/1019)
Berechne Variable Additional Information (for Tier 2), Ereignis #14092 (604/1019)
Berechne Variable Additional Information (for Tier 2), Ereignis #14093 (605/1019)
Berechne Variable Additional Information (for Tier 2), Ereignis #14094 (606/1019)
Berechne Variable Additional Information (for Tier 2), Ereignis #14095 (607/1019)
Berechne Variable Additional Information (for Tier 2), Ereignis #14096 (608/1019)
Berechne Variable Additional Information (for Tier 2), Ereignis #14097 (609/1019)
Berechne Variable Additional Information (for Tier 2), Ereignis #14098 (610/1019)
Berechne Variable Additional Information (for Tier 2), Ereignis #14099 (611/1019)
Berechne Variable Additional Information (for Tier 2), Ereignis #14100 (612/1019)
Berechne Variable Additional Information (for Tier 2), Ereignis #14101 (613/1019)
Berechne Variable Additional Information (for Tier 2), Ereignis #14102 (614/1019)
Berechne Variable Additional Information (for Tier 2), Ereignis #14103 (615/1019)
Berechne Variable Additional Information (for Tier 2), Ereignis #14104 (616/1019)
Berechne Variable Additional Information (for Tier 2), Ereignis #14105 (617/1019)
Berechne Variable Additional Information (for Tier 2), Ereignis #14106 (618/1019)
Berechne Variable Additional Information (for Tier 2), Ereignis #14107 (619/1019)
Berechne Variable Additional Information (for Tier 2), Ereignis #14108 (620/1019)
Berechne Variable Additional Information (for Tier 2), Ereignis #14109 (621/1019)
Berechne Variable Additional Information (for Tier 2), Ereignis #14110 (622/1019)
Berechne Variable Additional Information (for Tier 2), Ereignis #14111 (623/1019)
Berechne Variable Additional Information (for Tier 2), Ereignis #14112 (624/1019)
Berechne Variable Additional Information (for Tier 2), Ereignis #14113 (625/1019)
Berechne Variable Additional Information (for Tier 2), Ereignis #14114 (626/1019)
Berechne Variable Additional Information (for Tier 2), Ereignis #14115 (627/1019)
Berechne Variable Additional Information (for Tier 2), Ereignis #14116 (628/1019)
Berechne Variable Additional Information (for Tier 2), Ereignis #14117 (629/1019)
Berechne Variable Additional Information (for Tier 2), Ereignis #14118 (630/1019)
Berechne Variable Additional Information (for Tier 2), Ereignis #14119 (631/1019)
Berechne Variable Additional Information (for Tier 2), Ereignis #14120 (632/1019)
Berechne Variable Additional Information (for Tier 2), Ereignis #14121 (633/1019)
Berechne Variable Additional Information (for Tier 2), Ereignis #14122 (634/1019)
Berechne Variable Additional Information (for Tier 2), Ereignis #14123 (635/1019)
Berechne Variable Additional Information (for Tier 2), Ereignis #14124 (636/1019)
Berechne Variable Additional Information (for Tier 2), Ereignis #14125 (637/1019)
Berechne Variable Additional Information (for Tier 2), Ereignis #14126 (638/1019)
Berechne Variable Additional Information (for Tier 2), Ereignis #14127 (639/1019)
Berechne Variable Additional Information (for Tier 2), Ereignis #14128 (640/1019)
Berechne Variable Additional Information (for Tier 2), Ereignis #14129 (641/1019)
Berechne Variable Additional Information (for Tier 2), Ereignis #14130 (642/1019)
Berechne Variable Additional Information (for Tier 2), Ereignis #14131 (643/1019)
Berechne Variable Additional Information (for Tier 2), Ereignis #14132 (644/1019)
Berechne Variable Additional Information (for Tier 2), Ereignis #14133 (645/1019)
Berechne Variable Additional Information (for Tier 2), Ereignis #14134 (646/1019)
Berechne Variable Additional Information (for Tier 2), Ereignis #14135 (647/1019)
Berechne Variable Additional Information (for Tier 2), Ereignis #14136 (648/1019)
Berechne Variable Additional Information (for Tier 2), Ereignis #14137 (649/1019)
Berechne Variable Additional Information (for Tier 2), Ereignis #14138 (650/1019)
Berechne Variable Additional Information (for Tier 2), Ereignis #14139 (651/1019)
Berechne Variable Additional Information (for Tier 2), Ereignis #14140 (652/1019)
Berechne Variable Additional Information (for Tier 2), Ereignis #14141 (653/1019)
Berechne Variable CH4 Emissions, Ereignis #14142 (654/1019)
Berechne Variable CH4 Emissions, Ereignis #14143 (655/1019)
Berechne Variable CH4 Emissions, Ereignis #14144 (656/1019)
Berechne Variable CH4 Emissions, Ereignis #14145 (657/1019)
Berechne Variable CH4 Emissions, Ereignis #14148 (658/1019)
Berechne Variable CH4 Emissions, Ereignis #14150 (659/1019)
Berechne Variable CH4 Emissions, Ereignis #14151 (660/1019)
Berechne Variable CH4 Emissions, Ereignis #14152 (661/1019)
Berechne Variable N2O and NMVOC Emissions, Ereignis #14155 (662/1019)
Berechne Variable N2O and NMVOC Emissions, Ereignis #14156 (663/1019)
Berechne Variable N2O and NMVOC Emissions, Ereignis #14159 (664/1019)
Berechne Variable N2O and NMVOC Emissions, Ereignis #14160 (665/1019)
Berechne Variable N2O and NMVOC Emissions, Ereignis #14161 (666/1019)
Berechne Variable N2O and NMVOC Emissions, Ereignis #14162 (667/1019)
Berechne Variable N2O and NMVOC Emissions, Ereignis #14163 (668/1019)
Berechne Variable N2O and NMVOC Emissions, Ereignis #14164 (669/1019)
Berechne Variable N2O and NMVOC Emissions, Ereignis #14165 (670/1019)
Berechne Variable N2O and NMVOC Emissions, Ereignis #14166 (671/1019)
Berechne Variable N2O and NMVOC Emissions, Ereignis #14167 (672/1019)
Berechne Variable N2O and NMVOC Emissions, Ereignis #14168 (673/1019)
Berechne Variable CH4 Emissions, Ereignis #14172 (674/1019)
Berechne Variable CH4 Emissions, Ereignis #14174 (675/1019)
Berechne Variable CH4 Emissions, Ereignis #14175 (676/1019)
Berechne Variable N2O and NMVOC Emissions, Ereignis #14178 (677/1019)
Berechne Variable N2O and NMVOC Emissions, Ereignis #14179 (678/1019)
Berechne Variable N2O and NMVOC Emissions, Ereignis #14182 (679/1019)
Berechne Variable N2O and NMVOC Emissions, Ereignis #14183 (680/1019)
Berechne Variable N2O and NMVOC Emissions, Ereignis #14184 (681/1019)
Berechne Variable N2O and NMVOC Emissions, Ereignis #14185 (682/1019)
Berechne Variable N2O and NMVOC Emissions, Ereignis #14186 (683/1019)
Berechne Variable N2O and NMVOC Emissions, Ereignis #14187 (684/1019)
Berechne Variable N2O and NMVOC Emissions, Ereignis #14188 (685/1019)
Berechne Variable N2O and NMVOC Emissions, Ereignis #14189 (686/1019)
Berechne Variable N2O and NMVOC Emissions, Ereignis #14190 (687/1019)
Berechne Variable N2O and NMVOC Emissions, Ereignis #14191 (688/1019)
Berechne Variable CH4 Emissions, Ereignis #14195 (689/1019)
Berechne Variable CH4 Emissions, Ereignis #14197 (690/1019)
Berechne Variable CH4 Emissions, Ereignis #14198 (691/1019)
Berechne Variable N2O and NMVOC Emissions, Ereignis #14201 (692/1019)
Berechne Variable N2O and NMVOC Emissions, Ereignis #14202 (693/1019)
Berechne Variable N2O and NMVOC Emissions, Ereignis #14205 (694/1019)
Berechne Variable N2O and NMVOC Emissions, Ereignis #14206 (695/1019)
Berechne Variable N2O and NMVOC Emissions, Ereignis #14207 (696/1019)
Berechne Variable N2O and NMVOC Emissions, Ereignis #14208 (697/1019)
Berechne Variable N2O and NMVOC Emissions, Ereignis #14209 (698/1019)
Berechne Variable N2O and NMVOC Emissions, Ereignis #14210 (699/1019)
Berechne Variable N2O and NMVOC Emissions, Ereignis #14211 (700/1019)
Berechne Variable N2O and NMVOC Emissions, Ereignis #14212 (701/1019)
Berechne Variable N2O and NMVOC Emissions, Ereignis #14213 (702/1019)
Berechne Variable N2O and NMVOC Emissions, Ereignis #14214 (703/1019)
Berechne Variable CH4 Emissions, Ereignis #14220 (704/1019)
Berechne Variable Additional Information (for Tier 2), Ereignis #14239 (705/1019)
Berechne Variable Additional Information (for Tier 2), Ereignis #14240 (706/1019)
Berechne Variable Additional Information (for Tier 2), Ereignis #14241 (707/1019)
Berechne Variable Additional Information (for Tier 2), Ereignis #14242 (708/1019)
Berechne Variable Additional Information (for Tier 2), Ereignis #14243 (709/1019)
Berechne Variable Additional Information (for Tier 2), Ereignis #14244 (710/1019)
Berechne Variable Additional Information (for Tier 2), Ereignis #14245 (711/1019)
Berechne Variable Additional Information (for Tier 2), Ereignis #14246 (712/1019)
Berechne Variable Additional Information (for Tier 2), Ereignis #14247 (713/1019)
Berechne Variable Additional Information (for Tier 2), Ereignis #14248 (714/1019)
Berechne Variable Additional Information (for Tier 2), Ereignis #14249 (715/1019)
Berechne Variable Additional Information (for Tier 2), Ereignis #14250 (716/1019)
Berechne Variable Additional Information (for Tier 2), Ereignis #14251 (717/1019)
Berechne Variable Additional Information (for Tier 2), Ereignis #14252 (718/1019)
Berechne Variable Additional Information (for Tier 2), Ereignis #14253 (719/1019)
Berechne Variable Additional Information (for Tier 2), Ereignis #14254 (720/1019)
Berechne Variable Additional Information (for Tier 2), Ereignis #14255 (721/1019)
Berechne Variable Additional Information (for Tier 2), Ereignis #14256 (722/1019)
Berechne Variable Additional Information (for Tier 2), Ereignis #14257 (723/1019)
Berechne Variable Additional Information (for Tier 2), Ereignis #14258 (724/1019)
Berechne Variable Additional Information (for Tier 2), Ereignis #14259 (725/1019)
Berechne Variable Additional Information (for Tier 2), Ereignis #14260 (726/1019)
Berechne Variable Additional Information (for Tier 2), Ereignis #14261 (727/1019)
Berechne Variable Additional Information (for Tier 2), Ereignis #14262 (728/1019)
Berechne Variable Additional Information (for Tier 2), Ereignis #14263 (729/1019)
Berechne Variable Additional Information (for Tier 2), Ereignis #14264 (730/1019)
Berechne Variable Additional Information (for Tier 2), Ereignis #14265 (731/1019)
Berechne Variable Additional Information (for Tier 2), Ereignis #14266 (732/1019)
Berechne Variable Additional Information (for Tier 2), Ereignis #14267 (733/1019)
Berechne Variable Additional Information (for Tier 2), Ereignis #14268 (734/1019)
Berechne Variable Additional Information (for Tier 2), Ereignis #14269 (735/1019)
Berechne Variable Additional Information (for Tier 2), Ereignis #14270 (736/1019)
Berechne Variable Additional Information (for Tier 2), Ereignis #14271 (737/1019)
Berechne Variable Additional Information (for Tier 2), Ereignis #14272 (738/1019)
Berechne Variable Additional Information (for Tier 2), Ereignis #14273 (739/1019)
Berechne Variable Additional Information (for Tier 2), Ereignis #14274 (740/1019)
Berechne Variable Additional Information (for Tier 2), Ereignis #14275 (741/1019)
Berechne Variable Additional Information (for Tier 2), Ereignis #14276 (742/1019)
Berechne Variable Additional Information (for Tier 2), Ereignis #14277 (743/1019)
Berechne Variable Additional Information (for Tier 2), Ereignis #14278 (744/1019)
Berechne Variable Additional Information (for Tier 2), Ereignis #14279 (745/1019)
Berechne Variable Additional Information (for Tier 2), Ereignis #14280 (746/1019)
Berechne Variable Additional Information (for Tier 2), Ereignis #14281 (747/1019)
Berechne Variable Additional Information (for Tier 2), Ereignis #14282 (748/1019)
Berechne Variable Additional Information (for Tier 2), Ereignis #14283 (749/1019)
Berechne Variable Additional Information (for Tier 2), Ereignis #14284 (750/1019)
Berechne Variable Additional Information (for Tier 2), Ereignis #14285 (751/1019)
Berechne Variable Additional Information (for Tier 2), Ereignis #14286 (752/1019)
Berechne Variable Additional Information (for Tier 2), Ereignis #14287 (753/1019)
Berechne Variable Additional Information (for Tier 2), Ereignis #14288 (754/1019)
Berechne Variable Additional Information (for Tier 2), Ereignis #14289 (755/1019)
Berechne Variable Additional Information (for Tier 2), Ereignis #14290 (756/1019)
Berechne Variable Additional Information (for Tier 2), Ereignis #14291 (757/1019)
Berechne Variable Additional Information (for Tier 2), Ereignis #14292 (758/1019)
Berechne Variable CH4 Emissions, Ereignis #14293 (759/1019)
Berechne Variable CH4 Emissions, Ereignis #14294 (760/1019)
Berechne Variable CH4 Emissions, Ereignis #14295 (761/1019)
Berechne Variable CH4 Emissions, Ereignis #14296 (762/1019)
Berechne Variable CH4 Emissions, Ereignis #14299 (763/1019)
Berechne Variable CH4 Emissions, Ereignis #14301 (764/1019)
Berechne Variable CH4 Emissions, Ereignis #14302 (765/1019)
Berechne Variable CH4 Emissions, Ereignis #14303 (766/1019)
Berechne Variable N2O and NMVOC Emissions, Ereignis #14306 (767/1019)
Berechne Variable N2O and NMVOC Emissions, Ereignis #14307 (768/1019)
Berechne Variable N2O and NMVOC Emissions, Ereignis #14310 (769/1019)
Berechne Variable N2O and NMVOC Emissions, Ereignis #14311 (770/1019)
Berechne Variable N2O and NMVOC Emissions, Ereignis #14312 (771/1019)
Berechne Variable N2O and NMVOC Emissions, Ereignis #14313 (772/1019)
Berechne Variable N2O and NMVOC Emissions, Ereignis #14314 (773/1019)
Berechne Variable N2O and NMVOC Emissions, Ereignis #14315 (774/1019)
Berechne Variable N2O and NMVOC Emissions, Ereignis #14316 (775/1019)
Berechne Variable N2O and NMVOC Emissions, Ereignis #14317 (776/1019)
Berechne Variable N2O and NMVOC Emissions, Ereignis #14318 (777/1019)
Berechne Variable N2O and NMVOC Emissions, Ereignis #14319 (778/1019)
Berechne Variable CH4 Emissions, Ereignis #14325 (779/1019)
Berechne Variable Additional Information (for Tier 2), Ereignis #14344 (780/1019)
Berechne Variable Additional Information (for Tier 2), Ereignis #14345 (781/1019)
Berechne Variable Additional Information (for Tier 2), Ereignis #14346 (782/1019)
Berechne Variable Additional Information (for Tier 2), Ereignis #14347 (783/1019)
Berechne Variable Additional Information (for Tier 2), Ereignis #14348 (784/1019)
Berechne Variable Additional Information (for Tier 2), Ereignis #14349 (785/1019)
Berechne Variable Additional Information (for Tier 2), Ereignis #14350 (786/1019)
Berechne Variable Additional Information (for Tier 2), Ereignis #14351 (787/1019)
Berechne Variable Additional Information (for Tier 2), Ereignis #14352 (788/1019)
Berechne Variable Additional Information (for Tier 2), Ereignis #14353 (789/1019)
Berechne Variable Additional Information (for Tier 2), Ereignis #14354 (790/1019)
Berechne Variable Additional Information (for Tier 2), Ereignis #14355 (791/1019)
Berechne Variable Additional Information (for Tier 2), Ereignis #14356 (792/1019)
Berechne Variable Additional Information (for Tier 2), Ereignis #14357 (793/1019)
Berechne Variable Additional Information (for Tier 2), Ereignis #14358 (794/1019)
Berechne Variable Additional Information (for Tier 2), Ereignis #14359 (795/1019)
Berechne Variable Additional Information (for Tier 2), Ereignis #14360 (796/1019)
Berechne Variable Additional Information (for Tier 2), Ereignis #14361 (797/1019)
Berechne Variable Additional Information (for Tier 2), Ereignis #14362 (798/1019)
Berechne Variable Additional Information (for Tier 2), Ereignis #14363 (799/1019)
Berechne Variable Additional Information (for Tier 2), Ereignis #14364 (800/1019)
Berechne Variable Additional Information (for Tier 2), Ereignis #14365 (801/1019)
Berechne Variable Additional Information (for Tier 2), Ereignis #14366 (802/1019)
Berechne Variable Additional Information (for Tier 2), Ereignis #14367 (803/1019)
Berechne Variable Additional Information (for Tier 2), Ereignis #14368 (804/1019)
Berechne Variable Additional Information (for Tier 2), Ereignis #14369 (805/1019)
Berechne Variable Additional Information (for Tier 2), Ereignis #14370 (806/1019)
Berechne Variable Additional Information (for Tier 2), Ereignis #14371 (807/1019)
Berechne Variable Additional Information (for Tier 2), Ereignis #14372 (808/1019)
Berechne Variable Additional Information (for Tier 2), Ereignis #14373 (809/1019)
Berechne Variable Additional Information (for Tier 2), Ereignis #14374 (810/1019)
Berechne Variable Additional Information (for Tier 2), Ereignis #14375 (811/1019)
Berechne Variable Additional Information (for Tier 2), Ereignis #14376 (812/1019)
Berechne Variable Additional Information (for Tier 2), Ereignis #14377 (813/1019)
Berechne Variable Additional Information (for Tier 2), Ereignis #14378 (814/1019)
Berechne Variable Additional Information (for Tier 2), Ereignis #14379 (815/1019)
Berechne Variable Additional Information (for Tier 2), Ereignis #14380 (816/1019)
Berechne Variable Additional Information (for Tier 2), Ereignis #14381 (817/1019)
Berechne Variable Additional Information (for Tier 2), Ereignis #14382 (818/1019)
Berechne Variable Additional Information (for Tier 2), Ereignis #14383 (819/1019)
Berechne Variable Additional Information (for Tier 2), Ereignis #14384 (820/1019)
Berechne Variable Additional Information (for Tier 2), Ereignis #14385 (821/1019)
Berechne Variable Additional Information (for Tier 2), Ereignis #14386 (822/1019)
Berechne Variable Additional Information (for Tier 2), Ereignis #14387 (823/1019)
Berechne Variable Additional Information (for Tier 2), Ereignis #14388 (824/1019)
Berechne Variable Additional Information (for Tier 2), Ereignis #14389 (825/1019)
Berechne Variable Additional Information (for Tier 2), Ereignis #14390 (826/1019)
Berechne Variable Additional Information (for Tier 2), Ereignis #14391 (827/1019)
Berechne Variable Additional Information (for Tier 2), Ereignis #14392 (828/1019)
Berechne Variable Additional Information (for Tier 2), Ereignis #14393 (829/1019)
Berechne Variable Additional Information (for Tier 2), Ereignis #14394 (830/1019)
Berechne Variable Additional Information (for Tier 2), Ereignis #14395 (831/1019)
Berechne Variable Additional Information (for Tier 2), Ereignis #14396 (832/1019)
Berechne Variable Additional Information (for Tier 2), Ereignis #14397 (833/1019)
Berechne Variable CH4 Emissions, Ereignis #14398 (834/1019)
Berechne Variable CH4 Emissions, Ereignis #14399 (835/1019)
Berechne Variable CH4 Emissions, Ereignis #14400 (836/1019)
Berechne Variable CH4 Emissions, Ereignis #14401 (837/1019)
Berechne Variable CH4 Emissions, Ereignis #14404 (838/1019)
Berechne Variable CH4 Emissions, Ereignis #14406 (839/1019)
Berechne Variable CH4 Emissions, Ereignis #14407 (840/1019)
Berechne Variable CH4 Emissions, Ereignis #14408 (841/1019)
Berechne Variable N2O and NMVOC Emissions, Ereignis #14411 (842/1019)
Berechne Variable N2O and NMVOC Emissions, Ereignis #14412 (843/1019)
Berechne Variable N2O and NMVOC Emissions, Ereignis #14415 (844/1019)
Berechne Variable N2O and NMVOC Emissions, Ereignis #14416 (845/1019)
Berechne Variable N2O and NMVOC Emissions, Ereignis #14417 (846/1019)
Berechne Variable N2O and NMVOC Emissions, Ereignis #14418 (847/1019)
Berechne Variable N2O and NMVOC Emissions, Ereignis #14419 (848/1019)
Berechne Variable N2O and NMVOC Emissions, Ereignis #14420 (849/1019)
Berechne Variable N2O and NMVOC Emissions, Ereignis #14421 (850/1019)
Berechne Variable N2O and NMVOC Emissions, Ereignis #14422 (851/1019)
Berechne Variable N2O and NMVOC Emissions, Ereignis #14423 (852/1019)
Berechne Variable N2O and NMVOC Emissions, Ereignis #14424 (853/1019)
Berechne Variable Additional Information (for Tier 2), Ereignis #14426 (854/1019)
Berechne Variable Additional Information (for Tier 2), Ereignis #14427 (855/1019)
Berechne Variable Additional Information (for Tier 2), Ereignis #14428 (856/1019)
Berechne Variable Additional Information (for Tier 2), Ereignis #14429 (857/1019)
Berechne Variable Additional Information (for Tier 2), Ereignis #14430 (858/1019)
Berechne Variable Additional Information (for Tier 2), Ereignis #14431 (859/1019)
Berechne Variable Additional Information (for Tier 2), Ereignis #14432 (860/1019)
Berechne Variable Additional Information (for Tier 2), Ereignis #14433 (861/1019)
Berechne Variable Additional Information (for Tier 2), Ereignis #14434 (862/1019)
Berechne Variable Additional Information (for Tier 2), Ereignis #14435 (863/1019)
Berechne Variable Additional Information (for Tier 2), Ereignis #14436 (864/1019)
Berechne Variable Additional Information (for Tier 2), Ereignis #14437 (865/1019)
Berechne Variable Additional Information (for Tier 2), Ereignis #14438 (866/1019)
Berechne Variable Additional Information (for Tier 2), Ereignis #14439 (867/1019)
Berechne Variable Additional Information (for Tier 2), Ereignis #14440 (868/1019)
Berechne Variable Additional Information (for Tier 2), Ereignis #14441 (869/1019)
Berechne Variable Additional Information (for Tier 2), Ereignis #14442 (870/1019)
Berechne Variable Additional Information (for Tier 2), Ereignis #14443 (871/1019)
Berechne Variable Additional Information (for Tier 2), Ereignis #14444 (872/1019)
Berechne Variable Additional Information (for Tier 2), Ereignis #14445 (873/1019)
Berechne Variable Additional Information (for Tier 2), Ereignis #14446 (874/1019)
Berechne Variable Additional Information (for Tier 2), Ereignis #14447 (875/1019)
Berechne Variable Additional Information (for Tier 2), Ereignis #14448 (876/1019)
Berechne Variable Additional Information (for Tier 2), Ereignis #14449 (877/1019)
Berechne Variable Additional Information (for Tier 2), Ereignis #14450 (878/1019)
Berechne Variable Additional Information (for Tier 2), Ereignis #14451 (879/1019)
Berechne Variable Additional Information (for Tier 2), Ereignis #14452 (880/1019)
Berechne Variable Additional Information (for Tier 2), Ereignis #14453 (881/1019)
Berechne Variable Additional Information (for Tier 2), Ereignis #14454 (882/1019)
Berechne Variable Additional Information (for Tier 2), Ereignis #14455 (883/1019)
Berechne Variable Additional Information (for Tier 2), Ereignis #14456 (884/1019)
Berechne Variable Additional Information (for Tier 2), Ereignis #14457 (885/1019)
Berechne Variable Additional Information (for Tier 2), Ereignis #14458 (886/1019)
Berechne Variable Additional Information (for Tier 2), Ereignis #14459 (887/1019)
Berechne Variable Additional Information (for Tier 2), Ereignis #14460 (888/1019)
Berechne Variable Additional Information (for Tier 2), Ereignis #14461 (889/1019)
Berechne Variable Additional Information (for Tier 2), Ereignis #14462 (890/1019)
Berechne Variable Additional Information (for Tier 2), Ereignis #14463 (891/1019)
Berechne Variable Additional Information (for Tier 2), Ereignis #14464 (892/1019)
Berechne Variable Additional Information (for Tier 2), Ereignis #14465 (893/1019)
Berechne Variable Additional Information (for Tier 2), Ereignis #14466 (894/1019)
Berechne Variable Additional Information (for Tier 2), Ereignis #14467 (895/1019)
Berechne Variable Additional Information (for Tier 2), Ereignis #14468 (896/1019)
Berechne Variable Additional Information (for Tier 2), Ereignis #14469 (897/1019)
Berechne Variable Additional Information (for Tier 2), Ereignis #14470 (898/1019)
Berechne Variable Additional Information (for Tier 2), Ereignis #14471 (899/1019)
Berechne Variable Additional Information (for Tier 2), Ereignis #14472 (900/1019)
Berechne Variable Additional Information (for Tier 2), Ereignis #14473 (901/1019)
Berechne Variable Additional Information (for Tier 2), Ereignis #14474 (902/1019)
Berechne Variable Additional Information (for Tier 2), Ereignis #14475 (903/1019)
Berechne Variable Additional Information (for Tier 2), Ereignis #14476 (904/1019)
Berechne Variable Additional Information (for Tier 2), Ereignis #14477 (905/1019)
Berechne Variable Additional Information (for Tier 2), Ereignis #14478 (906/1019)
Berechne Variable Additional Information (for Tier 2), Ereignis #14479 (907/1019)
Berechne Variable CH4 Emissions, Ereignis #14480 (908/1019)
Berechne Variable CH4 Emissions, Ereignis #14481 (909/1019)
Berechne Variable CH4 Emissions, Ereignis #14482 (910/1019)
Berechne Variable CH4 Emissions, Ereignis #14483 (911/1019)
Berechne Variable CH4 Emissions, Ereignis #14486 (912/1019)
Berechne Variable CH4 Emissions, Ereignis #14488 (913/1019)
Berechne Variable CH4 Emissions, Ereignis #14489 (914/1019)
Berechne Variable CH4 Emissions, Ereignis #14490 (915/1019)
Berechne Variable N2O and NMVOC Emissions, Ereignis #14493 (916/1019)
Berechne Variable N2O and NMVOC Emissions, Ereignis #14494 (917/1019)
Berechne Variable N2O and NMVOC Emissions, Ereignis #14497 (918/1019)
Berechne Variable N2O and NMVOC Emissions, Ereignis #14498 (919/1019)
Berechne Variable N2O and NMVOC Emissions, Ereignis #14499 (920/1019)
Berechne Variable N2O and NMVOC Emissions, Ereignis #14500 (921/1019)
Berechne Variable N2O and NMVOC Emissions, Ereignis #14501 (922/1019)
Berechne Variable N2O and NMVOC Emissions, Ereignis #14502 (923/1019)
Berechne Variable N2O and NMVOC Emissions, Ereignis #14503 (924/1019)
Berechne Variable N2O and NMVOC Emissions, Ereignis #14504 (925/1019)
Berechne Variable N2O and NMVOC Emissions, Ereignis #14505 (926/1019)
Berechne Variable N2O and NMVOC Emissions, Ereignis #14506 (927/1019)
Berechne Variable Additional Information (for Tier 2), Ereignis #14508 (928/1019)
Berechne Variable Additional Information (for Tier 2), Ereignis #14509 (929/1019)
Berechne Variable Additional Information (for Tier 2), Ereignis #14510 (930/1019)
Berechne Variable Additional Information (for Tier 2), Ereignis #14511 (931/1019)
Berechne Variable Additional Information (for Tier 2), Ereignis #14512 (932/1019)
Berechne Variable Additional Information (for Tier 2), Ereignis #14513 (933/1019)
Berechne Variable Additional Information (for Tier 2), Ereignis #14514 (934/1019)
Berechne Variable Additional Information (for Tier 2), Ereignis #14515 (935/1019)
Berechne Variable Additional Information (for Tier 2), Ereignis #14516 (936/1019)
Berechne Variable Additional Information (for Tier 2), Ereignis #14517 (937/1019)
Berechne Variable Additional Information (for Tier 2), Ereignis #14518 (938/1019)
Berechne Variable Additional Information (for Tier 2), Ereignis #14519 (939/1019)
Berechne Variable Additional Information (for Tier 2), Ereignis #14520 (940/1019)
Berechne Variable Additional Information (for Tier 2), Ereignis #14521 (941/1019)
Berechne Variable Additional Information (for Tier 2), Ereignis #14522 (942/1019)
Berechne Variable Additional Information (for Tier 2), Ereignis #14523 (943/1019)
Berechne Variable Additional Information (for Tier 2), Ereignis #14524 (944/1019)
Berechne Variable Additional Information (for Tier 2), Ereignis #14525 (945/1019)
Berechne Variable Additional Information (for Tier 2), Ereignis #14526 (946/1019)
Berechne Variable Additional Information (for Tier 2), Ereignis #14527 (947/1019)
Berechne Variable Additional Information (for Tier 2), Ereignis #14528 (948/1019)
Berechne Variable Additional Information (for Tier 2), Ereignis #14529 (949/1019)
Berechne Variable Additional Information (for Tier 2), Ereignis #14530 (950/1019)
Berechne Variable Additional Information (for Tier 2), Ereignis #14531 (951/1019)
Berechne Variable Additional Information (for Tier 2), Ereignis #14532 (952/1019)
Berechne Variable Additional Information (for Tier 2), Ereignis #14533 (953/1019)
Berechne Variable Additional Information (for Tier 2), Ereignis #14534 (954/1019)
Berechne Variable Additional Information (for Tier 2), Ereignis #14535 (955/1019)
Berechne Variable Additional Information (for Tier 2), Ereignis #14536 (956/1019)
Berechne Variable Additional Information (for Tier 2), Ereignis #14537 (957/1019)
Berechne Variable Additional Information (for Tier 2), Ereignis #14538 (958/1019)
Berechne Variable Additional Information (for Tier 2), Ereignis #14539 (959/1019)
Berechne Variable Additional Information (for Tier 2), Ereignis #14540 (960/1019)
Berechne Variable Additional Information (for Tier 2), Ereignis #14541 (961/1019)
Berechne Variable Additional Information (for Tier 2), Ereignis #14542 (962/1019)
Berechne Variable Additional Information (for Tier 2), Ereignis #14543 (963/1019)
Berechne Variable Additional Information (for Tier 2), Ereignis #14544 (964/1019)
Berechne Variable Additional Information (for Tier 2), Ereignis #14545 (965/1019)
Berechne Variable Additional Information (for Tier 2), Ereignis #14546 (966/1019)
Berechne Variable Additional Information (for Tier 2), Ereignis #14547 (967/1019)
Berechne Variable Additional Information (for Tier 2), Ereignis #14548 (968/1019)
Berechne Variable Additional Information (for Tier 2), Ereignis #14549 (969/1019)
Berechne Variable Additional Information (for Tier 2), Ereignis #14550 (970/1019)
Berechne Variable Additional Information (for Tier 2), Ereignis #14551 (971/1019)
Berechne Variable Additional Information (for Tier 2), Ereignis #14552 (972/1019)
Berechne Variable Additional Information (for Tier 2), Ereignis #14553 (973/1019)
Berechne Variable Additional Information (for Tier 2), Ereignis #14554 (974/1019)
Berechne Variable Additional Information (for Tier 2), Ereignis #14555 (975/1019)
Berechne Variable Additional Information (for Tier 2), Ereignis #14556 (976/1019)
Berechne Variable Additional Information (for Tier 2), Ereignis #14557 (977/1019)
Berechne Variable Additional Information (for Tier 2), Ereignis #14558 (978/1019)
Berechne Variable Additional Information (for Tier 2), Ereignis #14559 (979/1019)
Berechne Variable Additional Information (for Tier 2), Ereignis #14560 (980/1019)
Berechne Variable Additional Information (for Tier 2), Ereignis #14561 (981/1019)
Berechne Variable CH4 Emissions, Ereignis #14562 (982/1019)
Berechne Variable CH4 Emissions, Ereignis #14563 (983/1019)
Berechne Variable CH4 Emissions, Ereignis #14564 (984/1019)
Berechne Variable CH4 Emissions, Ereignis #14565 (985/1019)
Berechne Variable CH4 Emissions, Ereignis #14568 (986/1019)
Berechne Variable CH4 Emissions, Ereignis #14570 (987/1019)
Berechne Variable CH4 Emissions, Ereignis #14571 (988/1019)
Berechne Variable CH4 Emissions, Ereignis #14572 (989/1019)
Berechne Variable N2O and NMVOC Emissions, Ereignis #14575 (990/1019)
Berechne Variable N2O and NMVOC Emissions, Ereignis #14576 (991/1019)
Berechne Variable N2O and NMVOC Emissions, Ereignis #14579 (992/1019)
Berechne Variable N2O and NMVOC Emissions, Ereignis #14580 (993/1019)
Berechne Variable N2O and NMVOC Emissions, Ereignis #14581 (994/1019)
Berechne Variable N2O and NMVOC Emissions, Ereignis #14582 (995/1019)
Berechne Variable N2O and NMVOC Emissions, Ereignis #14583 (996/1019)
Berechne Variable N2O and NMVOC Emissions, Ereignis #14584 (997/1019)
Berechne Variable N2O and NMVOC Emissions, Ereignis #14585 (998/1019)
Berechne Variable N2O and NMVOC Emissions, Ereignis #14586 (999/1019)
Berechne Variable N2O and NMVOC Emissions, Ereignis #14587 (1000/1019)
Berechne Variable N2O and NMVOC Emissions, Ereignis #14588 (1001/1019)
Berechne Variable CH4 Emissions, Ereignis #14594 (1002/1019)
Berechne Variable N2O and NMVOC Emissions, Ereignis #14599 (1003/1019)
Berechne Variable CH4 Emissions, Ereignis #14613 (1004/1019)
Berechne Variable CH4 Emissions, Ereignis #14617 (1005/1019)
Berechne Variable N2O and NMVOC Emissions, Ereignis #14619 (1006/1019)
Berechne Variable 3.B NOx emissions, Ereignis #19051 (1007/1019)
Berechne Variable 3.B NOx emissions, Ereignis #19058 (1008/1019)
Berechne Variable 3.B NOx emissions, Ereignis #19061 (1009/1019)
Berechne Variable 3.B NOx emissions, Ereignis #19063 (1010/1019)
Berechne Variable 3.B NOx emissions, Ereignis #19064 (1011/1019)
Berechne Variable 3.B NOx emissions, Ereignis #19065 (1012/1019)
Berechne Variable N2O Emissions per MMS, Ereignis #29407 (1013/1019)
Berechne Variable N2O Emissions per MMS, Ereignis #29408 (1014/1019)
Berechne Variable N2O Emissions per MMS, Ereignis #29409 (1015/1019)
Berechne Variable N2O Emissions per MMS, Ereignis #29410 (1016/1019)
Berechne Variable N2O Emissions per MMS, Ereignis #29411 (1017/1019)
Berechne Variable N2O Emissions per MMS, Ereignis #29412 (1018/1019)
Berechne Variable N2O Emissions per MMS, Ereignis #29413 (1019/1019)
Datei '\\tsclient\c\Program Files\Housesoft\Zentrales System Emissionen\tables\data\crf_exporter\reporter_import_files\Submission 2024\import files\3 Agriculture\3B.xml' wurde geschrieben (33627 Werte).
Vorgang beendet (00:49:33.0779157)
