REGION;CATEGORY;TYPE;SUBSTANCE;UNIT;1980;1981;1982;1983;1984;1985;1986;1987;1988;1989
FR;1A1a;EM;NOx;kt;302,188117411445;241,465708476768;251,312867282698;240,167006836788;192,378501366327;170,456251761315;117,940906912845;123,857459905318;100,503211777121;135,675053785386
FR;1A1b;EM;NOx;kt;29,36450708;24,55815192;23,46807292;22,7189906;22,00674188;20,63011084;20,26575548;20,5964234;21,20997976;19,45811728
FR;1A1c;EM;NOx;kt;19,1989686754363;18,2862069704797;16,912195632154;15,4939651242188;16,2274954689876;15,4361264602274;13,7370157916539;12,4401581403221;11,4709318704722;10,7319709534476
FR;1A2a;EM;NOx;kt;39,6477368407482;33,9814500781482;29,0226670783004;25,0317896975156;26,2864403868701;24,6013246468628;22,3520416090138;19,8624124362657;23,7611042137105;21,7411937930224
FR;1A2b;EM;NOx;kt;0,422857930986119;0,402730201448623;0,451697417062264;0,438935758088221;0,446504803295288;0,465278425538546;0,468368315038989;0,506134874909824;0,539244755874597;0,590534189763155
FR;1A2c;EM;NOx;kt;0,0871735884709834;0,0815347872565911;0,0852939880661859;0,0921288986290857;0,0962013661728134;0,0998466518063599;0,103093234323737;0,108817471920166;0,112092533231555;0,117645898063911
FR;1A2d;EM;NOx;kt;IE;IE;IE;IE;IE;IE;IE;IE;IE;IE
FR;1A2e;EM;NOx;kt;0,218211812813653;0,209922960733743;0,19091462927569;0,194773613597658;0,199547426584829;0,18220551165447;0,167526462318363;0,156668874874165;0,210261390650237;0,210191002685703
FR;1A2f;EM;NOx;kt;117,572601357506;107,189253040748;89,2172816119684;88,7968823100826;89,5683447480489;86,7571043150128;81,2981006437237;81,5253421881835;77,7167738593905;74,700086644316
FR;1A2gvii;EM;NOx;kt;58,0834128560716;57,6752049619837;50,4681492068432;45,8107573824649;47,0354088512593;44,4833696660647;43,7731228420086;44,4721712900501;44,7849551870679;44,2481664687018
FR;1A2gviii;EM;NOx;kt;113,121835510765;100,02344788146;95,9072492351108;93,6965151818619;88,9469352416997;88,6203888082046;81,5535781998703;80,2677288669334;82,8500700169598;85,2433074458641
FR;1A3ai(i);EM;NOx;kt;2,25420287217679;2,10530576434431;2,11264923454968;2,12820913370516;2,17155252871602;2,47152918044223;2,69114725113725;2,89104460159956;3,25042017146598;3,4437184439061
FR;1A3aii(i);EM;NOx;kt;1,88210298116836;1,73531814616265;1,73475358772638;1,76370372627328;1,80042841613793;2,12060751515862;2,20286750191899;2,37616531466062;2,66694569297441;2,80757150510577
FR;1A3bi;EM;NOx;kt;575,885040712694;599,338247058849;613,309380125658;632,23313090794;647,506305082463;645,946958843232;672,584442496355;686,130295909992;711,537469584943;718,60253438676
FR;1A3bii;EM;NOx;kt;84,907415759523;90,9618809009167;95,613293221023;99,3370685651167;102,807304232855;104,495855150479;111,332832609654;116,922377081578;125,339354620922;131,224832132771
FR;1A3biii;EM;NOx;kt;312,870903953117;312,253127478286;307,707680938874;306,037538783552;313,279005628335;311,784892787416;332,690101677321;350,936315319104;378,895513741688;400,468909599832
FR;1A3biv;EM;NOx;kt;0,769138954409817;0,805289142325306;0,813831027879804;0,808408353830351;0,792641306990295;0,76124041009201;0,757864370415285;0,737748899464865;0,735735096855645;0,736398600323401
FR;1A3bv;EM;NOx;kt;NA;NA;NA;NA;NA;NA;NA;NA;NA;NA
FR;1A3bvi;EM;NOx;kt;NA;NA;NA;NA;NA;NA;NA;NA;NA;NA
FR;1A3bvii;EM;NOx;kt;NA;NA;NA;NA;NA;NA;NA;NA;NA;NA
FR;1A3c;EM;NOx;kt;29,037073;27,515059;27,2568946;26,7521254;25,4560982;24,784357;22,9678436;22,7510504;22,1811824;21,6974706
FR;1A3di(ii);EM;NOx;kt;2,28735499868006;1,49345403940528;1,38332443173817;1,24032251213839;1,18687886776915;1,2168083101568;1,12056185933741;1,06459338513869;1,1088160756975;1,12800282737213
FR;1A3dii;EM;NOx;kt;16,2969241736515;14,5848987615172;13,1858968816735;12,0516466477834;11,7891621495074;11,6441770890824;11,3653967877794;10,6660376834182;10,0593910642966;10,5992054912503
FR;1A3ei;EM;NOx;kt;5,39668420273367;5,43280295631753;4,32339534249655;4,80302570046296;3,17689220483282;4,28444415637514;4,46842360399165;3,76618464414404;2,8057404824461;3,50663029881873
FR;1A3eii;EM;NOx;kt;IE;IE;IE;IE;IE;IE;IE;IE;IE;IE
FR;1A4ai;EM;NOx;kt;41,7005279547544;36,6140533854513;33,9898931547201;34,883202313224;34,2378728216413;40,8129762760084;40,5782150043251;41,5877872369532;35,202969185494;34,3977580673655
FR;1A4aii;EM;NOx;kt;IE;IE;IE;IE;IE;IE;IE;IE;IE;IE
FR;1A4bi;EM;NOx;kt;77,1034750423666;70,6620469572466;67,0735263348028;71,4922699514058;72,1473412265695;73,4291571237324;72,6386625141334;71,658400921195;64,5072391901948;63,5943056895819
FR;1A4bii;EM;NOx;kt;1,22275186184796;1,229601041261;1,23665153897311;1,24300419679156;1,24876075182993;1,25462015598693;1,26057137998816;1,26686787020541;1,27354024081806;1,28047164052166
FR;1A4ci;EM;NOx;kt;2,4655144;2,1924328;2,0274344;1,9767936;1,9606344;1,7709528;1,7859528;1,9509152;1,9513152;1,9791944
FR;1A4cii;EM;NOx;kt;135,036101460879;129,255484496509;130,277264000638;131,726694379134;132,599899350405;133,782726912889;135,500962118114;136,39880901041;138,742369748863;139,408751884235
FR;1A4ciii;EM;NOx;kt;28,3284851195202;25,8319543069407;25,0868211755962;24,2035550781948;24,3170167295903;24,9843738190786;24,4297560571887;25,0825846496867;25,6976620855111;26,9478391845502
FR;1A5a;EM;NOx;kt;IE;IE;IE;IE;IE;IE;IE;IE;IE;IE
FR;1A5b;EM;NOx;kt;IE;IE;IE;IE;IE;IE;IE;IE;IE;IE
FR;1B1a;EM;NOx;kt;NA;NA;NA;NA;NA;NA;NA;NA;NA;NA
FR;1B1b;EM;NOx;kt;NE;NE;NE;NE;NE;NE;NE;NE;NE;NE
FR;1B1c;EM;NOx;kt;NO;NO;NO;NO;NO;NO;NO;NO;NO;NO
FR;1B2ai;EM;NOx;kt;NA;NA;NA;NA;NA;NA;NA;NA;NA;NA
FR;1B2aiv;EM;NOx;kt;1,93608121298159;1,9572562070343;2,30921894601854;2,47060673852839;2,69265802751357;2,81284042619111;2,51295672663381;2,90612485945035;3,0148613153967;3,12359777134305
FR;1B2av;EM;NOx;kt;NA;NA;NA;NA;NA;NA;NA;NA;NA;NA
FR;1B2b;EM;NOx;kt;NA;NA;NA;NA;NA;NA;NA;NA;NA;NA
FR;1B2c;EM;NOx;kt;0,466754820284707;0,413785740533945;0,359730105129609;0,336477493538604;0,346331631520504;0,356400355192694;0,344031625140582;0,3371732900343;0,355173932956211;0,350047381315545
FR;1B2d;EM;NOx;kt;NO;NO;NO;NO;NO;NO;NO;NO;NO;NO
FR;2A1;EM;NOx;kt;IE;IE;IE;IE;IE;IE;IE;IE;IE;IE
FR;2A2;EM;NOx;kt;IE;IE;IE;IE;IE;IE;IE;IE;IE;IE
FR;2A3;EM;NOx;kt;IE;IE;IE;IE;IE;IE;IE;IE;IE;IE
FR;2A5a;EM;NOx;kt;NA;NA;NA;NA;NA;NA;NA;NA;NA;NA
FR;2A5b;EM;NOx;kt;NA;NA;NA;NA;NA;NA;NA;NA;NA;NA
FR;2A5c;EM;NOx;kt;NA;NA;NA;NA;NA;NA;NA;NA;NA;NA
FR;2A6;EM;NOx;kt;NA;NA;NA;NA;NA;NA;NA;NA;NA;NA
FR;2B1;EM;NOx;kt;2,45072758083203;2,452092510696;2,45345820075606;2,4548246514356;2,45619186315825;2,45755983634788;2,45892857142857;2,465;2,22505714285714;1,7935
FR;2B2;EM;NOx;kt;16,0149159643081;15,2611471567297;14,5368907663894;14,5576036745144;16,1131599400774;17,730381909778;15,232838250658;16,5186942145389;15,5850728914181;15,1739910252696
FR;2B3;EM;NOx;kt;0,448884257579614;0,448884257579614;0,448884257579614;0,448884257579614;0,448884257579614;0,448884257579614;0,448884257579614;0,448884257579614;0,448884257579614;0,448884257579614
FR;2B5;EM;NOx;kt;NE;NE;NE;NE;NE;NE;NE;NE;NE;NE
FR;2B6;EM;NOx;kt;0,0280500477017757;0,0279337971877113;0,0278180634674277;0,0277028442435087;0,0275881372287514;0,0274739401461206;0,0273602507287036;0,0272470667196657;0,0271343858722045;0,0265414262292452
FR;2B7;EM;NOx;kt;NA;NA;NA;NA;NA;NA;NA;NA;NA;NA
FR;2B10a;EM;NOx;kt;3,55289041714553;3,42310858422271;3,53109656701275;3,73501685170717;3,85031996884488;3,91676076065487;4,01895074835968;4,19189422838114;4,31685026129597;4,54535846474534
FR;2B10b;EM;NOx;kt;NA;NA;NA;NA;NA;NA;NA;NA;NA;NA
FR;2C1;EM;NOx;kt;2,35606350821066;1,96616828471315;2,33079826515612;1,91762315527335;1,90938538719453;1,61165158558939;1,46330242436943;1,39235846194708;1,31210630729598;1,37421966682308
FR;2C2;EM;NOx;kt;NE;NE;NE;NE;NE;NE;NE;NE;NE;NE
FR;2C3;EM;NOx;kt;IE;IE;IE;IE;IE;IE;IE;IE;IE;IE
FR;2C4;EM;NOx;kt;IE;IE;IE;IE;IE;IE;IE;IE;IE;IE
FR;2C5;EM;NOx;kt;IE;IE;IE;IE;IE;IE;IE;IE;IE;IE
FR;2C6;EM;NOx;kt;IE;IE;IE;IE;IE;IE;IE;IE;IE;IE
FR;2C7a;EM;NOx;kt;IE;IE;IE;IE;IE;IE;IE;IE;IE;IE
FR;2C7b;EM;NOx;kt;NE;NE;NE;NE;NE;NE;NE;NE;NE;NE
FR;2C7c;EM;NOx;kt;NO;NO;NO;NO;NO;NO;NO;NO;NO;NO
FR;2C7d;EM;NOx;kt;NA;NA;NA;NA;NA;NA;NA;NA;NA;NA
FR;2D3a;EM;NOx;kt;NA;NA;NA;NA;NA;NA;NA;NA;NA;NA
FR;2D3b;EM;NOx;kt;NE;NE;NE;NE;NE;NE;NE;NE;NE;NE
FR;2D3c;EM;NOx;kt;NE;NE;NE;NE;NE;NE;NE;NE;NE;NE
FR;2D3d;EM;NOx;kt;NA;NA;NA;NA;NA;NA;NA;NA;NA;NA
FR;2D3e;EM;NOx;kt;NA;NA;NA;NA;NA;NA;NA;NA;NA;NA
FR;2D3f;EM;NOx;kt;NA;NA;NA;NA;NA;NA;NA;NA;NA;NA
FR;2D3g;EM;NOx;kt;NA;NA;NA;NA;NA;NA;NA;NA;NA;NA
FR;2D3h;EM;NOx;kt;NA;NA;NA;NA;NA;NA;NA;NA;NA;NA
FR;2D3i;EM;NOx;kt;NA;NA;NA;NA;NA;NA;NA;NA;NA;NA
FR;2G;EM;NOx;kt;1,62596641430505;1,68614759041595;1,72504126569035;1,7743580375743;1,82518335967633;1,84049740200478;1,92446623141653;1,99763706312474;2,09409155928788;2,14983886478346
FR;2H1;EM;NOx;kt;IE;IE;IE;IE;IE;IE;IE;IE;IE;IE
FR;2H2;EM;NOx;kt;NA;NA;NA;NA;NA;NA;NA;NA;NA;NA
FR;2H3;EM;NOx;kt;NA;NA;NA;NA;NA;NA;NA;NA;NA;NA
FR;2I;EM;NOx;kt;NA;NA;NA;NA;NA;NA;NA;NA;NA;NA
FR;2J;EM;NOx;kt;NO;NO;NO;NO;NO;NO;NO;NO;NO;NO
FR;2K;EM;NOx;kt;NO;NO;NO;NO;NO;NO;NO;NO;NO;NO
FR;2L;EM;NOx;kt;NA;NA;NA;NA;NA;NA;NA;NA;NA;NA
FR;3B1a;EM;NOx;kt;4,76278429133202;4,71221293621034;4,70961953338358;4,70378437702339;4,4379605872812;4,29337837968971;4,16824669329888;3,94262064737136;3,7137528479104;3,58596940712921
FR;3B1b;EM;NOx;kt;4,34855431268826;4,38970773364707;4,45683656753907;4,49257166462824;4,53847416838582;4,57822692307802;4,54852938072487;4,47795734309878;4,41237880066114;4,48305128500511
FR;3B2;EM;NOx;kt;0,378118692219226;0,382857531741887;0,384660035118605;0,379746759785294;0,372071584116689;0,367681616215328;0,357302685481646;0,356982886495454;0,347069117923506;0,342521954284114
FR;3B3;EM;NOx;kt;0,321502332431974;0,326468083969368;0,32254832255187;0,321942469177792;0,320702736323562;0,322530708469932;0,338780761287455;0,341431433047494;0,328900578792662;0,333097304903692
FR;3B4a;EM;NOx;kt;NO;NO;NO;NO;NO;NO;NO;NO;NO;NO
FR;3B4d;EM;NOx;kt;0,105849332633277;0,107041521415953;0,107211834099192;0,104742300192221;0,101080577502574;0,100825108477715;0,102783704334968;0,104571987508982;0,103805580434405;0,105717936398158
FR;3B4e;EM;NOx;kt;0,0805245166290359;0,0816351996170226;0,0833012240990027;0,0858002608219727;0,0874662853039528;0,0888546390389362;0,0905206635209162;0,0921866880028963;0,0882992975449428;0,0885425371193119
FR;3B4f;EM;NOx;kt;0,00124787360978816;0,00119795866539664;0,00109812877661358;0,00104821383222206;0,000948383943439004;0,000898468999047478;0,000848554054655951;0,000798639110264425;0,000648894277089845;0,000653536366918257
FR;3B4gi;EM;NOx;kt;0,903805829829117;0,932669096660973;0,953413192632112;0,961752693773988;0,949149801691681;0,924076215695763;0,907397213412012;0,897317103048978;0,810694253011237;0,807973174038921
FR;3B4gii;EM;NOx;kt;0,58048147432077;0,676532228749136;0,681204316202661;0,706462788998277;0,698756383877926;0,694192211487866;0,705009109613961;0,736075952001934;0,729493133130596;0,767047575216262
FR;3B4giii;EM;NOx;kt;0,35753330376582;0,377631513053713;0,374608863558206;0,392786072369455;0,40013957957037;0,41818596756063;0,427756543412007;0,44251864026478;0,452949879412145;0,472242507854994
FR;3B4giv;EM;NOx;kt;0,164023015258328;0,173243328034707;0,171856648586667;0,180195677613608;0,18356919390178;0,191848207189512;0,196238832321122;0,203011134682395;0,207796600203538;0,216647342375314
FR;3B4h;EM;NOx;kt;0,00593642070046859;0,00627012786677259;0,0062199403210352;0,00652175153002546;0,00664384788275333;0,00694348696561828;0,00710239514004876;0,00734750242492569;0,00752070090281215;0,00784103234508135
FR;3Da1;EM;NOx;kt;43,8277600714286;43,8409659047619;43,6863522380952;44,8697055238095;45,8253226666667;47,037287952381;48,4188902857143;49,698308;51,023026952381;51,766031
FR;3Da2a;EM;NOx;kt;8,32552860113418;8,38727082955235;8,44174210179774;8,48990448418209;8,37131848322398;8,33131340150564;8,26384026988954;8,10217805424842;7,87898471822443;7,88665823506772
FR;3Da2b;EM;NOx;kt;0,184299551530083;0,188625864430904;0,193079176683286;0,196939426181486;0,20077576577382;0,204699267287985;0,208710091124693;0,212852768939215;0,217136399264761;0,21717010347005
FR;3Da2c;EM;NOx;kt;0,0218295581590666;0,0223687661083035;0,022921620982137;0,0234884681733813;0,0240696618164679;0,0246730148402318;0,025291449700127;0,0259253481054382;0,0265751014262082;0,0272411109377448
FR;3Da3;EM;NOx;kt;13,670349207458;13,7717286950269;13,8611694199399;13,94025107558;13,7455352657043;13,679847732412;13,5690582179556;13,3036121367104;12,9371332030113;12,9497329621284
FR;3Da4;EM;NOx;kt;NA;NA;NA;NA;NA;NA;NA;NA;NA;NA
FR;3Db;EM;NOx;kt;NA;NA;NA;NA;NA;NA;NA;NA;NA;NA
FR;3Dc;EM;NOx;kt;NA;NA;NA;NA;NA;NA;NA;NA;NA;NA
FR;3Dd;EM;NOx;kt;NA;NA;NA;NA;NA;NA;NA;NA;NA;NA
FR;3De;EM;NOx;kt;NA;NA;NA;NA;NA;NA;NA;NA;NA;NA
FR;3Df;EM;NOx;kt;NA;NA;NA;NA;NA;NA;NA;NA;NA;NA
FR;3F;EM;NOx;kt;4,25473980554784;4,29203668687844;4,33166851486997;4,29340652225285;4,41058971200942;4,46606804467314;4,50672724919547;4,5917504402755;4,54635907718701;4,55696191431118
FR;3I;EM;NOx;kt;NA;NA;NA;NA;NA;NA;NA;NA;NA;NA
FR;5A;EM;NOx;kt;NE;NE;NE;NE;NE;NE;NE;NE;NE;NE
FR;5B1;EM;NOx;kt;NE;NE;NE;NE;NE;NE;NE;NE;NE;NE
FR;5B2;EM;NOx;kt;NA;NA;NA;NA;NA;NA;NA;NA;NA;NA
FR;5C1a;EM;NOx;kt;3,48467247588225;3,51517533760972;3,49110043496356;3,4670255323174;3,44295062967124;3,41887572702508;3,68022616271625;3,94157659840741;4,20292703409858;4,46427746978975
FR;5C1bi;EM;NOx;kt;IE;IE;IE;IE;IE;IE;IE;IE;IE;IE
FR;5C1bii;EM;NOx;kt;0,509348432937797;0,573597153448857;0,637845873959916;0,702094594470976;0,766343314982035;0,830592035493094;0,894840756004154;0,959089476515213;1,02333819702627;1,07284792696562
FR;5C1biii;EM;NOx;kt;0,338520674331955;0,342323706871888;0,346260710911277;0,349827318951479;0,3530750366007;0,356396189899324;0,359785301670273;0,363388496870634;0,375976383869082;0,403390111600921
FR;5C1biv;EM;NOx;kt;0,212452089177432;0,217439264710872;0,222572839285109;0,227022758255772;0,231445114981109;0,23596794798127;0,240591442158857;0,24536693156823;0,250304904582112;0,250343757247614
FR;5C1bv;EM;NOx;kt;0,00327019139312538;0,00381522329197961;0,00463277114026095;0,00546121962651938;0,00654038278625076;0,00763044658395922;0,00926554228052191;0,01095514116697;0,0130807655725015;0,0152608931679184
FR;5C1bvi;EM;NOx;kt;NO;NO;NO;NO;NO;NO;NO;NO;NO;NO
FR;5C2;EM;NOx;kt;0,167208258813973;0,17083569791111;0,174536029623279;0,178310718712034;0,182047482858529;0,184820970089758;0,187594457320986;0,190367944552214;0,193141431783442;0,19591491901467
FR;5D1;EM;NOx;kt;NA;NA;NA;NA;NA;NA;NA;NA;NA;NA
FR;5D2;EM;NOx;kt;NA;NA;NA;NA;NA;NA;NA;NA;NA;NA
FR;5D3;EM;NOx;kt;NO;NO;NO;NO;NO;NO;NO;NO;NO;NO
FR;5E;EM;NOx;kt;0,0507233345;0,0507233345;0,0507233345;0,0507233345;0,0507233345;0,0507233345;0,0507233345;0,0507233345;0,0507233345;0,0507233345
FR;6A;EM;NOx;kt;NO;NO;NO;NO;NO;NO;NO;NO;NO;NO
FR;1A3ai(ii);EM;NOx;kt;22,4623508197114;21,67528482235;21,9444699394418;21,6623829792067;22,0573170397816;23,3689604247508;25,3012158048782;26,9248601548603;30,391691817991;32,7214873039591
FR;1A3aii(ii);EM;NOx;kt;8,08882228276332;7,48871966018207;7,49533634340657;7,6024226772895;7,75637564962495;7,96159814969953;8,39311508193995;9,04517810454664;10,1557722631873;10,7121359979136
FR;1A3di(i);EM;NOx;kt;306,65986796347;294,290638487288;226,062858694922;200,14898805514;182,135057042957;186,728312823479;188,140485569721;176,111633018249;177,11045953527;181,566920977784
FR;1A5c;EM;NOx;kt;NO;NO;NO;NO;NO;NO;NO;NO;NO;NO
FR;6B;EM;NOx;kt;9,75957438833988;9,36104820651219;9,43790001193581;10,3087161882878;10,3205136915331;11,1174164970864;11,0104609719076;11,5378002754854;12,9020172844769;11,5929669761242
FR;11A;EM;NOx;kt;NO;NO;NO;NO;NO;NO;NO;NO;NO;NO
FR;11B;EM;NOx;kt;0,964449055006883;1,27640236523523;2,58252099667073;2,29144394771977;1,06990385034183;2,61914401423566;2,46459374363743;0,615708411218408;0,29836696871332;3,32612398523616
FR;11C;EM;NOx;kt;0,576692294444444;0,576692294444444;0,576692294444444;0,576692294444444;0,576692294444444;0,576692294444444;0,576692294444444;0,576692294444444;0,576692294444444;0,51180745
FR;1A1a;EM;NMVOC;kt;NR;NR;NR;NR;NR;NR;NR;NR;2,36023533128662;2,88833561436391
FR;1A1b;EM;NMVOC;kt;NR;NR;NR;NR;NR;NR;NR;NR;0,51052038;0,51315012
FR;1A1c;EM;NMVOC;kt;NR;NR;NR;NR;NR;NR;NR;NR;5,4925984559878;5,07136469637932
FR;1A2a;EM;NMVOC;kt;NR;NR;NR;NR;NR;NR;NR;NR;2,83457540702601;2,58575105190788
FR;1A2b;EM;NMVOC;kt;NR;NR;NR;NR;NR;NR;NR;NR;0,479461329586054;0,506338938046103
FR;1A2c;EM;NMVOC;kt;NR;NR;NR;NR;NR;NR;NR;NR;0,0032968392126928;0,00346017347246798
FR;1A2d;EM;NMVOC;kt;NR;NR;NR;NR;NR;NR;NR;NR;IE;IE
FR;1A2e;EM;NMVOC;kt;NR;NR;NR;NR;NR;NR;NR;NR;1,44129792904559;1,44081543424614
FR;1A2f;EM;NMVOC;kt;NR;NR;NR;NR;NR;NR;NR;NR;3,39112073858692;2,95203908510845
FR;1A2gvii;EM;NMVOC;kt;NR;NR;NR;NR;NR;NR;NR;NR;8,52658199042685;8,32272609595222
FR;1A2gviii;EM;NMVOC;kt;NR;NR;NR;NR;NR;NR;NR;NR;3,84076783193248;4,01134024011327
FR;1A3ai(i);EM;NMVOC;kt;NR;NR;NR;NR;NR;NR;NR;NR;1,32595812083221;1,39212990806381
FR;1A3aii(i);EM;NMVOC;kt;NR;NR;NR;NR;NR;NR;NR;NR;0,448299503859706;0,469996511956052
FR;1A3bi;EM;NMVOC;kt;NR;NR;NR;NR;NR;NR;NR;NR;518,462986785258;498,523970946625
FR;1A3bii;EM;NMVOC;kt;NR;NR;NR;NR;NR;NR;NR;NR;62,891526729751;61,513033444116
FR;1A3biii;EM;NMVOC;kt;NR;NR;NR;NR;NR;NR;NR;NR;33,7883654313625;35,1679727013426
FR;1A3biv;EM;NMVOC;kt;NR;NR;NR;NR;NR;NR;NR;NR;32,4826144788364;30,1609731932871
FR;1A3bv;EM;NMVOC;kt;NR;NR;NR;NR;NR;NR;NR;NR;305,590915725217;312,98715547316
FR;1A3bvi;EM;NMVOC;kt;NR;NR;NR;NR;NR;NR;NR;NR;NA;NA
FR;1A3bvii;EM;NMVOC;kt;NR;NR;NR;NR;NR;NR;NR;NR;NA;NA
FR;1A3c;EM;NMVOC;kt;NR;NR;NR;NR;NR;NR;NR;NR;1,6974191;1,6605264
FR;1A3di(ii);EM;NMVOC;kt;NR;NR;NR;NR;NR;NR;NR;NR;0,215121868852771;0,218844298539645
FR;1A3dii;EM;NMVOC;kt;NR;NR;NR;NR;NR;NR;NR;NR;12,9668600157597;13,3037259233692
FR;1A3ei;EM;NMVOC;kt;NR;NR;NR;NR;NR;NR;NR;NR;0,14936524416;0,1831243788
FR;1A3eii;EM;NMVOC;kt;NR;NR;NR;NR;NR;NR;NR;NR;IE;IE
FR;1A4ai;EM;NMVOC;kt;NR;NR;NR;NR;NR;NR;NR;NR;3,88084171801417;3,78253429273834
FR;1A4aii;EM;NMVOC;kt;NR;NR;NR;NR;NR;NR;NR;NR;IE;IE
FR;1A4bi;EM;NMVOC;kt;NR;NR;NR;NR;NR;NR;NR;NR;472,319847934372;486,368849502287
FR;1A4bii;EM;NMVOC;kt;NR;NR;NR;NR;NR;NR;NR;NR;5,19988181559631;5,22818281317783
FR;1A4ci;EM;NMVOC;kt;NR;NR;NR;NR;NR;NR;NR;NR;0,060237696;0,060580336
FR;1A4cii;EM;NMVOC;kt;NR;NR;NR;NR;NR;NR;NR;NR;42,9986998442328;41,2893272629032
FR;1A4ciii;EM;NMVOC;kt;NR;NR;NR;NR;NR;NR;NR;NR;1,69838630107635;1,79238921223624
FR;1A5a;EM;NMVOC;kt;NR;NR;NR;NR;NR;NR;NR;NR;IE;IE
FR;1A5b;EM;NMVOC;kt;NR;NR;NR;NR;NR;NR;NR;NR;IE;IE
FR;1B1a;EM;NMVOC;kt;NR;NR;NR;NR;NR;NR;NR;NR;36,1798;35,4118
FR;1B1b;EM;NMVOC;kt;NR;NR;NR;NR;NR;NR;NR;NR;0,613510670026888;0,604755671235443
FR;1B1c;EM;NMVOC;kt;NR;NR;NR;NR;NR;NR;NR;NR;NO;NO
FR;1B2ai;EM;NMVOC;kt;NR;NR;NR;NR;NR;NR;NR;NR;9,18436187852164;8,51555158040468
FR;1B2aiv;EM;NMVOC;kt;NR;NR;NR;NR;NR;NR;NR;NR;21,8535147507683;18,0367938411908
FR;1B2av;EM;NMVOC;kt;NR;NR;NR;NR;NR;NR;NR;NR;159,842547930873;136,69725980198
FR;1B2b;EM;NMVOC;kt;NR;NR;NR;NR;NR;NR;NR;NR;6,73703043462809;6,57702422915106
FR;1B2c;EM;NMVOC;kt;NR;NR;NR;NR;NR;NR;NR;NR;1,93106877398571;1,86407525544252
FR;1B2d;EM;NMVOC;kt;NR;NR;NR;NR;NR;NR;NR;NR;NO;NO
FR;2A1;EM;NMVOC;kt;NR;NR;NR;NR;NR;NR;NR;NR;IE;IE
FR;2A2;EM;NMVOC;kt;NR;NR;NR;NR;NR;NR;NR;NR;IE;IE
FR;2A3;EM;NMVOC;kt;NR;NR;NR;NR;NR;NR;NR;NR;IE;IE
FR;2A5a;EM;NMVOC;kt;NR;NR;NR;NR;NR;NR;NR;NR;NA;NA
FR;2A5b;EM;NMVOC;kt;NR;NR;NR;NR;NR;NR;NR;NR;NA;NA
FR;2A5c;EM;NMVOC;kt;NR;NR;NR;NR;NR;NR;NR;NR;NA;NA
FR;2A6;EM;NMVOC;kt;NR;NR;NR;NR;NR;NR;NR;NR;NA;NA
FR;2B1;EM;NMVOC;kt;NR;NR;NR;NR;NR;NR;NR;NR;0,200255142857143;0,161415
FR;2B2;EM;NMVOC;kt;NR;NR;NR;NR;NR;NR;NR;NR;NA;NA
FR;2B3;EM;NMVOC;kt;NR;NR;NR;NR;NR;NR;NR;NR;0,137491544121959;0,137491544121959
FR;2B5;EM;NMVOC;kt;NR;NR;NR;NR;NR;NR;NR;NR;0,655419738858037;0,632662109036577
FR;2B6;EM;NMVOC;kt;NR;NR;NR;NR;NR;NR;NR;NR;NE;NE
FR;2B7;EM;NMVOC;kt;NR;NR;NR;NR;NR;NR;NR;NR;NA;NA
FR;2B10a;EM;NMVOC;kt;NR;NR;NR;NR;NR;NR;NR;NR;43,1755130469297;43,3560284144868
FR;2B10b;EM;NMVOC;kt;NR;NR;NR;NR;NR;NR;NR;NR;IE;IE
FR;2C1;EM;NMVOC;kt;NR;NR;NR;NR;NR;NR;NR;NR;1,46237427332052;1,48706589317236
FR;2C2;EM;NMVOC;kt;NR;NR;NR;NR;NR;NR;NR;NR;NE;NE
FR;2C3;EM;NMVOC;kt;NR;NR;NR;NR;NR;NR;NR;NR;0,0323909472073009;0,0330723421333082
FR;2C4;EM;NMVOC;kt;NR;NR;NR;NR;NR;NR;NR;NR;NE;NE
FR;2C5;EM;NMVOC;kt;NR;NR;NR;NR;NR;NR;NR;NR;IE;IE
FR;2C6;EM;NMVOC;kt;NR;NR;NR;NR;NR;NR;NR;NR;IE;IE
FR;2C7a;EM;NMVOC;kt;NR;NR;NR;NR;NR;NR;NR;NR;IE;IE
FR;2C7b;EM;NMVOC;kt;NR;NR;NR;NR;NR;NR;NR;NR;0,0726376699029126;0,0684660194174757
FR;2C7c;EM;NMVOC;kt;NR;NR;NR;NR;NR;NR;NR;NR;NO;NO
FR;2C7d;EM;NMVOC;kt;NR;NR;NR;NR;NR;NR;NR;NR;NA;NA
FR;2D3a;EM;NMVOC;kt;NR;NR;NR;NR;NR;NR;NR;NR;143,677665441762;142,139203903301
FR;2D3b;EM;NMVOC;kt;NR;NR;NR;NR;NR;NR;NR;NR;0,5392;0,576176
FR;2D3c;EM;NMVOC;kt;NR;NR;NR;NR;NR;NR;NR;NR;0,02707458;0,0289312374
FR;2D3d;EM;NMVOC;kt;NR;NR;NR;NR;NR;NR;NR;NR;258,922188566133;264,535500145024
FR;2D3e;EM;NMVOC;kt;NR;NR;NR;NR;NR;NR;NR;NR;67,2332041049031;67,8766241792198
FR;2D3f;EM;NMVOC;kt;NR;NR;NR;NR;NR;NR;NR;NR;15,3812175;14,00001
FR;2D3g;EM;NMVOC;kt;NR;NR;NR;NR;NR;NR;NR;NR;67,1684977884038;69,2412560473302
FR;2D3h;EM;NMVOC;kt;NR;NR;NR;NR;NR;NR;NR;NR;72,9486216275036;74,6146209669611
FR;2D3i;EM;NMVOC;kt;NR;NR;NR;NR;NR;NR;NR;NR;37,837102795937;37,5463257487228
FR;2G;EM;NMVOC;kt;NR;NR;NR;NR;NR;NR;NR;NR;1,46031559170067;1,44215986364338
FR;2H1;EM;NMVOC;kt;NR;NR;NR;NR;NR;NR;NR;NR;2,6094;2,64155
FR;2H2;EM;NMVOC;kt;NR;NR;NR;NR;NR;NR;NR;NR;29,4097336279419;29,9576048000982
FR;2H3;EM;NMVOC;kt;NR;NR;NR;NR;NR;NR;NR;NR;NA;NA
FR;2I;EM;NMVOC;kt;NR;NR;NR;NR;NR;NR;NR;NR;0,859293508561856;0,87623544600049
FR;2J;EM;NMVOC;kt;NR;NR;NR;NR;NR;NR;NR;NR;NO;NO
FR;2K;EM;NMVOC;kt;NR;NR;NR;NR;NR;NR;NR;NR;NO;NO
FR;2L;EM;NMVOC;kt;NR;NR;NR;NR;NR;NR;NR;NR;NA;NA
FR;3B1a;EM;NMVOC;kt;NR;NR;NR;NR;NR;NR;NR;NR;100,508907722365;97,0505800996348
FR;3B1b;EM;NMVOC;kt;NR;NR;NR;NR;NR;NR;NR;NR;90,5488420087124;92,0179230880031
FR;3B2;EM;NMVOC;kt;NR;NR;NR;NR;NR;NR;NR;NR;1,97092488199127;1,94510259617977
FR;3B3;EM;NMVOC;kt;NR;NR;NR;NR;NR;NR;NR;NR;2,97964300686274;3,01564052889549
FR;3B4a;EM;NMVOC;kt;NR;NR;NR;NR;NR;NR;NR;NR;NO;NO
FR;3B4d;EM;NMVOC;kt;NR;NR;NR;NR;NR;NR;NR;NR;0,902004063354573;0,918621212862984
FR;3B4e;EM;NMVOC;kt;NR;NR;NR;NR;NR;NR;NR;NR;0,346808134079677;0,347763492335821
FR;3B4f;EM;NMVOC;kt;NR;NR;NR;NR;NR;NR;NR;NR;0,00509498887176852;0,00513143763831271
FR;3B4gi;EM;NMVOC;kt;NR;NR;NR;NR;NR;NR;NR;NR;3,95218623273376;3,93892079904822
FR;3B4gii;EM;NMVOC;kt;NR;NR;NR;NR;NR;NR;NR;NR;10,2800216037307;10,8092390266554
FR;3B4giii;EM;NMVOC;kt;NR;NR;NR;NR;NR;NR;NR;NR;8,04956759172144;8,39242520959791
FR;3B4giv;EM;NMVOC;kt;NR;NR;NR;NR;NR;NR;NR;NR;4,79985866624818;5,00430046882973
FR;3B4h;EM;NMVOC;kt;NR;NR;NR;NR;NR;NR;NR;NR;0,154767029716698;0,161359067677725
FR;3Da1;EM;NMVOC;kt;NR;NR;NR;NR;NR;NR;NR;NR;NA;NA
FR;3Da2a;EM;NMVOC;kt;NR;NR;NR;NR;NR;NR;NR;NR;40,0635494789247;40,0685535667188
FR;3Da2b;EM;NMVOC;kt;NR;NR;NR;NR;NR;NR;NR;NR;NA;NA
FR;3Da2c;EM;NMVOC;kt;NR;NR;NR;NR;NR;NR;NR;NR;NA;NA
FR;3Da3;EM;NMVOC;kt;NR;NR;NR;NR;NR;NR;NR;NR;4,07350663552773;4,07734282344531
FR;3Da4;EM;NMVOC;kt;NR;NR;NR;NR;NR;NR;NR;NR;NA;NA
FR;3Db;EM;NMVOC;kt;NR;NR;NR;NR;NR;NR;NR;NR;NA;NA
FR;3Dc;EM;NMVOC;kt;NR;NR;NR;NR;NR;NR;NR;NR;NA;NA
FR;3Dd;EM;NMVOC;kt;NR;NR;NR;NR;NR;NR;NR;NR;NA;NA
FR;3De;EM;NMVOC;kt;NR;NR;NR;NR;NR;NR;NR;NR;122,883;132,421
FR;3Df;EM;NMVOC;kt;NR;NR;NR;NR;NR;NR;NR;NR;NA;NA
FR;3F;EM;NMVOC;kt;NR;NR;NR;NR;NR;NR;NR;NR;2,39672403488568;2,40231357898944
FR;3I;EM;NMVOC;kt;NR;NR;NR;NR;NR;NR;NR;NR;NA;NA
FR;5A;EM;NMVOC;kt;NR;NR;NR;NR;NR;NR;NR;NR;4,47528573291067;4,71931871918362
FR;5B1;EM;NMVOC;kt;NR;NR;NR;NR;NR;NR;NR;NR;NE;NE
FR;5B2;EM;NMVOC;kt;NR;NR;NR;NR;NR;NR;NR;NR;NA;NA
FR;5C1a;EM;NMVOC;kt;NR;NR;NR;NR;NR;NR;NR;NR;0,316133652119497;0,335791777765685
FR;5C1bi;EM;NMVOC;kt;NR;NR;NR;NR;NR;NR;NR;NR;IE;IE
FR;5C1bii;EM;NMVOC;kt;NR;NR;NR;NR;NR;NR;NR;NR;0,0258389390280986;0,0270809687090254
FR;5C1biii;EM;NMVOC;kt;NR;NR;NR;NR;NR;NR;NR;NR;0,0751952767738164;0,0806780223201843
FR;5C1biv;EM;NMVOC;kt;NR;NR;NR;NR;NR;NR;NR;NR;0,0470973708461702;0,047104681363711
FR;5C1bv;EM;NMVOC;kt;NR;NR;NR;NR;NR;NR;NR;NR;0,000404792125539984;0,000472257479796648
FR;5C1bvi;EM;NMVOC;kt;NR;NR;NR;NR;NR;NR;NR;NR;NO;NO
FR;5C2;EM;NMVOC;kt;NR;NR;NR;NR;NR;NR;NR;NR;2,20002160706967;2,23161364705452
FR;5D1;EM;NMVOC;kt;NR;NR;NR;NR;NR;NR;NR;NR;0,0211597796050309;0,0211630640546124
FR;5D2;EM;NMVOC;kt;NR;NR;NR;NR;NR;NR;NR;NR;0,0722000957125919;0,0722000957125919
FR;5D3;EM;NMVOC;kt;NR;NR;NR;NR;NR;NR;NR;NR;NO;NO
FR;5E;EM;NMVOC;kt;NR;NR;NR;NR;NR;NR;NR;NR;NE;NE
FR;6A;EM;NMVOC;kt;NR;NR;NR;NR;NR;NR;NR;NR;NO;NO
FR;1A3ai(ii);EM;NMVOC;kt;NR;NR;NR;NR;NR;NR;NR;NR;0,96332839682839;1,03463333496503
FR;1A3aii(ii);EM;NMVOC;kt;NR;NR;NR;NR;NR;NR;NR;NR;0,385809351354181;0,40460887481609
FR;1A3di(i);EM;NMVOC;kt;NR;NR;NR;NR;NR;NR;NR;NR;6,06893032272995;6,22047022327971
FR;1A5c;EM;NMVOC;kt;NR;NR;NR;NR;NR;NR;NR;NR;NO;NO
FR;6B;EM;NMVOC;kt;NR;NR;NR;NR;NR;NR;NR;NR;1094,6425771763;1197,19117630199
FR;11A;EM;NMVOC;kt;NR;NR;NR;NR;NR;NR;NR;NR;NO;NO
FR;11B;EM;NMVOC;kt;NR;NR;NR;NR;NR;NR;NR;NR;0,787808;9,251123
FR;11C;EM;NMVOC;kt;NR;NR;NR;NR;NR;NR;NR;NR;124,122922979262;134,922787059949
FR;1A1a;EM;SO2;kt;1259,00753355334;972,549412810847;987,84936915516;717,931766118697;555,3233647141;412,401977594818;329,513180982823;334,140530335443;264,083546741417;409,536616846436
FR;1A1b;EM;SO2;kt;229,490145620253;187,841717468354;178,216443746835;154,768952911392;158,319016101266;130,762360506329;146,03064486076;142,009136;139,159987139241;125,695984810127
FR;1A1c;EM;SO2;kt;65,4397237984954;63,0203536899428;57,7278460128778;52,364503585721;53,8042418759638;51,1360577388364;43,857934790861;38,70073121886;35,2799723234859;32,9339911800093
FR;1A2a;EM;SO2;kt;69,3202996730122;59,7069989177082;51,3094880145033;44,7504023222531;46,7430398749833;43,8603357517057;39,585351230644;35,4099447605648;41,2587614012593;38,4591733122268
FR;1A2b;EM;SO2;kt;29,2495310243721;29,61910989938;28,3443037271158;27,6098631713392;28,2838786753403;29,8883055374637;30,2117578581482;30,8712157798661;33,0858787294473;34,3323219709859
FR;1A2c;EM;SO2;kt;0,0333686820722632;0,0312102374298888;0,0326492005248051;0,0352654970610165;0,0368243737471758;0,0382197318998219;0,0394624727545224;0,0416536211035994;0,0429072631938674;0,0450330041295392
FR;1A2d;EM;SO2;kt;IE;IE;IE;IE;IE;IE;IE;IE;IE;IE
FR;1A2e;EM;SO2;kt;3,10813369680075;2,99007015053724;2,71932204225227;2,77428808213746;2,84228462557079;2,59527237876759;2,38618906980157;2,23153734418627;2,99489062938254;2,99388804752596
FR;1A2f;EM;SO2;kt;90,345662966623;71,5544775962251;61,5074865811856;59,4059488478045;57,7423255281984;51,4507768377889;50,5125017440864;53,1029353911408;52,5629099105864;54,3726227204952
FR;1A2gvii;EM;SO2;kt;11,5997676659343;6,91799724457405;6,02954197524253;5,44283484834194;5,57653409641376;5,24028154476747;5,1637423068551;5,18345905453603;5,31086591972068;5,25728647271019
FR;1A2gviii;EM;SO2;kt;689,520674993723;542,023736221143;491,250947851362;409,511094012891;352,091701342953;299,242465337218;277,766550428261;277,903603045921;248,234061105247;266,554395497469
FR;1A3ai(i);EM;SO2;kt;0,198003870890552;0,184087273230127;0,184495206032921;0,186390800006782;0,190242803764651;0,207837414609511;0,226449027894494;0,243544119995554;0,273689506637125;0,28940455930141
FR;1A3aii(i);EM;SO2;kt;0,170174405832076;0,157692854374977;0,157554747290449;0,16035664812145;0,163737365341793;0,184250486529628;0,185903022164969;0,200613784228701;0,225124950236787;0,236777483818131
FR;1A3bi;EM;SO2;kt;46,6511137673242;45,4052809683799;46,7837740545282;48,0777496452569;49,4285159565923;49,8537781318409;52,7456023850938;54,8119989467607;58,9966507291245;62,2342840791893
FR;1A3bii;EM;SO2;kt;10,967203995312;8,50827910411389;9,07945217423949;9,50105391374553;10,0085889620727;10,4706623885419;11,6456602395016;12,9178580216644;14,9697916996075;16,8783634515581
FR;1A3biii;EM;SO2;kt;75,6045949368351;45,2614925203788;44,5660244468586;44,2595006300869;45,2394808553024;44,9643987849667;47,8956057276795;50,4390122558282;54,3829953416612;57,4158998213417
FR;1A3biv;EM;SO2;kt;0,49385647447228;0,495454673048577;0,4802547483232;0,457188734555526;0,43168397167651;0,40102732375688;0,385642799181255;0,361451358243781;0,346284700953637;0,329968882303731
FR;1A3bv;EM;SO2;kt;NA;NA;NA;NA;NA;NA;NA;NA;NA;NA
FR;1A3bvi;EM;SO2;kt;NA;NA;NA;NA;NA;NA;NA;NA;NA;NA
FR;1A3bvii;EM;SO2;kt;NA;NA;NA;NA;NA;NA;NA;NA;NA;NA
FR;1A3c;EM;SO2;kt;4,63905;2,6364;2,609529;2,561871;2,438163;2,375295;2,201394;2,179086;2,125851;2,079714
FR;1A3di(ii);EM;SO2;kt;0,595665364239598;0,233352193657075;0,21614444245909;0,193800392521624;0,18544982308893;0,190126298462;0,175087790521471;0,16634271642792;0,173252511827735;0,176250441776895
FR;1A3dii;EM;SO2;kt;8,40736883591107;7,31074122268448;6,17459282696587;5,03637738251929;4,8632342336164;4,37310425627032;4,41864765757912;3,97555589460308;3,27485975460418;3,829739370135
FR;1A3ei;EM;SO2;kt;0,00749964337888781;0,00755101079929115;0,00600998818719091;0,00667776465243435;0,00441759815468734;0,00595862076678757;0,00621545786880428;0,0052394768811408;0,00390392395065393;0,00487990493831741
FR;1A3eii;EM;SO2;kt;IE;IE;IE;IE;IE;IE;IE;IE;IE;IE
FR;1A4ai;EM;SO2;kt;91,3113535513328;55,0002370684894;49,9807598530041;51,4607265805352;50,0233790760223;62,1203279206383;59,6050680530754;56,947386729272;49,5475964742161;46,3969351878041
FR;1A4aii;EM;SO2;kt;IE;IE;IE;IE;IE;IE;IE;IE;IE;IE
FR;1A4bi;EM;SO2;kt;195,108197294272;175,96758066704;146,912920422101;152,566656349677;147,690326940236;136,06866638591;130,208619641023;113,457156157743;102,106069992387;93,4182076695335
FR;1A4bii;EM;SO2;kt;0,233741883747673;0,219307934339064;0,220565439852983;0,22169848074753;0,222725202547537;0,223770268206243;0,224497340487862;0,225282653087438;0,226131367147723;0,22702246629293
FR;1A4ci;EM;SO2;kt;6,79986862;5,95914994;4,78746862;4,33425928;3,75766862;2,77184994;2,39494994;2,40737796;2,31797796;3,08926862
FR;1A4cii;EM;SO2;kt;23,634895615362;13,6358788597229;13,7427598230942;13,8855662582138;13,9617046666432;14,0781254452837;14,2386883749864;14,3300862772088;14,5777588475418;14,6379970353981
FR;1A4ciii;EM;SO2;kt;4,6043416023074;2,68576466667392;2,42417685050319;2,32378164937348;2,31193951314981;2,34029380117698;2,33885622025593;2,37765729833389;2,45362295143135;2,55024491615179
FR;1A5a;EM;SO2;kt;IE;IE;IE;IE;IE;IE;IE;IE;IE;IE
FR;1A5b;EM;SO2;kt;IE;IE;IE;IE;IE;IE;IE;IE;IE;IE
FR;1B1a;EM;SO2;kt;NA;NA;NA;NA;NA;NA;NA;NA;NA;NA
FR;1B1b;EM;SO2;kt;NE;NE;NE;NE;NE;NE;NE;NE;NE;NE
FR;1B1c;EM;SO2;kt;NO;NO;NO;NO;NO;NO;NO;NO;NO;NO
FR;1B2ai;EM;SO2;kt;NA;NA;NA;NA;NA;NA;NA;NA;NA;NA
FR;1B2aiv;EM;SO2;kt;120,21237319528;115,817320728639;113,076086412445;104,938443451577;85,3812847622231;64,3394265144504;50,8889533599462;52,7556222117809;54,9297437904784;71,9538105850452
FR;1B2av;EM;SO2;kt;NA;NA;NA;NA;NA;NA;NA;NA;NA;NA
FR;1B2b;EM;SO2;kt;73,8756891095875;73,7986784188322;64,9768217983888;50,2962213612768;48,8488650624898;37,0220932969211;29,9109004398526;30,6223860039536;31,9959171098887;31,4054381436261
FR;1B2c;EM;SO2;kt;9,1359794099187;8,07661662104233;7,1065140893067;6,75792427169243;6,65226228442799;6,30560795453445;5,58037054725754;5,25806541083196;5,29450485140932;5,20095804267617
FR;1B2d;EM;SO2;kt;NO;NO;NO;NO;NO;NO;NO;NO;NO;NO
FR;2A1;EM;SO2;kt;IE;IE;IE;IE;IE;IE;IE;IE;IE;IE
FR;2A2;EM;SO2;kt;IE;IE;IE;IE;IE;IE;IE;IE;IE;IE
FR;2A3;EM;SO2;kt;IE;IE;IE;IE;IE;IE;IE;IE;IE;IE
FR;2A5a;EM;SO2;kt;NA;NA;NA;NA;NA;NA;NA;NA;NA;NA
FR;2A5b;EM;SO2;kt;NA;NA;NA;NA;NA;NA;NA;NA;NA;NA
FR;2A5c;EM;SO2;kt;NA;NA;NA;NA;NA;NA;NA;NA;NA;NA
FR;2A6;EM;SO2;kt;NA;NA;NA;NA;NA;NA;NA;NA;NA;NA
FR;2B1;EM;SO2;kt;NE;NE;NE;NE;NE;NE;NE;NE;NE;NE
FR;2B2;EM;SO2;kt;NA;NA;NA;NA;NA;NA;NA;NA;NA;NA
FR;2B3;EM;SO2;kt;NA;NA;NA;NA;NA;NA;NA;NA;NA;NA
FR;2B5;EM;SO2;kt;NE;NE;NE;NE;NE;NE;NE;NE;NE;NE
FR;2B6;EM;SO2;kt;10,7463085252645;10,6985356146907;10,6509750794623;10,6036259754609;10,5564873627649;10,5095583056316;10,4628378724778;10,4163251358618;10,3700191724649;10,1263436220819
FR;2B7;EM;SO2;kt;NA;NA;NA;NA;NA;NA;NA;NA;NA;NA
FR;2B10a;EM;SO2;kt;42,3629980377324;36,3755316430016;32,9235804017869;32,4076648282752;32,0994285177923;29,3271760635312;26,3838939980826;24,7389592467834;24,1703877884615;23,8288027186003
FR;2B10b;EM;SO2;kt;NA;NA;NA;NA;NA;NA;NA;NA;NA;NA
FR;2C1;EM;SO2;kt;1,67249058915971;1,38016414300508;1,44641373954456;1,22026048875251;1,25336701586027;1,13692035461986;1,00999665296583;0,953671596647994;0,954521205781515;0,979396426988481
FR;2C2;EM;SO2;kt;NE;NE;NE;NE;NE;NE;NE;NE;NE;NE
FR;2C3;EM;SO2;kt;5,49707341838063;5,54809034105702;4,97414996094767;4,60427727154387;4,36194688883103;3,83902343139807;4,1196165061182;4,1196165061182;4,18338765946368;4,27139185108045
FR;2C4;EM;SO2;kt;IE;IE;IE;IE;IE;IE;IE;IE;IE;IE
FR;2C5;EM;SO2;kt;IE;IE;IE;IE;IE;IE;IE;IE;IE;IE
FR;2C6;EM;SO2;kt;IE;IE;IE;IE;IE;IE;IE;IE;IE;IE
FR;2C7a;EM;SO2;kt;IE;IE;IE;IE;IE;IE;IE;IE;IE;IE
FR;2C7b;EM;SO2;kt;NE;NE;NE;NE;NE;NE;NE;NE;NE;NE
FR;2C7c;EM;SO2;kt;NO;NO;NO;NO;NO;NO;NO;NO;NO;NO
FR;2C7d;EM;SO2;kt;NA;NA;NA;NA;NA;NA;NA;NA;NA;NA
FR;2D3a;EM;SO2;kt;NA;NA;NA;NA;NA;NA;NA;NA;NA;NA
FR;2D3b;EM;SO2;kt;NE;NE;NE;NE;NE;NE;NE;NE;NE;NE
FR;2D3c;EM;SO2;kt;NA;NA;NA;NA;NA;NA;NA;NA;NA;NA
FR;2D3d;EM;SO2;kt;NA;NA;NA;NA;NA;NA;NA;NA;NA;NA
FR;2D3e;EM;SO2;kt;NA;NA;NA;NA;NA;NA;NA;NA;NA;NA
FR;2D3f;EM;SO2;kt;NA;NA;NA;NA;NA;NA;NA;NA;NA;NA
FR;2D3g;EM;SO2;kt;NA;NA;NA;NA;NA;NA;NA;NA;NA;NA
FR;2D3h;EM;SO2;kt;NA;NA;NA;NA;NA;NA;NA;NA;NA;NA
FR;2D3i;EM;SO2;kt;NA;NA;NA;NA;NA;NA;NA;NA;NA;NA
FR;2G;EM;SO2;kt;0,164132588304065;0,132878552930475;0,136132485499463;0,139671994589379;0,144646616885685;0,146866844523949;0,157562921009584;0,167690287504613;0,182623684333101;0,195082550977395
FR;2H1;EM;SO2;kt;1,888;1,908;2,008;2,276;2,438;2,842;2,406;2,484;2,55;2,587
FR;2H2;EM;SO2;kt;NA;NA;NA;NA;NA;NA;NA;NA;NA;NA
FR;2H3;EM;SO2;kt;NA;NA;NA;NA;NA;NA;NA;NA;NA;NA
FR;2I;EM;SO2;kt;NA;NA;NA;NA;NA;NA;NA;NA;NA;NA
FR;2J;EM;SO2;kt;NO;NO;NO;NO;NO;NO;NO;NO;NO;NO
FR;2K;EM;SO2;kt;NO;NO;NO;NO;NO;NO;NO;NO;NO;NO
FR;2L;EM;SO2;kt;NA;NA;NA;NA;NA;NA;NA;NA;NA;NA
FR;3B1a;EM;SO2;kt;NA;NA;NA;NA;NA;NA;NA;NA;NA;NA
FR;3B1b;EM;SO2;kt;NA;NA;NA;NA;NA;NA;NA;NA;NA;NA
FR;3B2;EM;SO2;kt;NA;NA;NA;NA;NA;NA;NA;NA;NA;NA
FR;3B3;EM;SO2;kt;NA;NA;NA;NA;NA;NA;NA;NA;NA;NA
FR;3B4a;EM;SO2;kt;NO;NO;NO;NO;NO;NO;NO;NO;NO;NO
FR;3B4d;EM;SO2;kt;NA;NA;NA;NA;NA;NA;NA;NA;NA;NA
FR;3B4e;EM;SO2;kt;NA;NA;NA;NA;NA;NA;NA;NA;NA;NA
FR;3B4f;EM;SO2;kt;NA;NA;NA;NA;NA;NA;NA;NA;NA;NA
FR;3B4gi;EM;SO2;kt;NA;NA;NA;NA;NA;NA;NA;NA;NA;NA
FR;3B4gii;EM;SO2;kt;NA;NA;NA;NA;NA;NA;NA;NA;NA;NA
FR;3B4giii;EM;SO2;kt;NA;NA;NA;NA;NA;NA;NA;NA;NA;NA
FR;3B4giv;EM;SO2;kt;NA;NA;NA;NA;NA;NA;NA;NA;NA;NA
FR;3B4h;EM;SO2;kt;NA;NA;NA;NA;NA;NA;NA;NA;NA;NA
FR;3Da1;EM;SO2;kt;NA;NA;NA;NA;NA;NA;NA;NA;NA;NA
FR;3Da2a;EM;SO2;kt;NA;NA;NA;NA;NA;NA;NA;NA;NA;NA
FR;3Da2b;EM;SO2;kt;NA;NA;NA;NA;NA;NA;NA;NA;NA;NA
FR;3Da2c;EM;SO2;kt;NA;NA;NA;NA;NA;NA;NA;NA;NA;NA
FR;3Da3;EM;SO2;kt;NA;NA;NA;NA;NA;NA;NA;NA;NA;NA
FR;3Da4;EM;SO2;kt;NA;NA;NA;NA;NA;NA;NA;NA;NA;NA
FR;3Db;EM;SO2;kt;NA;NA;NA;NA;NA;NA;NA;NA;NA;NA
FR;3Dc;EM;SO2;kt;NA;NA;NA;NA;NA;NA;NA;NA;NA;NA
FR;3Dd;EM;SO2;kt;NA;NA;NA;NA;NA;NA;NA;NA;NA;NA
FR;3De;EM;SO2;kt;NA;NA;NA;NA;NA;NA;NA;NA;NA;NA
FR;3Df;EM;SO2;kt;NA;NA;NA;NA;NA;NA;NA;NA;NA;NA
FR;3F;EM;SO2;kt;0,35715736321081;0,360288190570606;0,363615021312693;0,36040317922155;0,370239935634132;0,374896975997368;0,378310048227663;0,385447184721489;0,381636878969751;0,382526917261842
FR;3I;EM;SO2;kt;NA;NA;NA;NA;NA;NA;NA;NA;NA;NA
FR;5A;EM;SO2;kt;NE;NE;NE;NE;NE;NE;NE;NE;NE;NE
FR;5B1;EM;SO2;kt;NE;NE;NE;NE;NE;NE;NE;NE;NE;NE
FR;5B2;EM;SO2;kt;NA;NA;NA;NA;NA;NA;NA;NA;NA;NA
FR;5C1a;EM;SO2;kt;1,97994298632311;1,99727429294033;1,98359526428826;1,96991623563619;1,95623720698412;1,94255817833205;2,09105390230628;2,23954962628051;2,38804535025475;2,53654107422898
FR;5C1bi;EM;SO2;kt;IE;IE;IE;IE;IE;IE;IE;IE;IE;IE
FR;5C1bii;EM;SO2;kt;0,092882041675324;0,104598092909005;0,116314144142686;0,128030195376368;0,139746246610049;0,15146229784373;0,163178349077411;0,174894400311093;0,186610451544774;0,195480895757811
FR;5C1biii;EM;SO2;kt;0,293384584421028;0,296680545955636;0,300092616123107;0,303183676424615;0,30599836505394;0,308876697912747;0,311813928114237;0,314936697287883;0,325846199353204;0,349604763387465
FR;5C1biv;EM;SO2;kt;0,237946339878724;0,243531976476177;0,249281579999322;0,254265489246465;0,259218528778842;0,264284101739022;0,26946241521792;0,274810963356418;0,280341493131965;0,280385008117327
FR;5C1bv;EM;SO2;kt;0,00067163289476238;0,00078357171055611;0,000951479934246705;0,00112162693425317;0,00134326578952476;0,00156714342111222;0,00190295986849341;0,00224997019745397;0,00268653157904952;0,00313428684222444
FR;5C1bvi;EM;SO2;kt;NO;NO;NO;NO;NO;NO;NO;NO;NO;NO
FR;5C2;EM;SO2;kt;0,0216387158465141;0,0221081491414377;0,0225870155983067;0,0230755047744985;0,0235590860169862;0,0239180078939686;0,0242769297709511;0,0246358516479335;0,024994773524916;0,0253536954018984
FR;5D1;EM;SO2;kt;NA;NA;NA;NA;NA;NA;NA;NA;NA;NA
FR;5D2;EM;SO2;kt;NA;NA;NA;NA;NA;NA;NA;NA;NA;NA
FR;5D3;EM;SO2;kt;NO;NO;NO;NO;NO;NO;NO;NO;NO;NO
FR;5E;EM;SO2;kt;NE;NE;NE;NE;NE;NE;NE;NE;NE;NE
FR;6A;EM;SO2;kt;NO;NO;NO;NO;NO;NO;NO;NO;NO;NO
FR;1A3ai(ii);EM;SO2;kt;1,52207159535835;1,46143766202379;1,47762371865663;1,46309042759414;1,49023896983514;1,64798801073277;1,78580378325702;1,90316752836251;2,14691014682185;2,30581177916148
FR;1A3aii(ii);EM;SO2;kt;0,536750127919019;0,494782210371107;0,494326328020005;0,503162124277628;0,513780861058415;0,575924088128088;0,603844166683519;0,651674567413235;0,731275396304241;0,769006177718981
FR;1A3di(i);EM;SO2;kt;250,715565243686;240,346237248484;175,40625394186;145,202141288285;131,514374414855;119,858833048125;130,975934673719;122,664167379814;111,97306400966;129,183889976016
FR;1A5c;EM;SO2;kt;NO;NO;NO;NO;NO;NO;NO;NO;NO;NO
FR;6B;EM;SO2;kt;NA;NA;NA;NA;NA;NA;NA;NA;NA;NA
FR;11A;EM;SO2;kt;NO;NO;NO;NO;NO;NO;NO;NO;NO;NO
FR;11B;EM;SO2;kt;0,24084;0,24246;0,447618;0,620688;0,38832;0,521076;0,391416;0,151506;0,06708;0,78807
FR;11C;EM;SO2;kt;NA;NA;NA;NA;NA;NA;NA;NA;NA;NA
FR;1A1a;EM;NH3;kt;0,00807187974094562;0,00727103110552135;0,00613612974720802;0,00691995231645966;0,006689382;0,007715022;0,0120545208;0,0157108182;0,015168783;0,0146612256
FR;1A1b;EM;NH3;kt;NE;NE;NE;NE;NE;NE;NE;NE;NE;NE
FR;1A1c;EM;NH3;kt;NE;NE;NE;NE;NE;NE;NE;NE;NE;NE
FR;1A2a;EM;NH3;kt;NE;NE;NE;NE;NE;NE;NE;NE;NE;NE
FR;1A2b;EM;NH3;kt;NE;NE;NE;NE;NE;NE;NE;NE;NE;NE
FR;1A2c;EM;NH3;kt;NE;NE;NE;NE;NE;NE;NE;NE;NE;NE
FR;1A2d;EM;NH3;kt;NE;NE;NE;NE;NE;NE;NE;NE;NE;NE
FR;1A2e;EM;NH3;kt;NE;NE;NE;NE;NE;NE;NE;NE;NE;NE
FR;1A2f;EM;NH3;kt;0,98709901139336;0,933738685751995;0,879393144736885;0,853178863699779;0,834654264222777;0,822276822859672;0,810971629117738;0,816579553297244;0,833273326439436;0,870095452615552
FR;1A2gvii;EM;NH3;kt;0,00966663731876299;0,00960612062033402;0,00844356115758617;0,00771209060823237;0,00793686423073923;0,00755932640620437;0,00742738939058158;0,0076449237673119;0,00755531019717558;0,00744886793936937
FR;1A2gviii;EM;NH3;kt;0,0237567832240458;0,0238453168862824;0,0239341804841536;0,0240233752472203;0,0241129024096253;0,024202763210111;0,0242929588920359;0,0243834907033924;0,0244743598968233;0,026152705467196
FR;1A3ai(i);EM;NH3;kt;NE;NE;NE;NE;NE;NE;NE;NE;NE;NE
FR;1A3aii(i);EM;NH3;kt;NE;NE;NE;NE;NE;NE;NE;NE;NE;NE
FR;1A3bi;EM;NH3;kt;0,445803421448992;0,46131401774701;0,467213476673612;0,475109218203695;0,480975415514536;0,475324660068402;0,48960537882881;0,497842474211867;0,518483651949062;0,532704328867416
FR;1A3bii;EM;NH3;kt;0,0591280503774289;0,063320093040224;0,0664003737990956;0,0690058076336046;0,071257162929606;0,07200861295992;0,0761033118548888;0,0786228009616364;0,0822000539775377;0,0835495961304393
FR;1A3biii;EM;NH3;kt;0,0648050475972422;0,0641659708494252;0,0628742685944885;0,0625809234875114;0,0639199697210541;0,0632310341529855;0,0674957954203596;0,0710060514849693;0,0759325046755054;0,0793234481072275
FR;1A3biv;EM;NH3;kt;0,00897878203256165;0,00906597311219464;0,0088318577669772;0,00844352894464289;0,00799487068881562;0,00743908845043152;0,00716271582390663;0,00672025254304312;0,00644388014890651;0,00619624857184002
FR;1A3bv;EM;NH3;kt;NA;NA;NA;NA;NA;NA;NA;NA;NA;NA
FR;1A3bvi;EM;NH3;kt;NA;NA;NA;NA;NA;NA;NA;NA;NA;NA
FR;1A3bvii;EM;NH3;kt;NA;NA;NA;NA;NA;NA;NA;NA;NA;NA
FR;1A3c;EM;NH3;kt;0,003247335;0,0030758;0,0030444505;0,0029888495;0,0028445235;0,0027711775;0,002568293;0,002542267;0,0024801595;0,002426333
FR;1A3di(ii);EM;NH3;kt;NE;NE;NE;NE;NE;NE;NE;NE;NE;NE
FR;1A3dii;EM;NH3;kt;0,000708635229170032;0,000725944610002655;0,000734250396375014;0,000796884381625378;0,000834210933010377;0,000852765426993022;0,000899312218604121;0,000908357453242108;0,000942708461624679;0,000965594032417409
FR;1A3ei;EM;NH3;kt;NE;NE;NE;NE;NE;NE;NE;NE;NE;NE
FR;1A3eii;EM;NH3;kt;IE;IE;IE;IE;IE;IE;IE;IE;IE;IE
FR;1A4ai;EM;NH3;kt;0,0886883918245288;0,0880102017382479;0,0873371976947354;0,0936330433649045;0,100382735434418;0,107618990168095;0,115376882236557;0,123694014725804;0,132610701402187;0,142170162116272
FR;1A4aii;EM;NH3;kt;IE;IE;IE;IE;IE;IE;IE;IE;IE;IE
FR;1A4bi;EM;NH3;kt;21,0743910338429;19,2864199776936;19,3861758051244;22,9179774108539;22,8847191648991;25,8150107378597;24,7600407668924;26,1627929772601;21,9147472662862;22,5767079253203
FR;1A4bii;EM;NH3;kt;NE;NE;NE;NE;NE;NE;NE;NE;NE;NE
FR;1A4ci;EM;NH3;kt;0,06196464;0,06196464;0,06196464;0,06196464;0,06196464;0,06196464;0,06196464;0,06196464;0,06196464;0,06196464
FR;1A4cii;EM;NH3;kt;0,0190040804670375;0,0181805155200254;0,0183240949923308;0,018514834810429;0,0186163303029762;0,0187712099680883;0,0189850898022774;0,0191066834326221;0,0194365370877779;0,0195167034894458
FR;1A4ciii;EM;NH3;kt;0,00309551815353002;0,00282434013704143;0,00274341466551431;0,00264744097745127;0,00266011446970745;0,00273296325417249;0,00267361758383564;0,0027479622059443;0,00281464613027137;0,00295197474490004
FR;1A5a;EM;NH3;kt;IE;IE;IE;IE;IE;IE;IE;IE;IE;IE
FR;1A5b;EM;NH3;kt;IE;IE;IE;IE;IE;IE;IE;IE;IE;IE
FR;1B1a;EM;NH3;kt;NA;NA;NA;NA;NA;NA;NA;NA;NA;NA
FR;1B1b;EM;NH3;kt;0,0411366;0,0396751;0,0367595;0,0312946;0,0332963;0,0321567;0,0305546;0,0276168;0,0274836;0,0270914
FR;1B1c;EM;NH3;kt;NO;NO;NO;NO;NO;NO;NO;NO;NO;NO
FR;1B2ai;EM;NH3;kt;NA;NA;NA;NA;NA;NA;NA;NA;NA;NA
FR;1B2aiv;EM;NH3;kt;NA;NA;NA;NA;NA;NA;NA;NA;NA;NA
FR;1B2av;EM;NH3;kt;NA;NA;NA;NA;NA;NA;NA;NA;NA;NA
FR;1B2b;EM;NH3;kt;NA;NA;NA;NA;NA;NA;NA;NA;NA;NA
FR;1B2c;EM;NH3;kt;NE;NE;NE;NE;NE;NE;NE;NE;NE;NE
FR;1B2d;EM;NH3;kt;NO;NO;NO;NO;NO;NO;NO;NO;NO;NO
FR;2A1;EM;NH3;kt;NE;NE;NE;NE;NE;NE;NE;NE;NE;NE
FR;2A2;EM;NH3;kt;NA;NA;NA;NA;NA;NA;NA;NA;NA;NA
FR;2A3;EM;NH3;kt;NE;NE;NE;NE;NE;NE;NE;NE;NE;NE
FR;2A5a;EM;NH3;kt;NA;NA;NA;NA;NA;NA;NA;NA;NA;NA
FR;2A5b;EM;NH3;kt;NA;NA;NA;NA;NA;NA;NA;NA;NA;NA
FR;2A5c;EM;NH3;kt;NA;NA;NA;NA;NA;NA;NA;NA;NA;NA
FR;2A6;EM;NH3;kt;NA;NA;NA;NA;NA;NA;NA;NA;NA;NA
FR;2B1;EM;NH3;kt;2,32983967325736;2,33113727474238;2,33243559892504;2,33373464620784;2,3350344169935;2,33633491168498;2,33763613068546;2,34340807174888;2,11530096092249;1,70503139013453
FR;2B2;EM;NH3;kt;0,1371068;0,13330055;0,1296;0,132525;0,14985;0,168525;0,14805;0,16425;0,158625;0,158175
FR;2B3;EM;NH3;kt;NA;NA;NA;NA;NA;NA;NA;NA;NA;NA
FR;2B5;EM;NH3;kt;NA;NA;NA;NA;NA;NA;NA;NA;NA;NA
FR;2B6;EM;NH3;kt;NE;NE;NE;NE;NE;NE;NE;NE;NE;NE
FR;2B7;EM;NH3;kt;2,53483752236257;2,51586478214406;2,49689204192555;2,47791930170704;2,45894656148852;2,43997382127001;2,4210010810515;2,40202834083299;2,38305560061448;2,36408286039596
FR;2B10a;EM;NH3;kt;2,88659366656424;2,79940246502539;2,64229684430776;2,57729393849613;2,71431748808419;2,51006122612046;2,34866504776738;2,57431027969414;2,54228920376772;2,43178412405603
FR;2B10b;EM;NH3;kt;NA;NA;NA;NA;NA;NA;NA;NA;NA;NA
FR;2C1;EM;NH3;kt;NE;NE;NE;NE;NE;NE;NE;NE;NE;NE
FR;2C2;EM;NH3;kt;NE;NE;NE;NE;NE;NE;NE;NE;NE;NE
FR;2C3;EM;NH3;kt;NE;NE;NE;NE;NE;NE;NE;NE;NE;NE
FR;2C4;EM;NH3;kt;NE;NE;NE;NE;NE;NE;NE;NE;NE;NE
FR;2C5;EM;NH3;kt;NE;NE;NE;NE;NE;NE;NE;NE;NE;NE
FR;2C6;EM;NH3;kt;NE;NE;NE;NE;NE;NE;NE;NE;NE;NE
FR;2C7a;EM;NH3;kt;NE;NE;NE;NE;NE;NE;NE;NE;NE;NE
FR;2C7b;EM;NH3;kt;NE;NE;NE;NE;NE;NE;NE;NE;NE;NE
FR;2C7c;EM;NH3;kt;NO;NO;NO;NO;NO;NO;NO;NO;NO;NO
FR;2C7d;EM;NH3;kt;NA;NA;NA;NA;NA;NA;NA;NA;NA;NA
FR;2D3a;EM;NH3;kt;NA;NA;NA;NA;NA;NA;NA;NA;NA;NA
FR;2D3b;EM;NH3;kt;NA;NA;NA;NA;NA;NA;NA;NA;NA;NA
FR;2D3c;EM;NH3;kt;NA;NA;NA;NA;NA;NA;NA;NA;NA;NA
FR;2D3d;EM;NH3;kt;NA;NA;NA;NA;NA;NA;NA;NA;NA;NA
FR;2D3e;EM;NH3;kt;NA;NA;NA;NA;NA;NA;NA;NA;NA;NA
FR;2D3f;EM;NH3;kt;NA;NA;NA;NA;NA;NA;NA;NA;NA;NA
FR;2D3g;EM;NH3;kt;NA;NA;NA;NA;NA;NA;NA;NA;NA;NA
FR;2D3h;EM;NH3;kt;NA;NA;NA;NA;NA;NA;NA;NA;NA;NA
FR;2D3i;EM;NH3;kt;NA;NA;NA;NA;NA;NA;NA;NA;NA;NA
FR;2G;EM;NH3;kt;0,484246383710215;0,471006077770143;0,465125014987449;0,462197134249724;0,459267444150958;0,470334943347872;0,451926554062548;0,444589759328491;0,429891967012983;0,429935113296223
FR;2H1;EM;NH3;kt;NA;NA;NA;NA;NA;NA;NA;NA;NA;NA
FR;2H2;EM;NH3;kt;NA;NA;NA;NA;NA;NA;NA;NA;NA;NA
FR;2H3;EM;NH3;kt;0,172735179160303;0,172735179160303;0,172735179160303;0,172735179160303;0,172735179160303;0,172735179160303;0,172735179160303;0,172735179160303;0,172735179160303;0,172735179160303
FR;2I;EM;NH3;kt;NA;NA;NA;NA;NA;NA;NA;NA;NA;NA
FR;2J;EM;NH3;kt;NO;NO;NO;NO;NO;NO;NO;NO;NO;NO
FR;2K;EM;NH3;kt;NO;NO;NO;NO;NO;NO;NO;NO;NO;NO
FR;2L;EM;NH3;kt;NA;NA;NA;NA;NA;NA;NA;NA;NA;NA
FR;3B1a;EM;NH3;kt;103,700477555201;102,599383456467;102,542917092429;102,415867773344;96,6280654594818;93,4800656643811;90,755563599563;85,8429899282848;80,8598333019594;78,0775943799127
FR;3B1b;EM;NH3;kt;77,1230813991364;77,8480928509267;79,0358572458093;79,6589031310939;80,4395980957043;81,1241250150637;80,5805734774658;79,311783732785;78,1187123120083;79,3583812662261
FR;3B2;EM;NH3;kt;9,34567310253039;9,46279940698314;9,50735051665228;9,38591281448961;9,19621131525326;9,08770780622035;8,83117964248028;8,82327541334543;8,57824431016514;8,4658555132293
FR;3B3;EM;NH3;kt;39,4207272640298;40,1131585589411;39,4717191636204;39,6137463456524;39,3527328040811;39,6335925233551;41,8638778883444;42,5140926749847;41,0668479347094;41,6235824309358
FR;3B4a;EM;NH3;kt;NO;NO;NO;NO;NO;NO;NO;NO;NO;NO
FR;3B4d;EM;NH3;kt;3,23881362438451;3,27529261934942;3,28050390434441;3,2049402719171;3,09289764452487;3,08508071703239;3,14501049447475;3,19972898692211;3,17627820444467;3,23479311801088
FR;3B4e;EM;NH3;kt;1,99806103285847;2,02562049538066;2,06695968916394;2,12896847983886;2,17030767362214;2,20475700177487;2,24609619555815;2,28743538934143;2,19097727051377;2,19701279280613
FR;3B4f;EM;NH3;kt;0,0392462657891805;0,0376764151576133;0,0345367138944788;0,0329668632629116;0,0298271619997772;0,02825731136821;0,0266874607366427;0,0251176101050755;0,0204080582103739;0,0205540543191096
FR;3B4gi;EM;NH3;kt;11,0225015333508;11,3745078962349;11,6274956753612;11,7292013305915;11,5755008423703;11,2697121088114;11,0663007983508;10,9433672784886;9,8869451291153;9,85375979643119
FR;3B4gii;EM;NH3;kt;9,90065165883247;11,5388866469104;11,6185734456167;12,0493802011227;11,9179402913001;11,8400940844117;12,0245863466339;12,5544602499882;12,4421841490935;13,0827101017384
FR;3B4giii;EM;NH3;kt;6,17047741271167;6,51734173315586;6,46517543076634;6,77888622417938;6,90579649969647;7,21724952603571;7,38242301196151;7,63719420176361;7,81722141843814;8,15018264690153
FR;3B4giv;EM;NH3;kt;4,59716360049269;4,85558639691533;4,81672116648383;5,05044373673246;5,14499514015123;5,37703561614428;5,50009409063125;5,68990514768165;5,82403003174479;6,07209466880413
FR;3B4h;EM;NH3;kt;3,30095938517033;3,48651796635762;3,45861107456549;3,62643384069582;3,69432577790309;3,86094072867112;3,94930195780793;4,08559438605922;4,18190176889538;4,36002275022007
FR;3Da1;EM;NH3;kt;126,571388;128,490930833333;132,828142;138,8374155;142,5096655;147,591161333333;154,9969405;162,766269833333;168,120076833333;170,953964833333
FR;3Da2a;EM;NH3;kt;110,655967401057;111,722243496609;111,911677395849;112,703331488111;110,336287917114;109,577419219905;109,352253228257;107,509591362252;103,863186604313;103,882613781538
FR;3Da2b;EM;NH3;kt;1,82296295535191;1,86575583295786;1,90980489980207;1,9479878024473;1,9859342049367;2,02474275252246;2,06441503177685;2,10539151885528;2,14776221011883;2,14809558867114
FR;3Da2c;EM;NH3;kt;0,132875571403014;0,136157706746195;0,139522910326052;0,142973284533625;0,146510984969805;0,150183568592715;0,153947954696425;0,157806466728754;0,161761486942137;0,165815457881925
FR;3Da3;EM;NH3;kt;100,737120370735;101,100162323695;102,067197238515;102,735876972842;102,048356117228;101,933930023463;100,94240893428;98,7733892541387;96,6663124644184;96,8720778939543
FR;3Da4;EM;NH3;kt;NE;NE;NE;NE;NE;NE;NE;NE;NE;NE
FR;3Db;EM;NH3;kt;NA;NA;NA;NA;NA;NA;NA;NA;NA;NA
FR;3Dc;EM;NH3;kt;NA;NA;NA;NA;NA;NA;NA;NA;NA;NA
FR;3Dd;EM;NH3;kt;NA;NA;NA;NA;NA;NA;NA;NA;NA;NA
FR;3De;EM;NH3;kt;NE;NE;NE;NE;NE;NE;NE;NE;NE;NE
FR;3Df;EM;NH3;kt;NA;NA;NA;NA;NA;NA;NA;NA;NA;NA
FR;3F;EM;NH3;kt;1,46739458020022;1,48025770321693;1,49392611356775;1,48073013845294;1,52114482546039;1,54027845251865;1,55430118929648;1,58362438542224;1,5679695996473;1,57162635574563
FR;3I;EM;NH3;kt;NA;NA;NA;NA;NA;NA;NA;NA;NA;NA
FR;5A;EM;NH3;kt;NE;NE;NE;NE;NE;NE;NE;NE;NE;NE
FR;5B1;EM;NH3;kt;1,31357595523846;1,33554451982084;1,35806909131073;1,38116374180099;1,40484289953798;1,4354471544604;1,46666587786672;1,49851462146584;1,53100933056807;1,56416635404683
FR;5B2;EM;NH3;kt;NA;NA;NA;NA;NA;NA;NA;NA;0,00295908971693512;0,00591817943387024
FR;5C1a;EM;NH3;kt;NE;NE;NE;NE;NE;NE;NE;NE;NE;NE
FR;5C1bi;EM;NH3;kt;IE;IE;IE;IE;IE;IE;IE;IE;IE;IE
FR;5C1bii;EM;NH3;kt;NE;NE;NE;NE;NE;NE;NE;NE;NE;NE
FR;5C1biii;EM;NH3;kt;NE;NE;NE;NE;NE;NE;NE;NE;NE;NE
FR;5C1biv;EM;NH3;kt;NE;NE;NE;NE;NE;NE;NE;NE;NE;NE
FR;5C1bv;EM;NH3;kt;NE;NE;NE;NE;NE;NE;NE;NE;NE;NE
FR;5C1bvi;EM;NH3;kt;NO;NO;NO;NO;NO;NO;NO;NO;NO;NO
FR;5C2;EM;NH3;kt;NE;NE;NE;NE;NE;NE;NE;NE;NE;NE
FR;5D1;EM;NH3;kt;NO;NO;NO;NO;NO;NO;NO;NO;NO;NO
FR;5D2;EM;NH3;kt;NE;NE;NE;NE;NE;NE;NE;NE;NE;NE
FR;5D3;EM;NH3;kt;NO;NO;NO;NO;NO;NO;NO;NO;NO;NO
FR;5E;EM;NH3;kt;NA;NA;NA;NA;NA;NA;NA;NA;NA;NA
FR;6A;EM;NH3;kt;NO;NO;NO;NO;NO;NO;NO;NO;NO;NO
FR;1A3ai(ii);EM;NH3;kt;NE;NE;NE;NE;NE;NE;NE;NE;NE;NE
FR;1A3aii(ii);EM;NH3;kt;NE;NE;NE;NE;NE;NE;NE;NE;NE;NE
FR;1A3di(i);EM;NH3;kt;NE;NE;NE;NE;NE;NE;NE;NE;NE;NE
FR;1A5c;EM;NH3;kt;NO;NO;NO;NO;NO;NO;NO;NO;NO;NO
FR;6B;EM;NH3;kt;NA;NA;NA;NA;NA;NA;NA;NA;NA;NA
FR;11A;EM;NH3;kt;NO;NO;NO;NO;NO;NO;NO;NO;NO;NO
FR;11B;EM;NH3;kt;0,24084;0,24246;0,447618;0,620688;0,38832;0,521076;0,391416;0,151506;0,06708;0,78807
FR;11C;EM;NH3;kt;NA;NA;NA;NA;NA;NA;NA;NA;NA;NA
FR;1A1a;EM;PM2.5;kt;NR;NR;NR;NR;NR;NR;NR;NR;NR;NR
FR;1A1b;EM;PM2.5;kt;NR;NR;NR;NR;NR;NR;NR;NR;NR;NR
FR;1A1c;EM;PM2.5;kt;NR;NR;NR;NR;NR;NR;NR;NR;NR;NR
FR;1A2a;EM;PM2.5;kt;NR;NR;NR;NR;NR;NR;NR;NR;NR;NR
FR;1A2b;EM;PM2.5;kt;NR;NR;NR;NR;NR;NR;NR;NR;NR;NR
FR;1A2c;EM;PM2.5;kt;NR;NR;NR;NR;NR;NR;NR;NR;NR;NR
FR;1A2d;EM;PM2.5;kt;NR;NR;NR;NR;NR;NR;NR;NR;NR;NR
FR;1A2e;EM;PM2.5;kt;NR;NR;NR;NR;NR;NR;NR;NR;NR;NR
FR;1A2f;EM;PM2.5;kt;NR;NR;NR;NR;NR;NR;NR;NR;NR;NR
FR;1A2gvii;EM;PM2.5;kt;NR;NR;NR;NR;NR;NR;NR;NR;NR;NR
FR;1A2gviii;EM;PM2.5;kt;NR;NR;NR;NR;NR;NR;NR;NR;NR;NR
FR;1A3ai(i);EM;PM2.5;kt;NR;NR;NR;NR;NR;NR;NR;NR;NR;NR
FR;1A3aii(i);EM;PM2.5;kt;NR;NR;NR;NR;NR;NR;NR;NR;NR;NR
FR;1A3bi;EM;PM2.5;kt;NR;NR;NR;NR;NR;NR;NR;NR;NR;NR
FR;1A3bii;EM;PM2.5;kt;NR;NR;NR;NR;NR;NR;NR;NR;NR;NR
FR;1A3biii;EM;PM2.5;kt;NR;NR;NR;NR;NR;NR;NR;NR;NR;NR
FR;1A3biv;EM;PM2.5;kt;NR;NR;NR;NR;NR;NR;NR;NR;NR;NR
FR;1A3bv;EM;PM2.5;kt;NR;NR;NR;NR;NR;NR;NR;NR;NR;NR
FR;1A3bvi;EM;PM2.5;kt;NR;NR;NR;NR;NR;NR;NR;NR;NR;NR
FR;1A3bvii;EM;PM2.5;kt;NR;NR;NR;NR;NR;NR;NR;NR;NR;NR
FR;1A3c;EM;PM2.5;kt;NR;NR;NR;NR;NR;NR;NR;NR;NR;NR
FR;1A3di(ii);EM;PM2.5;kt;NR;NR;NR;NR;NR;NR;NR;NR;NR;NR
FR;1A3dii;EM;PM2.5;kt;NR;NR;NR;NR;NR;NR;NR;NR;NR;NR
FR;1A3ei;EM;PM2.5;kt;NR;NR;NR;NR;NR;NR;NR;NR;NR;NR
FR;1A3eii;EM;PM2.5;kt;NR;NR;NR;NR;NR;NR;NR;NR;NR;NR
FR;1A4ai;EM;PM2.5;kt;NR;NR;NR;NR;NR;NR;NR;NR;NR;NR
FR;1A4aii;EM;PM2.5;kt;NR;NR;NR;NR;NR;NR;NR;NR;NR;NR
FR;1A4bi;EM;PM2.5;kt;NR;NR;NR;NR;NR;NR;NR;NR;NR;NR
FR;1A4bii;EM;PM2.5;kt;NR;NR;NR;NR;NR;NR;NR;NR;NR;NR
FR;1A4ci;EM;PM2.5;kt;NR;NR;NR;NR;NR;NR;NR;NR;NR;NR
FR;1A4cii;EM;PM2.5;kt;NR;NR;NR;NR;NR;NR;NR;NR;NR;NR
FR;1A4ciii;EM;PM2.5;kt;NR;NR;NR;NR;NR;NR;NR;NR;NR;NR
FR;1A5a;EM;PM2.5;kt;NR;NR;NR;NR;NR;NR;NR;NR;NR;NR
FR;1A5b;EM;PM2.5;kt;NR;NR;NR;NR;NR;NR;NR;NR;NR;NR
FR;1B1a;EM;PM2.5;kt;NR;NR;NR;NR;NR;NR;NR;NR;NR;NR
FR;1B1b;EM;PM2.5;kt;NR;NR;NR;NR;NR;NR;NR;NR;NR;NR
FR;1B1c;EM;PM2.5;kt;NR;NR;NR;NR;NR;NR;NR;NR;NR;NR
FR;1B2ai;EM;PM2.5;kt;NR;NR;NR;NR;NR;NR;NR;NR;NR;NR
FR;1B2aiv;EM;PM2.5;kt;NR;NR;NR;NR;NR;NR;NR;NR;NR;NR
FR;1B2av;EM;PM2.5;kt;NR;NR;NR;NR;NR;NR;NR;NR;NR;NR
FR;1B2b;EM;PM2.5;kt;NR;NR;NR;NR;NR;NR;NR;NR;NR;NR
FR;1B2c;EM;PM2.5;kt;NR;NR;NR;NR;NR;NR;NR;NR;NR;NR
FR;1B2d;EM;PM2.5;kt;NR;NR;NR;NR;NR;NR;NR;NR;NR;NR
FR;2A1;EM;PM2.5;kt;NR;NR;NR;NR;NR;NR;NR;NR;NR;NR
FR;2A2;EM;PM2.5;kt;NR;NR;NR;NR;NR;NR;NR;NR;NR;NR
FR;2A3;EM;PM2.5;kt;NR;NR;NR;NR;NR;NR;NR;NR;NR;NR
FR;2A5a;EM;PM2.5;kt;NR;NR;NR;NR;NR;NR;NR;NR;NR;NR
FR;2A5b;EM;PM2.5;kt;NR;NR;NR;NR;NR;NR;NR;NR;NR;NR
FR;2A5c;EM;PM2.5;kt;NR;NR;NR;NR;NR;NR;NR;NR;NR;NR
FR;2A6;EM;PM2.5;kt;NR;NR;NR;NR;NR;NR;NR;NR;NR;NR
FR;2B1;EM;PM2.5;kt;NR;NR;NR;NR;NR;NR;NR;NR;NR;NR
FR;2B2;EM;PM2.5;kt;NR;NR;NR;NR;NR;NR;NR;NR;NR;NR
FR;2B3;EM;PM2.5;kt;NR;NR;NR;NR;NR;NR;NR;NR;NR;NR
FR;2B5;EM;PM2.5;kt;NR;NR;NR;NR;NR;NR;NR;NR;NR;NR
FR;2B6;EM;PM2.5;kt;NR;NR;NR;NR;NR;NR;NR;NR;NR;NR
FR;2B7;EM;PM2.5;kt;NR;NR;NR;NR;NR;NR;NR;NR;NR;NR
FR;2B10a;EM;PM2.5;kt;NR;NR;NR;NR;NR;NR;NR;NR;NR;NR
FR;2B10b;EM;PM2.5;kt;NR;NR;NR;NR;NR;NR;NR;NR;NR;NR
FR;2C1;EM;PM2.5;kt;NR;NR;NR;NR;NR;NR;NR;NR;NR;NR
FR;2C2;EM;PM2.5;kt;NR;NR;NR;NR;NR;NR;NR;NR;NR;NR
FR;2C3;EM;PM2.5;kt;NR;NR;NR;NR;NR;NR;NR;NR;NR;NR
FR;2C4;EM;PM2.5;kt;NR;NR;NR;NR;NR;NR;NR;NR;NR;NR
FR;2C5;EM;PM2.5;kt;NR;NR;NR;NR;NR;NR;NR;NR;NR;NR
FR;2C6;EM;PM2.5;kt;NR;NR;NR;NR;NR;NR;NR;NR;NR;NR
FR;2C7a;EM;PM2.5;kt;NR;NR;NR;NR;NR;NR;NR;NR;NR;NR
FR;2C7b;EM;PM2.5;kt;NR;NR;NR;NR;NR;NR;NR;NR;NR;NR
FR;2C7c;EM;PM2.5;kt;NR;NR;NR;NR;NR;NR;NR;NR;NR;NR
FR;2C7d;EM;PM2.5;kt;NR;NR;NR;NR;NR;NR;NR;NR;NR;NR
FR;2D3a;EM;PM2.5;kt;NR;NR;NR;NR;NR;NR;NR;NR;NR;NR
FR;2D3b;EM;PM2.5;kt;NR;NR;NR;NR;NR;NR;NR;NR;NR;NR
FR;2D3c;EM;PM2.5;kt;NR;NR;NR;NR;NR;NR;NR;NR;NR;NR
FR;2D3d;EM;PM2.5;kt;NR;NR;NR;NR;NR;NR;NR;NR;NR;NR
FR;2D3e;EM;PM2.5;kt;NR;NR;NR;NR;NR;NR;NR;NR;NR;NR
FR;2D3f;EM;PM2.5;kt;NR;NR;NR;NR;NR;NR;NR;NR;NR;NR
FR;2D3g;EM;PM2.5;kt;NR;NR;NR;NR;NR;NR;NR;NR;NR;NR
FR;2D3h;EM;PM2.5;kt;NR;NR;NR;NR;NR;NR;NR;NR;NR;NR
FR;2D3i;EM;PM2.5;kt;NR;NR;NR;NR;NR;NR;NR;NR;NR;NR
FR;2G;EM;PM2.5;kt;NR;NR;NR;NR;NR;NR;NR;NR;NR;NR
FR;2H1;EM;PM2.5;kt;NR;NR;NR;NR;NR;NR;NR;NR;NR;NR
FR;2H2;EM;PM2.5;kt;NR;NR;NR;NR;NR;NR;NR;NR;NR;NR
FR;2H3;EM;PM2.5;kt;NR;NR;NR;NR;NR;NR;NR;NR;NR;NR
FR;2I;EM;PM2.5;kt;NR;NR;NR;NR;NR;NR;NR;NR;NR;NR
FR;2J;EM;PM2.5;kt;NR;NR;NR;NR;NR;NR;NR;NR;NR;NR
FR;2K;EM;PM2.5;kt;NR;NR;NR;NR;NR;NR;NR;NR;NR;NR
FR;2L;EM;PM2.5;kt;NR;NR;NR;NR;NR;NR;NR;NR;NR;NR
FR;3B1a;EM;PM2.5;kt;NR;NR;NR;NR;NR;NR;NR;NR;NR;NR
FR;3B1b;EM;PM2.5;kt;NR;NR;NR;NR;NR;NR;NR;NR;NR;NR
FR;3B2;EM;PM2.5;kt;NR;NR;NR;NR;NR;NR;NR;NR;NR;NR
FR;3B3;EM;PM2.5;kt;NR;NR;NR;NR;NR;NR;NR;NR;NR;NR
FR;3B4a;EM;PM2.5;kt;NR;NR;NR;NR;NR;NR;NR;NR;NR;NR
FR;3B4d;EM;PM2.5;kt;NR;NR;NR;NR;NR;NR;NR;NR;NR;NR
FR;3B4e;EM;PM2.5;kt;NR;NR;NR;NR;NR;NR;NR;NR;NR;NR
FR;3B4f;EM;PM2.5;kt;NR;NR;NR;NR;NR;NR;NR;NR;NR;NR
FR;3B4gi;EM;PM2.5;kt;NR;NR;NR;NR;NR;NR;NR;NR;NR;NR
FR;3B4gii;EM;PM2.5;kt;NR;NR;NR;NR;NR;NR;NR;NR;NR;NR
FR;3B4giii;EM;PM2.5;kt;NR;NR;NR;NR;NR;NR;NR;NR;NR;NR
FR;3B4giv;EM;PM2.5;kt;NR;NR;NR;NR;NR;NR;NR;NR;NR;NR
FR;3B4h;EM;PM2.5;kt;NR;NR;NR;NR;NR;NR;NR;NR;NR;NR
FR;3Da1;EM;PM2.5;kt;NR;NR;NR;NR;NR;NR;NR;NR;NR;NR
FR;3Da2a;EM;PM2.5;kt;NR;NR;NR;NR;NR;NR;NR;NR;NR;NR
FR;3Da2b;EM;PM2.5;kt;NR;NR;NR;NR;NR;NR;NR;NR;NR;NR
FR;3Da2c;EM;PM2.5;kt;NR;NR;NR;NR;NR;NR;NR;NR;NR;NR
FR;3Da3;EM;PM2.5;kt;NR;NR;NR;NR;NR;NR;NR;NR;NR;NR
FR;3Da4;EM;PM2.5;kt;NR;NR;NR;NR;NR;NR;NR;NR;NR;NR
FR;3Db;EM;PM2.5;kt;NR;NR;NR;NR;NR;NR;NR;NR;NR;NR
FR;3Dc;EM;PM2.5;kt;NR;NR;NR;NR;NR;NR;NR;NR;NR;NR
FR;3Dd;EM;PM2.5;kt;NR;NR;NR;NR;NR;NR;NR;NR;NR;NR
FR;3De;EM;PM2.5;kt;NR;NR;NR;NR;NR;NR;NR;NR;NR;NR
FR;3Df;EM;PM2.5;kt;NR;NR;NR;NR;NR;NR;NR;NR;NR;NR
FR;3F;EM;PM2.5;kt;NR;NR;NR;NR;NR;NR;NR;NR;NR;NR
FR;3I;EM;PM2.5;kt;NR;NR;NR;NR;NR;NR;NR;NR;NR;NR
FR;5A;EM;PM2.5;kt;NR;NR;NR;NR;NR;NR;NR;NR;NR;NR
FR;5B1;EM;PM2.5;kt;NR;NR;NR;NR;NR;NR;NR;NR;NR;NR
FR;5B2;EM;PM2.5;kt;NR;NR;NR;NR;NR;NR;NR;NR;NR;NR
FR;5C1a;EM;PM2.5;kt;NR;NR;NR;NR;NR;NR;NR;NR;NR;NR
FR;5C1bi;EM;PM2.5;kt;NR;NR;NR;NR;NR;NR;NR;NR;NR;NR
FR;5C1bii;EM;PM2.5;kt;NR;NR;NR;NR;NR;NR;NR;NR;NR;NR
FR;5C1biii;EM;PM2.5;kt;NR;NR;NR;NR;NR;NR;NR;NR;NR;NR
FR;5C1biv;EM;PM2.5;kt;NR;NR;NR;NR;NR;NR;NR;NR;NR;NR
FR;5C1bv;EM;PM2.5;kt;NR;NR;NR;NR;NR;NR;NR;NR;NR;NR
FR;5C1bvi;EM;PM2.5;kt;NR;NR;NR;NR;NR;NR;NR;NR;NR;NR
FR;5C2;EM;PM2.5;kt;NR;NR;NR;NR;NR;NR;NR;NR;NR;NR
FR;5D1;EM;PM2.5;kt;NR;NR;NR;NR;NR;NR;NR;NR;NR;NR
FR;5D2;EM;PM2.5;kt;NR;NR;NR;NR;NR;NR;NR;NR;NR;NR
FR;5D3;EM;PM2.5;kt;NR;NR;NR;NR;NR;NR;NR;NR;NR;NR
FR;5E;EM;PM2.5;kt;NR;NR;NR;NR;NR;NR;NR;NR;NR;NR
FR;6A;EM;PM2.5;kt;NR;NR;NR;NR;NR;NR;NR;NR;NR;NR
FR;1A3ai(ii);EM;PM2.5;kt;NR;NR;NR;NR;NR;NR;NR;NR;NR;NR
FR;1A3aii(ii);EM;PM2.5;kt;NR;NR;NR;NR;NR;NR;NR;NR;NR;NR
FR;1A3di(i);EM;PM2.5;kt;NR;NR;NR;NR;NR;NR;NR;NR;NR;NR
FR;1A5c;EM;PM2.5;kt;NR;NR;NR;NR;NR;NR;NR;NR;NR;NR
FR;6B;EM;PM2.5;kt;NR;NR;NR;NR;NR;NR;NR;NR;NR;NR
FR;11A;EM;PM2.5;kt;NR;NR;NR;NR;NR;NR;NR;NR;NR;NR
FR;11B;EM;PM2.5;kt;NR;NR;NR;NR;NR;NR;NR;NR;NR;NR
FR;11C;EM;PM2.5;kt;NR;NR;NR;NR;NR;NR;NR;NR;NR;NR
FR;1A1a;EM;PM10;kt;NR;NR;NR;NR;NR;NR;NR;NR;NR;NR
FR;1A1b;EM;PM10;kt;NR;NR;NR;NR;NR;NR;NR;NR;NR;NR
FR;1A1c;EM;PM10;kt;NR;NR;NR;NR;NR;NR;NR;NR;NR;NR
FR;1A2a;EM;PM10;kt;NR;NR;NR;NR;NR;NR;NR;NR;NR;NR
FR;1A2b;EM;PM10;kt;NR;NR;NR;NR;NR;NR;NR;NR;NR;NR
FR;1A2c;EM;PM10;kt;NR;NR;NR;NR;NR;NR;NR;NR;NR;NR
FR;1A2d;EM;PM10;kt;NR;NR;NR;NR;NR;NR;NR;NR;NR;NR
FR;1A2e;EM;PM10;kt;NR;NR;NR;NR;NR;NR;NR;NR;NR;NR
FR;1A2f;EM;PM10;kt;NR;NR;NR;NR;NR;NR;NR;NR;NR;NR
FR;1A2gvii;EM;PM10;kt;NR;NR;NR;NR;NR;NR;NR;NR;NR;NR
FR;1A2gviii;EM;PM10;kt;NR;NR;NR;NR;NR;NR;NR;NR;NR;NR
FR;1A3ai(i);EM;PM10;kt;NR;NR;NR;NR;NR;NR;NR;NR;NR;NR
FR;1A3aii(i);EM;PM10;kt;NR;NR;NR;NR;NR;NR;NR;NR;NR;NR
FR;1A3bi;EM;PM10;kt;NR;NR;NR;NR;NR;NR;NR;NR;NR;NR
FR;1A3bii;EM;PM10;kt;NR;NR;NR;NR;NR;NR;NR;NR;NR;NR
FR;1A3biii;EM;PM10;kt;NR;NR;NR;NR;NR;NR;NR;NR;NR;NR
FR;1A3biv;EM;PM10;kt;NR;NR;NR;NR;NR;NR;NR;NR;NR;NR
FR;1A3bv;EM;PM10;kt;NR;NR;NR;NR;NR;NR;NR;NR;NR;NR
FR;1A3bvi;EM;PM10;kt;NR;NR;NR;NR;NR;NR;NR;NR;NR;NR
FR;1A3bvii;EM;PM10;kt;NR;NR;NR;NR;NR;NR;NR;NR;NR;NR
FR;1A3c;EM;PM10;kt;NR;NR;NR;NR;NR;NR;NR;NR;NR;NR
FR;1A3di(ii);EM;PM10;kt;NR;NR;NR;NR;NR;NR;NR;NR;NR;NR
FR;1A3dii;EM;PM10;kt;NR;NR;NR;NR;NR;NR;NR;NR;NR;NR
FR;1A3ei;EM;PM10;kt;NR;NR;NR;NR;NR;NR;NR;NR;NR;NR
FR;1A3eii;EM;PM10;kt;NR;NR;NR;NR;NR;NR;NR;NR;NR;NR
FR;1A4ai;EM;PM10;kt;NR;NR;NR;NR;NR;NR;NR;NR;NR;NR
FR;1A4aii;EM;PM10;kt;NR;NR;NR;NR;NR;NR;NR;NR;NR;NR
FR;1A4bi;EM;PM10;kt;NR;NR;NR;NR;NR;NR;NR;NR;NR;NR
FR;1A4bii;EM;PM10;kt;NR;NR;NR;NR;NR;NR;NR;NR;NR;NR
FR;1A4ci;EM;PM10;kt;NR;NR;NR;NR;NR;NR;NR;NR;NR;NR
FR;1A4cii;EM;PM10;kt;NR;NR;NR;NR;NR;NR;NR;NR;NR;NR
FR;1A4ciii;EM;PM10;kt;NR;NR;NR;NR;NR;NR;NR;NR;NR;NR
FR;1A5a;EM;PM10;kt;NR;NR;NR;NR;NR;NR;NR;NR;NR;NR
FR;1A5b;EM;PM10;kt;NR;NR;NR;NR;NR;NR;NR;NR;NR;NR
FR;1B1a;EM;PM10;kt;NR;NR;NR;NR;NR;NR;NR;NR;NR;NR
FR;1B1b;EM;PM10;kt;NR;NR;NR;NR;NR;NR;NR;NR;NR;NR
FR;1B1c;EM;PM10;kt;NR;NR;NR;NR;NR;NR;NR;NR;NR;NR
FR;1B2ai;EM;PM10;kt;NR;NR;NR;NR;NR;NR;NR;NR;NR;NR
FR;1B2aiv;EM;PM10;kt;NR;NR;NR;NR;NR;NR;NR;NR;NR;NR
FR;1B2av;EM;PM10;kt;NR;NR;NR;NR;NR;NR;NR;NR;NR;NR
FR;1B2b;EM;PM10;kt;NR;NR;NR;NR;NR;NR;NR;NR;NR;NR
FR;1B2c;EM;PM10;kt;NR;NR;NR;NR;NR;NR;NR;NR;NR;NR
FR;1B2d;EM;PM10;kt;NR;NR;NR;NR;NR;NR;NR;NR;NR;NR
FR;2A1;EM;PM10;kt;NR;NR;NR;NR;NR;NR;NR;NR;NR;NR
FR;2A2;EM;PM10;kt;NR;NR;NR;NR;NR;NR;NR;NR;NR;NR
FR;2A3;EM;PM10;kt;NR;NR;NR;NR;NR;NR;NR;NR;NR;NR
FR;2A5a;EM;PM10;kt;NR;NR;NR;NR;NR;NR;NR;NR;NR;NR
FR;2A5b;EM;PM10;kt;NR;NR;NR;NR;NR;NR;NR;NR;NR;NR
FR;2A5c;EM;PM10;kt;NR;NR;NR;NR;NR;NR;NR;NR;NR;NR
FR;2A6;EM;PM10;kt;NR;NR;NR;NR;NR;NR;NR;NR;NR;NR
FR;2B1;EM;PM10;kt;NR;NR;NR;NR;NR;NR;NR;NR;NR;NR
FR;2B2;EM;PM10;kt;NR;NR;NR;NR;NR;NR;NR;NR;NR;NR
FR;2B3;EM;PM10;kt;NR;NR;NR;NR;NR;NR;NR;NR;NR;NR
FR;2B5;EM;PM10;kt;NR;NR;NR;NR;NR;NR;NR;NR;NR;NR
FR;2B6;EM;PM10;kt;NR;NR;NR;NR;NR;NR;NR;NR;NR;NR
FR;2B7;EM;PM10;kt;NR;NR;NR;NR;NR;NR;NR;NR;NR;NR
FR;2B10a;EM;PM10;kt;NR;NR;NR;NR;NR;NR;NR;NR;NR;NR
FR;2B10b;EM;PM10;kt;NR;NR;NR;NR;NR;NR;NR;NR;NR;NR
FR;2C1;EM;PM10;kt;NR;NR;NR;NR;NR;NR;NR;NR;NR;NR
FR;2C2;EM;PM10;kt;NR;NR;NR;NR;NR;NR;NR;NR;NR;NR
FR;2C3;EM;PM10;kt;NR;NR;NR;NR;NR;NR;NR;NR;NR;NR
FR;2C4;EM;PM10;kt;NR;NR;NR;NR;NR;NR;NR;NR;NR;NR
FR;2C5;EM;PM10;kt;NR;NR;NR;NR;NR;NR;NR;NR;NR;NR
FR;2C6;EM;PM10;kt;NR;NR;NR;NR;NR;NR;NR;NR;NR;NR
FR;2C7a;EM;PM10;kt;NR;NR;NR;NR;NR;NR;NR;NR;NR;NR
FR;2C7b;EM;PM10;kt;NR;NR;NR;NR;NR;NR;NR;NR;NR;NR
FR;2C7c;EM;PM10;kt;NR;NR;NR;NR;NR;NR;NR;NR;NR;NR
FR;2C7d;EM;PM10;kt;NR;NR;NR;NR;NR;NR;NR;NR;NR;NR
FR;2D3a;EM;PM10;kt;NR;NR;NR;NR;NR;NR;NR;NR;NR;NR
FR;2D3b;EM;PM10;kt;NR;NR;NR;NR;NR;NR;NR;NR;NR;NR
FR;2D3c;EM;PM10;kt;NR;NR;NR;NR;NR;NR;NR;NR;NR;NR
FR;2D3d;EM;PM10;kt;NR;NR;NR;NR;NR;NR;NR;NR;NR;NR
FR;2D3e;EM;PM10;kt;NR;NR;NR;NR;NR;NR;NR;NR;NR;NR
FR;2D3f;EM;PM10;kt;NR;NR;NR;NR;NR;NR;NR;NR;NR;NR
FR;2D3g;EM;PM10;kt;NR;NR;NR;NR;NR;NR;NR;NR;NR;NR
FR;2D3h;EM;PM10;kt;NR;NR;NR;NR;NR;NR;NR;NR;NR;NR
FR;2D3i;EM;PM10;kt;NR;NR;NR;NR;NR;NR;NR;NR;NR;NR
FR;2G;EM;PM10;kt;NR;NR;NR;NR;NR;NR;NR;NR;NR;NR
FR;2H1;EM;PM10;kt;NR;NR;NR;NR;NR;NR;NR;NR;NR;NR
FR;2H2;EM;PM10;kt;NR;NR;NR;NR;NR;NR;NR;NR;NR;NR
FR;2H3;EM;PM10;kt;NR;NR;NR;NR;NR;NR;NR;NR;NR;NR
FR;2I;EM;PM10;kt;NR;NR;NR;NR;NR;NR;NR;NR;NR;NR
FR;2J;EM;PM10;kt;NR;NR;NR;NR;NR;NR;NR;NR;NR;NR
FR;2K;EM;PM10;kt;NR;NR;NR;NR;NR;NR;NR;NR;NR;NR
FR;2L;EM;PM10;kt;NR;NR;NR;NR;NR;NR;NR;NR;NR;NR
FR;3B1a;EM;PM10;kt;NR;NR;NR;NR;NR;NR;NR;NR;NR;NR
FR;3B1b;EM;PM10;kt;NR;NR;NR;NR;NR;NR;NR;NR;NR;NR
FR;3B2;EM;PM10;kt;NR;NR;NR;NR;NR;NR;NR;NR;NR;NR
FR;3B3;EM;PM10;kt;NR;NR;NR;NR;NR;NR;NR;NR;NR;NR
FR;3B4a;EM;PM10;kt;NR;NR;NR;NR;NR;NR;NR;NR;NR;NR
FR;3B4d;EM;PM10;kt;NR;NR;NR;NR;NR;NR;NR;NR;NR;NR
FR;3B4e;EM;PM10;kt;NR;NR;NR;NR;NR;NR;NR;NR;NR;NR
FR;3B4f;EM;PM10;kt;NR;NR;NR;NR;NR;NR;NR;NR;NR;NR
FR;3B4gi;EM;PM10;kt;NR;NR;NR;NR;NR;NR;NR;NR;NR;NR
FR;3B4gii;EM;PM10;kt;NR;NR;NR;NR;NR;NR;NR;NR;NR;NR
FR;3B4giii;EM;PM10;kt;NR;NR;NR;NR;NR;NR;NR;NR;NR;NR
FR;3B4giv;EM;PM10;kt;NR;NR;NR;NR;NR;NR;NR;NR;NR;NR
FR;3B4h;EM;PM10;kt;NR;NR;NR;NR;NR;NR;NR;NR;NR;NR
FR;3Da1;EM;PM10;kt;NR;NR;NR;NR;NR;NR;NR;NR;NR;NR
FR;3Da2a;EM;PM10;kt;NR;NR;NR;NR;NR;NR;NR;NR;NR;NR
FR;3Da2b;EM;PM10;kt;NR;NR;NR;NR;NR;NR;NR;NR;NR;NR
FR;3Da2c;EM;PM10;kt;NR;NR;NR;NR;NR;NR;NR;NR;NR;NR
FR;3Da3;EM;PM10;kt;NR;NR;NR;NR;NR;NR;NR;NR;NR;NR
FR;3Da4;EM;PM10;kt;NR;NR;NR;NR;NR;NR;NR;NR;NR;NR
FR;3Db;EM;PM10;kt;NR;NR;NR;NR;NR;NR;NR;NR;NR;NR
FR;3Dc;EM;PM10;kt;NR;NR;NR;NR;NR;NR;NR;NR;NR;NR
FR;3Dd;EM;PM10;kt;NR;NR;NR;NR;NR;NR;NR;NR;NR;NR
FR;3De;EM;PM10;kt;NR;NR;NR;NR;NR;NR;NR;NR;NR;NR
FR;3Df;EM;PM10;kt;NR;NR;NR;NR;NR;NR;NR;NR;NR;NR
FR;3F;EM;PM10;kt;NR;NR;NR;NR;NR;NR;NR;NR;NR;NR
FR;3I;EM;PM10;kt;NR;NR;NR;NR;NR;NR;NR;NR;NR;NR
FR;5A;EM;PM10;kt;NR;NR;NR;NR;NR;NR;NR;NR;NR;NR
FR;5B1;EM;PM10;kt;NR;NR;NR;NR;NR;NR;NR;NR;NR;NR
FR;5B2;EM;PM10;kt;NR;NR;NR;NR;NR;NR;NR;NR;NR;NR
FR;5C1a;EM;PM10;kt;NR;NR;NR;NR;NR;NR;NR;NR;NR;NR
FR;5C1bi;EM;PM10;kt;NR;NR;NR;NR;NR;NR;NR;NR;NR;NR
FR;5C1bii;EM;PM10;kt;NR;NR;NR;NR;NR;NR;NR;NR;NR;NR
FR;5C1biii;EM;PM10;kt;NR;NR;NR;NR;NR;NR;NR;NR;NR;NR
FR;5C1biv;EM;PM10;kt;NR;NR;NR;NR;NR;NR;NR;NR;NR;NR
FR;5C1bv;EM;PM10;kt;NR;NR;NR;NR;NR;NR;NR;NR;NR;NR
FR;5C1bvi;EM;PM10;kt;NR;NR;NR;NR;NR;NR;NR;NR;NR;NR
FR;5C2;EM;PM10;kt;NR;NR;NR;NR;NR;NR;NR;NR;NR;NR
FR;5D1;EM;PM10;kt;NR;NR;NR;NR;NR;NR;NR;NR;NR;NR
FR;5D2;EM;PM10;kt;NR;NR;NR;NR;NR;NR;NR;NR;NR;NR
FR;5D3;EM;PM10;kt;NR;NR;NR;NR;NR;NR;NR;NR;NR;NR
FR;5E;EM;PM10;kt;NR;NR;NR;NR;NR;NR;NR;NR;NR;NR
FR;6A;EM;PM10;kt;NR;NR;NR;NR;NR;NR;NR;NR;NR;NR
FR;1A3ai(ii);EM;PM10;kt;NR;NR;NR;NR;NR;NR;NR;NR;NR;NR
FR;1A3aii(ii);EM;PM10;kt;NR;NR;NR;NR;NR;NR;NR;NR;NR;NR
FR;1A3di(i);EM;PM10;kt;NR;NR;NR;NR;NR;NR;NR;NR;NR;NR
FR;1A5c;EM;PM10;kt;NR;NR;NR;NR;NR;NR;NR;NR;NR;NR
FR;6B;EM;PM10;kt;NR;NR;NR;NR;NR;NR;NR;NR;NR;NR
FR;11A;EM;PM10;kt;NR;NR;NR;NR;NR;NR;NR;NR;NR;NR
FR;11B;EM;PM10;kt;NR;NR;NR;NR;NR;NR;NR;NR;NR;NR
FR;11C;EM;PM10;kt;NR;NR;NR;NR;NR;NR;NR;NR;NR;NR
FR;1A1a;EM;TSP;kt;NR;NR;NR;NR;NR;NR;NR;NR;NR;NR
FR;1A1b;EM;TSP;kt;NR;NR;NR;NR;NR;NR;NR;NR;NR;NR
FR;1A1c;EM;TSP;kt;NR;NR;NR;NR;NR;NR;NR;NR;NR;NR
FR;1A2a;EM;TSP;kt;NR;NR;NR;NR;NR;NR;NR;NR;NR;NR
FR;1A2b;EM;TSP;kt;NR;NR;NR;NR;NR;NR;NR;NR;NR;NR
FR;1A2c;EM;TSP;kt;NR;NR;NR;NR;NR;NR;NR;NR;NR;NR
FR;1A2d;EM;TSP;kt;NR;NR;NR;NR;NR;NR;NR;NR;NR;NR
FR;1A2e;EM;TSP;kt;NR;NR;NR;NR;NR;NR;NR;NR;NR;NR
FR;1A2f;EM;TSP;kt;NR;NR;NR;NR;NR;NR;NR;NR;NR;NR
FR;1A2gvii;EM;TSP;kt;NR;NR;NR;NR;NR;NR;NR;NR;NR;NR
FR;1A2gviii;EM;TSP;kt;NR;NR;NR;NR;NR;NR;NR;NR;NR;NR
FR;1A3ai(i);EM;TSP;kt;NR;NR;NR;NR;NR;NR;NR;NR;NR;NR
FR;1A3aii(i);EM;TSP;kt;NR;NR;NR;NR;NR;NR;NR;NR;NR;NR
FR;1A3bi;EM;TSP;kt;NR;NR;NR;NR;NR;NR;NR;NR;NR;NR
FR;1A3bii;EM;TSP;kt;NR;NR;NR;NR;NR;NR;NR;NR;NR;NR
FR;1A3biii;EM;TSP;kt;NR;NR;NR;NR;NR;NR;NR;NR;NR;NR
FR;1A3biv;EM;TSP;kt;NR;NR;NR;NR;NR;NR;NR;NR;NR;NR
FR;1A3bv;EM;TSP;kt;NR;NR;NR;NR;NR;NR;NR;NR;NR;NR
FR;1A3bvi;EM;TSP;kt;NR;NR;NR;NR;NR;NR;NR;NR;NR;NR
FR;1A3bvii;EM;TSP;kt;NR;NR;NR;NR;NR;NR;NR;NR;NR;NR
FR;1A3c;EM;TSP;kt;NR;NR;NR;NR;NR;NR;NR;NR;NR;NR
FR;1A3di(ii);EM;TSP;kt;NR;NR;NR;NR;NR;NR;NR;NR;NR;NR
FR;1A3dii;EM;TSP;kt;NR;NR;NR;NR;NR;NR;NR;NR;NR;NR
FR;1A3ei;EM;TSP;kt;NR;NR;NR;NR;NR;NR;NR;NR;NR;NR
FR;1A3eii;EM;TSP;kt;NR;NR;NR;NR;NR;NR;NR;NR;NR;NR
FR;1A4ai;EM;TSP;kt;NR;NR;NR;NR;NR;NR;NR;NR;NR;NR
FR;1A4aii;EM;TSP;kt;NR;NR;NR;NR;NR;NR;NR;NR;NR;NR
FR;1A4bi;EM;TSP;kt;NR;NR;NR;NR;NR;NR;NR;NR;NR;NR
FR;1A4bii;EM;TSP;kt;NR;NR;NR;NR;NR;NR;NR;NR;NR;NR
FR;1A4ci;EM;TSP;kt;NR;NR;NR;NR;NR;NR;NR;NR;NR;NR
FR;1A4cii;EM;TSP;kt;NR;NR;NR;NR;NR;NR;NR;NR;NR;NR
FR;1A4ciii;EM;TSP;kt;NR;NR;NR;NR;NR;NR;NR;NR;NR;NR
FR;1A5a;EM;TSP;kt;NR;NR;NR;NR;NR;NR;NR;NR;NR;NR
FR;1A5b;EM;TSP;kt;NR;NR;NR;NR;NR;NR;NR;NR;NR;NR
FR;1B1a;EM;TSP;kt;NR;NR;NR;NR;NR;NR;NR;NR;NR;NR
FR;1B1b;EM;TSP;kt;NR;NR;NR;NR;NR;NR;NR;NR;NR;NR
FR;1B1c;EM;TSP;kt;NR;NR;NR;NR;NR;NR;NR;NR;NR;NR
FR;1B2ai;EM;TSP;kt;NR;NR;NR;NR;NR;NR;NR;NR;NR;NR
FR;1B2aiv;EM;TSP;kt;NR;NR;NR;NR;NR;NR;NR;NR;NR;NR
FR;1B2av;EM;TSP;kt;NR;NR;NR;NR;NR;NR;NR;NR;NR;NR
FR;1B2b;EM;TSP;kt;NR;NR;NR;NR;NR;NR;NR;NR;NR;NR
FR;1B2c;EM;TSP;kt;NR;NR;NR;NR;NR;NR;NR;NR;NR;NR
FR;1B2d;EM;TSP;kt;NR;NR;NR;NR;NR;NR;NR;NR;NR;NR
FR;2A1;EM;TSP;kt;NR;NR;NR;NR;NR;NR;NR;NR;NR;NR
FR;2A2;EM;TSP;kt;NR;NR;NR;NR;NR;NR;NR;NR;NR;NR
FR;2A3;EM;TSP;kt;NR;NR;NR;NR;NR;NR;NR;NR;NR;NR
FR;2A5a;EM;TSP;kt;NR;NR;NR;NR;NR;NR;NR;NR;NR;NR
FR;2A5b;EM;TSP;kt;NR;NR;NR;NR;NR;NR;NR;NR;NR;NR
FR;2A5c;EM;TSP;kt;NR;NR;NR;NR;NR;NR;NR;NR;NR;NR
FR;2A6;EM;TSP;kt;NR;NR;NR;NR;NR;NR;NR;NR;NR;NR
FR;2B1;EM;TSP;kt;NR;NR;NR;NR;NR;NR;NR;NR;NR;NR
FR;2B2;EM;TSP;kt;NR;NR;NR;NR;NR;NR;NR;NR;NR;NR
FR;2B3;EM;TSP;kt;NR;NR;NR;NR;NR;NR;NR;NR;NR;NR
FR;2B5;EM;TSP;kt;NR;NR;NR;NR;NR;NR;NR;NR;NR;NR
FR;2B6;EM;TSP;kt;NR;NR;NR;NR;NR;NR;NR;NR;NR;NR
FR;2B7;EM;TSP;kt;NR;NR;NR;NR;NR;NR;NR;NR;NR;NR
FR;2B10a;EM;TSP;kt;NR;NR;NR;NR;NR;NR;NR;NR;NR;NR
FR;2B10b;EM;TSP;kt;NR;NR;NR;NR;NR;NR;NR;NR;NR;NR
FR;2C1;EM;TSP;kt;NR;NR;NR;NR;NR;NR;NR;NR;NR;NR
FR;2C2;EM;TSP;kt;NR;NR;NR;NR;NR;NR;NR;NR;NR;NR
FR;2C3;EM;TSP;kt;NR;NR;NR;NR;NR;NR;NR;NR;NR;NR
FR;2C4;EM;TSP;kt;NR;NR;NR;NR;NR;NR;NR;NR;NR;NR
FR;2C5;EM;TSP;kt;NR;NR;NR;NR;NR;NR;NR;NR;NR;NR
FR;2C6;EM;TSP;kt;NR;NR;NR;NR;NR;NR;NR;NR;NR;NR
FR;2C7a;EM;TSP;kt;NR;NR;NR;NR;NR;NR;NR;NR;NR;NR
FR;2C7b;EM;TSP;kt;NR;NR;NR;NR;NR;NR;NR;NR;NR;NR
FR;2C7c;EM;TSP;kt;NR;NR;NR;NR;NR;NR;NR;NR;NR;NR
FR;2C7d;EM;TSP;kt;NR;NR;NR;NR;NR;NR;NR;NR;NR;NR
FR;2D3a;EM;TSP;kt;NR;NR;NR;NR;NR;NR;NR;NR;NR;NR
FR;2D3b;EM;TSP;kt;NR;NR;NR;NR;NR;NR;NR;NR;NR;NR
FR;2D3c;EM;TSP;kt;NR;NR;NR;NR;NR;NR;NR;NR;NR;NR
FR;2D3d;EM;TSP;kt;NR;NR;NR;NR;NR;NR;NR;NR;NR;NR
FR;2D3e;EM;TSP;kt;NR;NR;NR;NR;NR;NR;NR;NR;NR;NR
FR;2D3f;EM;TSP;kt;NR;NR;NR;NR;NR;NR;NR;NR;NR;NR
FR;2D3g;EM;TSP;kt;NR;NR;NR;NR;NR;NR;NR;NR;NR;NR
FR;2D3h;EM;TSP;kt;NR;NR;NR;NR;NR;NR;NR;NR;NR;NR
FR;2D3i;EM;TSP;kt;NR;NR;NR;NR;NR;NR;NR;NR;NR;NR
FR;2G;EM;TSP;kt;NR;NR;NR;NR;NR;NR;NR;NR;NR;NR
FR;2H1;EM;TSP;kt;NR;NR;NR;NR;NR;NR;NR;NR;NR;NR
FR;2H2;EM;TSP;kt;NR;NR;NR;NR;NR;NR;NR;NR;NR;NR
FR;2H3;EM;TSP;kt;NR;NR;NR;NR;NR;NR;NR;NR;NR;NR
FR;2I;EM;TSP;kt;NR;NR;NR;NR;NR;NR;NR;NR;NR;NR
FR;2J;EM;TSP;kt;NR;NR;NR;NR;NR;NR;NR;NR;NR;NR
FR;2K;EM;TSP;kt;NR;NR;NR;NR;NR;NR;NR;NR;NR;NR
FR;2L;EM;TSP;kt;NR;NR;NR;NR;NR;NR;NR;NR;NR;NR
FR;3B1a;EM;TSP;kt;NR;NR;NR;NR;NR;NR;NR;NR;NR;NR
FR;3B1b;EM;TSP;kt;NR;NR;NR;NR;NR;NR;NR;NR;NR;NR
FR;3B2;EM;TSP;kt;NR;NR;NR;NR;NR;NR;NR;NR;NR;NR
FR;3B3;EM;TSP;kt;NR;NR;NR;NR;NR;NR;NR;NR;NR;NR
FR;3B4a;EM;TSP;kt;NR;NR;NR;NR;NR;NR;NR;NR;NR;NR
FR;3B4d;EM;TSP;kt;NR;NR;NR;NR;NR;NR;NR;NR;NR;NR
FR;3B4e;EM;TSP;kt;NR;NR;NR;NR;NR;NR;NR;NR;NR;NR
FR;3B4f;EM;TSP;kt;NR;NR;NR;NR;NR;NR;NR;NR;NR;NR
FR;3B4gi;EM;TSP;kt;NR;NR;NR;NR;NR;NR;NR;NR;NR;NR
FR;3B4gii;EM;TSP;kt;NR;NR;NR;NR;NR;NR;NR;NR;NR;NR
FR;3B4giii;EM;TSP;kt;NR;NR;NR;NR;NR;NR;NR;NR;NR;NR
FR;3B4giv;EM;TSP;kt;NR;NR;NR;NR;NR;NR;NR;NR;NR;NR
FR;3B4h;EM;TSP;kt;NR;NR;NR;NR;NR;NR;NR;NR;NR;NR
FR;3Da1;EM;TSP;kt;NR;NR;NR;NR;NR;NR;NR;NR;NR;NR
FR;3Da2a;EM;TSP;kt;NR;NR;NR;NR;NR;NR;NR;NR;NR;NR
FR;3Da2b;EM;TSP;kt;NR;NR;NR;NR;NR;NR;NR;NR;NR;NR
FR;3Da2c;EM;TSP;kt;NR;NR;NR;NR;NR;NR;NR;NR;NR;NR
FR;3Da3;EM;TSP;kt;NR;NR;NR;NR;NR;NR;NR;NR;NR;NR
FR;3Da4;EM;TSP;kt;NR;NR;NR;NR;NR;NR;NR;NR;NR;NR
FR;3Db;EM;TSP;kt;NR;NR;NR;NR;NR;NR;NR;NR;NR;NR
FR;3Dc;EM;TSP;kt;NR;NR;NR;NR;NR;NR;NR;NR;NR;NR
FR;3Dd;EM;TSP;kt;NR;NR;NR;NR;NR;NR;NR;NR;NR;NR
FR;3De;EM;TSP;kt;NR;NR;NR;NR;NR;NR;NR;NR;NR;NR
FR;3Df;EM;TSP;kt;NR;NR;NR;NR;NR;NR;NR;NR;NR;NR
FR;3F;EM;TSP;kt;NR;NR;NR;NR;NR;NR;NR;NR;NR;NR
FR;3I;EM;TSP;kt;NR;NR;NR;NR;NR;NR;NR;NR;NR;NR
FR;5A;EM;TSP;kt;NR;NR;NR;NR;NR;NR;NR;NR;NR;NR
FR;5B1;EM;TSP;kt;NR;NR;NR;NR;NR;NR;NR;NR;NR;NR
FR;5B2;EM;TSP;kt;NR;NR;NR;NR;NR;NR;NR;NR;NR;NR
FR;5C1a;EM;TSP;kt;NR;NR;NR;NR;NR;NR;NR;NR;NR;NR
FR;5C1bi;EM;TSP;kt;NR;NR;NR;NR;NR;NR;NR;NR;NR;NR
FR;5C1bii;EM;TSP;kt;NR;NR;NR;NR;NR;NR;NR;NR;NR;NR
FR;5C1biii;EM;TSP;kt;NR;NR;NR;NR;NR;NR;NR;NR;NR;NR
FR;5C1biv;EM;TSP;kt;NR;NR;NR;NR;NR;NR;NR;NR;NR;NR
FR;5C1bv;EM;TSP;kt;NR;NR;NR;NR;NR;NR;NR;NR;NR;NR
FR;5C1bvi;EM;TSP;kt;NR;NR;NR;NR;NR;NR;NR;NR;NR;NR
FR;5C2;EM;TSP;kt;NR;NR;NR;NR;NR;NR;NR;NR;NR;NR
FR;5D1;EM;TSP;kt;NR;NR;NR;NR;NR;NR;NR;NR;NR;NR
FR;5D2;EM;TSP;kt;NR;NR;NR;NR;NR;NR;NR;NR;NR;NR
FR;5D3;EM;TSP;kt;NR;NR;NR;NR;NR;NR;NR;NR;NR;NR
FR;5E;EM;TSP;kt;NR;NR;NR;NR;NR;NR;NR;NR;NR;NR
FR;6A;EM;TSP;kt;NR;NR;NR;NR;NR;NR;NR;NR;NR;NR
FR;1A3ai(ii);EM;TSP;kt;NR;NR;NR;NR;NR;NR;NR;NR;NR;NR
FR;1A3aii(ii);EM;TSP;kt;NR;NR;NR;NR;NR;NR;NR;NR;NR;NR
FR;1A3di(i);EM;TSP;kt;NR;NR;NR;NR;NR;NR;NR;NR;NR;NR
FR;1A5c;EM;TSP;kt;NR;NR;NR;NR;NR;NR;NR;NR;NR;NR
FR;6B;EM;TSP;kt;NR;NR;NR;NR;NR;NR;NR;NR;NR;NR
FR;11A;EM;TSP;kt;NR;NR;NR;NR;NR;NR;NR;NR;NR;NR
FR;11B;EM;TSP;kt;NR;NR;NR;NR;NR;NR;NR;NR;NR;NR
FR;11C;EM;TSP;kt;NR;NR;NR;NR;NR;NR;NR;NR;NR;NR
FR;1A1a;EM;BC;kt;NR;NR;NR;NR;NR;NR;NR;NR;NR;NR
FR;1A1b;EM;BC;kt;NR;NR;NR;NR;NR;NR;NR;NR;NR;NR
FR;1A1c;EM;BC;kt;NR;NR;NR;NR;NR;NR;NR;NR;NR;NR
FR;1A2a;EM;BC;kt;NR;NR;NR;NR;NR;NR;NR;NR;NR;NR
FR;1A2b;EM;BC;kt;NR;NR;NR;NR;NR;NR;NR;NR;NR;NR
FR;1A2c;EM;BC;kt;NR;NR;NR;NR;NR;NR;NR;NR;NR;NR
FR;1A2d;EM;BC;kt;NR;NR;NR;NR;NR;NR;NR;NR;NR;NR
FR;1A2e;EM;BC;kt;NR;NR;NR;NR;NR;NR;NR;NR;NR;NR
FR;1A2f;EM;BC;kt;NR;NR;NR;NR;NR;NR;NR;NR;NR;NR
FR;1A2gvii;EM;BC;kt;NR;NR;NR;NR;NR;NR;NR;NR;NR;NR
FR;1A2gviii;EM;BC;kt;NR;NR;NR;NR;NR;NR;NR;NR;NR;NR
FR;1A3ai(i);EM;BC;kt;NR;NR;NR;NR;NR;NR;NR;NR;NR;NR
FR;1A3aii(i);EM;BC;kt;NR;NR;NR;NR;NR;NR;NR;NR;NR;NR
FR;1A3bi;EM;BC;kt;NR;NR;NR;NR;NR;NR;NR;NR;NR;NR
FR;1A3bii;EM;BC;kt;NR;NR;NR;NR;NR;NR;NR;NR;NR;NR
FR;1A3biii;EM;BC;kt;NR;NR;NR;NR;NR;NR;NR;NR;NR;NR
FR;1A3biv;EM;BC;kt;NR;NR;NR;NR;NR;NR;NR;NR;NR;NR
FR;1A3bv;EM;BC;kt;NR;NR;NR;NR;NR;NR;NR;NR;NR;NR
FR;1A3bvi;EM;BC;kt;NR;NR;NR;NR;NR;NR;NR;NR;NR;NR
FR;1A3bvii;EM;BC;kt;NR;NR;NR;NR;NR;NR;NR;NR;NR;NR
FR;1A3c;EM;BC;kt;NR;NR;NR;NR;NR;NR;NR;NR;NR;NR
FR;1A3di(ii);EM;BC;kt;NR;NR;NR;NR;NR;NR;NR;NR;NR;NR
FR;1A3dii;EM;BC;kt;NR;NR;NR;NR;NR;NR;NR;NR;NR;NR
FR;1A3ei;EM;BC;kt;NR;NR;NR;NR;NR;NR;NR;NR;NR;NR
FR;1A3eii;EM;BC;kt;NR;NR;NR;NR;NR;NR;NR;NR;NR;NR
FR;1A4ai;EM;BC;kt;NR;NR;NR;NR;NR;NR;NR;NR;NR;NR
FR;1A4aii;EM;BC;kt;NR;NR;NR;NR;NR;NR;NR;NR;NR;NR
FR;1A4bi;EM;BC;kt;NR;NR;NR;NR;NR;NR;NR;NR;NR;NR
FR;1A4bii;EM;BC;kt;NR;NR;NR;NR;NR;NR;NR;NR;NR;NR
FR;1A4ci;EM;BC;kt;NR;NR;NR;NR;NR;NR;NR;NR;NR;NR
FR;1A4cii;EM;BC;kt;NR;NR;NR;NR;NR;NR;NR;NR;NR;NR
FR;1A4ciii;EM;BC;kt;NR;NR;NR;NR;NR;NR;NR;NR;NR;NR
FR;1A5a;EM;BC;kt;NR;NR;NR;NR;NR;NR;NR;NR;NR;NR
FR;1A5b;EM;BC;kt;NR;NR;NR;NR;NR;NR;NR;NR;NR;NR
FR;1B1a;EM;BC;kt;NR;NR;NR;NR;NR;NR;NR;NR;NR;NR
FR;1B1b;EM;BC;kt;NR;NR;NR;NR;NR;NR;NR;NR;NR;NR
FR;1B1c;EM;BC;kt;NR;NR;NR;NR;NR;NR;NR;NR;NR;NR
FR;1B2ai;EM;BC;kt;NR;NR;NR;NR;NR;NR;NR;NR;NR;NR
FR;1B2aiv;EM;BC;kt;NR;NR;NR;NR;NR;NR;NR;NR;NR;NR
FR;1B2av;EM;BC;kt;NR;NR;NR;NR;NR;NR;NR;NR;NR;NR
FR;1B2b;EM;BC;kt;NR;NR;NR;NR;NR;NR;NR;NR;NR;NR
FR;1B2c;EM;BC;kt;NR;NR;NR;NR;NR;NR;NR;NR;NR;NR
FR;1B2d;EM;BC;kt;NR;NR;NR;NR;NR;NR;NR;NR;NR;NR
FR;2A1;EM;BC;kt;NR;NR;NR;NR;NR;NR;NR;NR;NR;NR
FR;2A2;EM;BC;kt;NR;NR;NR;NR;NR;NR;NR;NR;NR;NR
FR;2A3;EM;BC;kt;NR;NR;NR;NR;NR;NR;NR;NR;NR;NR
FR;2A5a;EM;BC;kt;NR;NR;NR;NR;NR;NR;NR;NR;NR;NR
FR;2A5b;EM;BC;kt;NR;NR;NR;NR;NR;NR;NR;NR;NR;NR
FR;2A5c;EM;BC;kt;NR;NR;NR;NR;NR;NR;NR;NR;NR;NR
FR;2A6;EM;BC;kt;NR;NR;NR;NR;NR;NR;NR;NR;NR;NR
FR;2B1;EM;BC;kt;NR;NR;NR;NR;NR;NR;NR;NR;NR;NR
FR;2B2;EM;BC;kt;NR;NR;NR;NR;NR;NR;NR;NR;NR;NR
FR;2B3;EM;BC;kt;NR;NR;NR;NR;NR;NR;NR;NR;NR;NR
FR;2B5;EM;BC;kt;NR;NR;NR;NR;NR;NR;NR;NR;NR;NR
FR;2B6;EM;BC;kt;NR;NR;NR;NR;NR;NR;NR;NR;NR;NR
FR;2B7;EM;BC;kt;NR;NR;NR;NR;NR;NR;NR;NR;NR;NR
FR;2B10a;EM;BC;kt;NR;NR;NR;NR;NR;NR;NR;NR;NR;NR
FR;2B10b;EM;BC;kt;NR;NR;NR;NR;NR;NR;NR;NR;NR;NR
FR;2C1;EM;BC;kt;NR;NR;NR;NR;NR;NR;NR;NR;NR;NR
FR;2C2;EM;BC;kt;NR;NR;NR;NR;NR;NR;NR;NR;NR;NR
FR;2C3;EM;BC;kt;NR;NR;NR;NR;NR;NR;NR;NR;NR;NR
FR;2C4;EM;BC;kt;NR;NR;NR;NR;NR;NR;NR;NR;NR;NR
FR;2C5;EM;BC;kt;NR;NR;NR;NR;NR;NR;NR;NR;NR;NR
FR;2C6;EM;BC;kt;NR;NR;NR;NR;NR;NR;NR;NR;NR;NR
FR;2C7a;EM;BC;kt;NR;NR;NR;NR;NR;NR;NR;NR;NR;NR
FR;2C7b;EM;BC;kt;NR;NR;NR;NR;NR;NR;NR;NR;NR;NR
FR;2C7c;EM;BC;kt;NR;NR;NR;NR;NR;NR;NR;NR;NR;NR
FR;2C7d;EM;BC;kt;NR;NR;NR;NR;NR;NR;NR;NR;NR;NR
FR;2D3a;EM;BC;kt;NR;NR;NR;NR;NR;NR;NR;NR;NR;NR
FR;2D3b;EM;BC;kt;NR;NR;NR;NR;NR;NR;NR;NR;NR;NR
FR;2D3c;EM;BC;kt;NR;NR;NR;NR;NR;NR;NR;NR;NR;NR
FR;2D3d;EM;BC;kt;NR;NR;NR;NR;NR;NR;NR;NR;NR;NR
FR;2D3e;EM;BC;kt;NR;NR;NR;NR;NR;NR;NR;NR;NR;NR
FR;2D3f;EM;BC;kt;NR;NR;NR;NR;NR;NR;NR;NR;NR;NR
FR;2D3g;EM;BC;kt;NR;NR;NR;NR;NR;NR;NR;NR;NR;NR
FR;2D3h;EM;BC;kt;NR;NR;NR;NR;NR;NR;NR;NR;NR;NR
FR;2D3i;EM;BC;kt;NR;NR;NR;NR;NR;NR;NR;NR;NR;NR
FR;2G;EM;BC;kt;NR;NR;NR;NR;NR;NR;NR;NR;NR;NR
FR;2H1;EM;BC;kt;NR;NR;NR;NR;NR;NR;NR;NR;NR;NR
FR;2H2;EM;BC;kt;NR;NR;NR;NR;NR;NR;NR;NR;NR;NR
FR;2H3;EM;BC;kt;NR;NR;NR;NR;NR;NR;NR;NR;NR;NR
FR;2I;EM;BC;kt;NR;NR;NR;NR;NR;NR;NR;NR;NR;NR
FR;2J;EM;BC;kt;NR;NR;NR;NR;NR;NR;NR;NR;NR;NR
FR;2K;EM;BC;kt;NR;NR;NR;NR;NR;NR;NR;NR;NR;NR
FR;2L;EM;BC;kt;NR;NR;NR;NR;NR;NR;NR;NR;NR;NR
FR;3B1a;EM;BC;kt;NR;NR;NR;NR;NR;NR;NR;NR;NR;NR
FR;3B1b;EM;BC;kt;NR;NR;NR;NR;NR;NR;NR;NR;NR;NR
FR;3B2;EM;BC;kt;NR;NR;NR;NR;NR;NR;NR;NR;NR;NR
FR;3B3;EM;BC;kt;NR;NR;NR;NR;NR;NR;NR;NR;NR;NR
FR;3B4a;EM;BC;kt;NR;NR;NR;NR;NR;NR;NR;NR;NR;NR
FR;3B4d;EM;BC;kt;NR;NR;NR;NR;NR;NR;NR;NR;NR;NR
FR;3B4e;EM;BC;kt;NR;NR;NR;NR;NR;NR;NR;NR;NR;NR
FR;3B4f;EM;BC;kt;NR;NR;NR;NR;NR;NR;NR;NR;NR;NR
FR;3B4gi;EM;BC;kt;NR;NR;NR;NR;NR;NR;NR;NR;NR;NR
FR;3B4gii;EM;BC;kt;NR;NR;NR;NR;NR;NR;NR;NR;NR;NR
FR;3B4giii;EM;BC;kt;NR;NR;NR;NR;NR;NR;NR;NR;NR;NR
FR;3B4giv;EM;BC;kt;NR;NR;NR;NR;NR;NR;NR;NR;NR;NR
FR;3B4h;EM;BC;kt;NR;NR;NR;NR;NR;NR;NR;NR;NR;NR
FR;3Da1;EM;BC;kt;NR;NR;NR;NR;NR;NR;NR;NR;NR;NR
FR;3Da2a;EM;BC;kt;NR;NR;NR;NR;NR;NR;NR;NR;NR;NR
FR;3Da2b;EM;BC;kt;NR;NR;NR;NR;NR;NR;NR;NR;NR;NR
FR;3Da2c;EM;BC;kt;NR;NR;NR;NR;NR;NR;NR;NR;NR;NR
FR;3Da3;EM;BC;kt;NR;NR;NR;NR;NR;NR;NR;NR;NR;NR
FR;3Da4;EM;BC;kt;NR;NR;NR;NR;NR;NR;NR;NR;NR;NR
FR;3Db;EM;BC;kt;NR;NR;NR;NR;NR;NR;NR;NR;NR;NR
FR;3Dc;EM;BC;kt;NR;NR;NR;NR;NR;NR;NR;NR;NR;NR
FR;3Dd;EM;BC;kt;NR;NR;NR;NR;NR;NR;NR;NR;NR;NR
FR;3De;EM;BC;kt;NR;NR;NR;NR;NR;NR;NR;NR;NR;NR
FR;3Df;EM;BC;kt;NR;NR;NR;NR;NR;NR;NR;NR;NR;NR
FR;3F;EM;BC;kt;NR;NR;NR;NR;NR;NR;NR;NR;NR;NR
FR;3I;EM;BC;kt;NR;NR;NR;NR;NR;NR;NR;NR;NR;NR
FR;5A;EM;BC;kt;NR;NR;NR;NR;NR;NR;NR;NR;NR;NR
FR;5B1;EM;BC;kt;NR;NR;NR;NR;NR;NR;NR;NR;NR;NR
FR;5B2;EM;BC;kt;NR;NR;NR;NR;NR;NR;NR;NR;NR;NR
FR;5C1a;EM;BC;kt;NR;NR;NR;NR;NR;NR;NR;NR;NR;NR
FR;5C1bi;EM;BC;kt;NR;NR;NR;NR;NR;NR;NR;NR;NR;NR
FR;5C1bii;EM;BC;kt;NR;NR;NR;NR;NR;NR;NR;NR;NR;NR
FR;5C1biii;EM;BC;kt;NR;NR;NR;NR;NR;NR;NR;NR;NR;NR
FR;5C1biv;EM;BC;kt;NR;NR;NR;NR;NR;NR;NR;NR;NR;NR
FR;5C1bv;EM;BC;kt;NR;NR;NR;NR;NR;NR;NR;NR;NR;NR
FR;5C1bvi;EM;BC;kt;NR;NR;NR;NR;NR;NR;NR;NR;NR;NR
FR;5C2;EM;BC;kt;NR;NR;NR;NR;NR;NR;NR;NR;NR;NR
FR;5D1;EM;BC;kt;NR;NR;NR;NR;NR;NR;NR;NR;NR;NR
FR;5D2;EM;BC;kt;NR;NR;NR;NR;NR;NR;NR;NR;NR;NR
FR;5D3;EM;BC;kt;NR;NR;NR;NR;NR;NR;NR;NR;NR;NR
FR;5E;EM;BC;kt;NR;NR;NR;NR;NR;NR;NR;NR;NR;NR
FR;6A;EM;BC;kt;NR;NR;NR;NR;NR;NR;NR;NR;NR;NR
FR;1A3ai(ii);EM;BC;kt;NR;NR;NR;NR;NR;NR;NR;NR;NR;NR
FR;1A3aii(ii);EM;BC;kt;NR;NR;NR;NR;NR;NR;NR;NR;NR;NR
FR;1A3di(i);EM;BC;kt;NR;NR;NR;NR;NR;NR;NR;NR;NR;NR
FR;1A5c;EM;BC;kt;NR;NR;NR;NR;NR;NR;NR;NR;NR;NR
FR;6B;EM;BC;kt;NR;NR;NR;NR;NR;NR;NR;NR;NR;NR
FR;11A;EM;BC;kt;NR;NR;NR;NR;NR;NR;NR;NR;NR;NR
FR;11B;EM;BC;kt;NR;NR;NR;NR;NR;NR;NR;NR;NR;NR
FR;11C;EM;BC;kt;NR;NR;NR;NR;NR;NR;NR;NR;NR;NR
