Vorgang gestartet
Berechne Variable Land Use, Land-Use Change and Forestry, Ereignis #17031 (1/49)
Berechne Variable Land Use, Land-Use Change and Forestry, Ereignis #17032 (2/49)
Berechne Variable Landnutzung, Ereignis #19191 (3/49)
Berechne Variable Landnutzung, Ereignis #19192 (4/49)
Berechne Variable Landnutzung, Ereignis #19193 (5/49)
Berechne Variable Landnutzung, Ereignis #19194 (6/49)
Berechne Variable Landnutzung, Ereignis #19195 (7/49)
Berechne Variable Landnutzung, Ereignis #19196 (8/49)
Berechne Variable Landnutzung, Ereignis #19197 (9/49)
Berechne Variable Landnutzung, Ereignis #19198 (10/49)
Berechne Variable Landnutzung, Ereignis #19199 (11/49)
Berechne Variable Landnutzung, Ereignis #19200 (12/49)
Berechne Variable Land Use, Land-Use Change and Forestry, Ereignis #19215 (13/49)
Berechne Variable Land Use, Land-Use Change and Forestry, Ereignis #19216 (14/49)
Berechne Variable Land Use, Land-Use Change and Forestry, Ereignis #19219 (15/49)
Berechne Variable Land Use, Land-Use Change and Forestry, Ereignis #19220 (16/49)
Berechne Variable Land Use, Land-Use Change and Forestry, Ereignis #19221 (17/49)
Berechne Variable Land Use, Land-Use Change and Forestry, Ereignis #19222 (18/49)
Berechne Variable Cropland (managed), Ereignis #25265 (19/49)
Berechne Variable Landnutzung, Ereignis #25266 (20/49)
Berechne Variable Landnutzung, Ereignis #25267 (21/49)
Berechne Variable Grassland (managed), Ereignis #25268 (22/49)
Berechne Variable Grassland (unmanaged), Ereignis #25269 (23/49)
Berechne Variable Settlements, Ereignis #25270 (24/49)
Berechne Variable Wetlands (managed), Ereignis #25271 (25/49)
Berechne Variable Wetlands (unmanaged), Ereignis #25272 (26/49)
Berechne Variable Land Use, Land-Use Change and Forestry, Ereignis #26667 (27/49)
Berechne Variable Wetlands, Ereignis #28894 (28/49)
Berechne Variable Wetlands, Ereignis #28895 (29/49)
Berechne Variable Wetlands, Ereignis #28896 (30/49)
Berechne Variable Cropland, Ereignis #28897 (31/49)
Berechne Variable Cropland, Ereignis #28898 (32/49)
Berechne Variable Cropland, Ereignis #28899 (33/49)
Berechne Variable Forest Land, Ereignis #28900 (34/49)
Berechne Variable Forest Land, Ereignis #28901 (35/49)
Berechne Variable Forest Land, Ereignis #28902 (36/49)
Berechne Variable Landnutzung, Ereignis #29290 (37/49)
Berechne Variable Landnutzung, Ereignis #29291 (38/49)
Berechne Variable Landnutzung, Ereignis #29292 (39/49)
Berechne Variable Landnutzung, Ereignis #29293 (40/49)
Berechne Variable Other Land, Ereignis #29294 (41/49)
Berechne Variable Landnutzung, Ereignis #29295 (42/49)
Berechne Variable Landnutzung, Ereignis #29296 (43/49)
Berechne Variable Landnutzung, Ereignis #29297 (44/49)
Berechne Variable Landnutzung, Ereignis #29298 (45/49)
Berechne Variable Landnutzung, Ereignis #29299 (46/49)
Berechne Variable Landnutzung, Ereignis #29300 (47/49)
Berechne Variable Other Land, Ereignis #29331 (48/49)
Berechne Variable Other Land, Ereignis #29333 (49/49)
Datei 'C:\Program Files\Housesoft\Zentrales System Emissionen\tables\data\crf_exporter\reporter_import_files\Submission 2024\import files\4 LULUCF\4.xml' wurde geschrieben (1617 Werte).
Vorgang beendet (00:02:05.2320867)
