REGION;CATEGORY;TYPE;SUBSTANCE;TS:ID;TS:NAME;UNIT;1990;1991;1992;1993;1994;1995;1996;1997;1998;1999;2000;2001;2002;2003;2004;2005;2006;2007;2008;2009;2010;2011;2012;2013;2014;2015;2016;2017;2018;2019;2020;2021
ES;1A1a;EM;CO2;ES_EM_1A1a_CO2;;kt;65593,30128556145;66302,10610721997;73967,31855201654;68146,39152305853;66917,20661889385;72754,60109738747;59552,840997691266;71642,00271555742;71352,08631834218;86513,40536614243;91192,4366717223;85717,26699774197;100063,75420705839;92920,1584429155;102061,52769912829;112056,48218114043;103321,3609054631;109417,47189063052;92295,02109861103;76684,147855703;59890,66888992503;73853,33868277447;78700,33082396214;58781,3590629167;62870,86077016637;73530,79612755934;58222,42504791839;68257,98924113058;59008,04205114245;43564,6982333495;30370,15593381693;30849,094509693317
ES;1A1b;EM;CO2;ES_EM_1A1b_CO2;;kt;10858,119417950295;10425,59292954816;10372,692580033148;10246,755646932086;11317,154252927281;11406,966810636975;11759,469562385862;12026,263590709494;12004,968812328802;12094,673929104416;12170,275763115957;11961,236356182904;11733,550973826534;11655,103940139665;12171,340674511746;11854,257229814968;12025,166782122684;11828,774481641409;11658,587960727515;10816,036220077489;10348,330946680348;10682,14397413351;11115,072752186506;10850,403719871001;10408,084323199619;10441,082838191569;10268,967627228569;10210,16985942558;10308,67645897436;10218,71254047808;9236,077820061328;9044,17582885707
ES;1A1c;EM;CO2;ES_EM_1A1c_CO2;;kt;2089,447705;2201,4005930000003;1837,11545;1870,6717990000002;1742,369099;1515,726145;1353,974246;1390,2053199999998;1312,766465;1285,4837483;1076,536748409251;995,7662763000001;887,0987060068401;941,8674017000001;962,1190375944338;1025,9307964913703;4566,021486418699;4295,838986725099;4187,408706841493;3214,2388585224717;3446,472278171399;1892,490023372774;1774,1288944897683;1813,972696757693;1391,9290848684439;627,4364382460446;879,450141839356;896,111085143799;835,4661604127856;945,3197751546928;749,0858670465276;892,2666476433604
ES;1A2a;EM;CO2;ES_EM_1A2a_CO2;;kt;8338,587649786;9479,95388;7835,627738000001;7953,82993;10106,974543;9297,803366;8035,938022;8114,870429;6627,595889;5776,980852;6284,720574;7143,870742;6869,58898;6926,259615675977;7628,000337364546;6721,1705287262075;5812,84278199001;6195,513901121705;6644,212631501206;5282,450610984786;6543,835896633692;6150,948224639351;6261,761526891046;5210,257406476132;5512,815910792068;5966,770253496866;5622,503620359157;5780,729517765616;5709,4496772095135;5691,682362220389;6224,397459533843;6548,463826199529
ES;1A2b;EM;CO2;ES_EM_1A2b_CO2;;kt;1191,5799977145657;1597,9872640933604;1606,458228225742;1203,556726117001;1409,862013508994;1489,825135144836;1637,0771742806496;2726,4868348819273;2698,407337839599;2616,39095956729;3181,1155225164384;3603,659370056486;3784,565746678384;3808,616912210882;3967,805240958242;3519,1543528600673;3071,1498796638903;2990,393061252709;2720,1256789293493;2925,263510142705;3079,133022430623;2531,0078829881145;2079,534816557204;1459,4011620947003;1235,2886576862766;1139,6100256648479;1147,025222218745;1177,8900320475625;1247,3005541819068;1559,8957623103313;1353,7024772557054;1850,831380085408
ES;1A2c;EM;CO2;ES_EM_1A2c_CO2;;kt;5354,11424443259;6205,357074258732;6203,8049397575305;6135,424523133759;7158,819660179976;10337,340977548014;8189,544392700927;6830,035859444084;6568,414432397466;6456,872746176256;7206,8579710596105;6639,705754626923;7683,972665919793;8384,473165263784;8443,07790571329;8849,910346132967;8379,678181952257;7454,986182794826;7751,60487118501;5250,14694349875;5692,195351984363;6496,899638797427;7426,196073612357;8662,036317304874;7538,503546858978;7987,408625453412;8092,279526045558;8476,230333757998;8943,64903744723;8809,97771135744;8425,572766667776;8866,988865513444
ES;1A2d;EM;CO2;ES_EM_1A2d_CO2;;kt;2600,484904103304;2735,797300404525;2655,880112467101;2652,241793742103;3255,0933061663627;3914,247038615206;3726,4183105970037;3712,3577460486235;4023,459372742679;4365,497183336236;4788,514623034744;4468,9557519153595;5366,381937101604;5432,579973710359;5435,965813552862;5254,290101138799;5113,231119004545;5184,404169006544;5482,64056953186;5030,183559096169;4491,292289416954;5030,292794275377;5155,4559776924325;4753,174310282076;3888,308794559262;3994,1204067505378;4241,2407352092405;4376,499887424555;4329,407511928692;4826,053623775888;4088,3166172667306;4238,711734068718
ES;1A2e;EM;CO2;ES_EM_1A2e_CO2;;kt;2997,6663089999997;3243,07634;3211,407084;3206,5697270000005;3965,314792;5151,1078370000005;3735,419824;3855,468234;3832,196158;4869,132850999999;4771,883636;4948,89065;5594,40626;6104,981588999999;5745,833146;5166,972266000001;2968,850623;2903,7008020000003;2765,421684;2431,317299;2574,664491;2013,5286139999998;2714,6460549999997;3205,709551;2873,794056;4207,311118;4600,058493397908;5039,099553873098;4941,039425168209;4675,868418800786;4355,930275631056;4900,957197385185
ES;1A2f;EM;CO2;ES_EM_1A2f_CO2;;kt;16572,9431220968;17736,34664576987;17915,584522154935;16341,07409567521;17099,46013717401;19258,305621681877;20890,838791377497;19164,86491453323;20149,537401834925;21294,410460166564;21385,93861796515;22270,38346924112;22187,81037533853;23783,35920214631;22488,632916523176;24038,706105696365;23001,27345628385;22822,90728273187;19695,415132830978;15735,08158902892;15675,32832454471;15543,079967454007;12726,278131621277;10483,311692853436;10802,531067279031;11421,063979386425;12064,276347294246;12457,495494605075;12835,198512328407;12398,123290066662;11225,816745321468;11908,371232070387
ES;1A2g;EM;CO2;ES_EM_1A2g_CO2;;kt;7802,103189924661;8220,059191123983;7731,177088242996;8532,908290872756;8447,201628392297;9629,887398306808;7677,99728919835;8724,35071204491;9141,072484765316;9409,560948013157;10224,904667006434;11075,669070830983;11294,897622721997;12897,648186449933;13512,481931493105;14769,20782987699;10042,185652961663;12803,012979730991;11837,095448324102;10375,222203568826;10724,52115505228;8027,689823313824;8159,322786690288;7561,306775424863;6858,282460127854;6410,9579447998685;7269,417515913852;7318,103820173196;7786,043804292741;7687,357306037763;6706,380943695032;7077,801877793076
ES;1A3a;EM;CO2;ES_EM_1A3a_CO2;;kt;1654,692885561707;1826,7909238978496;2006,203025666799;1973,6066734834903;2083,582070703578;2280,9995894431167;2490,8200313168845;2659,398639776414;2827,523072583762;3085,1672873729385;3309,361983426428;3374,5338423186;3247,7832820497238;3407,2606345179097;3772,5011563851995;3998,3735061811244;4073,2709302408957;4244,766101548215;3977,69408187879;3491,4926067531364;3482,7602766174105;3383,6490028145886;2811,511492394173;2402,452209806254;2387,5225062535073;2486,9651506684218;2679,508966592495;2803,799578404931;3024,5870402975665;3127,059298298938;1515,8696352008196;2174,500931241871
ES;1A3b;EM;CO2;ES_EM_1A3b_CO2;;kt;50429,361649;53332,548401;56971,055591;56480,448027;59549,206818000006;60411,407544;64326,188375;65012,212499;71355,17199;75090,789417;77123,682789;80949,307975;82819,485707;86648,440039;89859,284682;92419,005919;95286,204947;98172,80139699999;92988,186858;86980,703901;83796,374744;79461,67842;72825,347714;75128,894718;75982,11969800001;78689,173694;80740,54844900001;82061,786892;82740,304937;83615,097369;68797,317227;79283,14549
ES;1A3c;EM;CO2;ES_EM_1A3c_CO2;;kt;421,721158;414,113429;410,980953;354,070257;330,030119;328,726138;319,723269;325,286213;327,50588;324,382477;308,33976;317,542297;307,732683;312,666134;308,494075;310,663585;308,505152;303,063888;292,392251;273,193157;269,590217;277,423879;258,295376;243,278357;247,512071;244,183041;233,547283;243,734308;251,622091;245,367676;170,063624;148,053316
ES;1A3d;EM;CO2;ES_EM_1A3d_CO2;;kt;5202,617286;5485,490391;5657,062793;5799,598778;6110,160564;5888,246220999999;6260,091317;5024,337311;5240,975855;4956,249092;4324,715692;4303,721906;4337,056696000001;4858,646909;4996,017379;4790,469167;5249,682314;4555,795128;4119,656562;3426,021256;3277,889;2555,749142;2663,017571;1588,3732570000002;1017,092697;1348,716797;1921,8502259999998;3062,478194;3164,006065;3317,99231;2474,595433;2809,138849
ES;1A3e;EM;CO2;ES_EM_1A3e_CO2;;kt;19,129665;23,722881;19,446098;30,549218;54,209698;56,625987;125,41225299999999;149,70092400000001;73,00826;80,115262;132,859641;225,821915;265,76477400000005;267,96270999999996;227,939286;239,23951615302167;127,4316701248487;104,96495062969974;123,09574338105934;122,8853931717073;144,12277123875504;134,05331710484742;122,44167161217133;144,7631047497525;135,53508827307542;108,21085952337808;117,00025426199709;132,3861350090993;141,22310172368495;131,0230864897632;98,52505500044677;148,13392663546566
ES;1A4a;EM;CO2;ES_EM_1A4a_CO2;;kt;3809,281541;4585,253777;4956,860291;4312,063276;4691,222062;5424,625279;5264,206652999999;5496,603845;5693,255102;6226,071397000001;7030,584976000001;7609,953213000001;7722,214403;7126,12858;7993,368450000001;8999,15797025237;11534,445448011544;9299,12269559238;9944,038253853156;10854,252512688809;13215,347909855014;13822,910578971601;12375,298791798286;10206,518053188922;8343,136912430267;8035,969128072637;8563,023743268799;9348,255200554435;9866,012785224342;9410,848603088994;8964,311720420974;9775,755839678506
ES;1A4b;EM;CO2;ES_EM_1A4b_CO2;;kt;12801,785651;14215,765575;14350,502396;14202,826642;14819,5984;13953,123852;15129,414711000001;15007,810402000001;15425,86493;16291,766387;17140,687137;17446,954081;18024,029124;19666,615723;20787,966643999996;20844,38368;20505,165646;20415,362113000003;19696,987147000003;19202,593072;20564,712356;17003,214599;16639,694558;15904,040489;15477,664448;16887,892366;16134,051087;15767,654564;16842,840343;15226,963917000001;15379,051024;15313,992344999999
ES;1A4c;EM;CO2;ES_EM_1A4c_CO2;;kt;8695,025243;9009,828516;9272,472595000001;9308,708174;9350,14134;9308,22372;9308,583005999999;9316,478025;9503,833464000001;9875,012137;10088,776727;10120,208115;10276,780913;11111,848252;11501,367760000001;11117,945417;11155,629616;11235,645239;10552,697357;10328,391913000001;10496,554703;11247,84434;11751,552499;11801,742004;12967,347136;12040,296831;11940,289208;11831,69617;11937,427095000001;12149,206369000001;12109,002709999999;12267,352657
ES;1A5b;EM;CO2;ES_EM_1A5b_CO2;;kt;297,88538700000004;303,18216800000005;331,035516;301,137932;304,684398;331,276392;377,83049;402,635103;408,887878;421,770232;422,2592899999999;428,83652700000005;412,709353;434,0592720000001;475,27468;500,793896;519,594281;534,04532;589,792538;506,109753;554,321115;559,210396;472,291501;330,40325499999994;407,468853;516,6181819999999;485,63613000000004;481,73140800000004;446,92308699999995;448,073499;435,42435099999994;396,81931099999997
ES;1B1a;EM;CO2;ES_EM_1B1a_CO2;;kt;;;;NA;NA;NA;NA;NA;NA;NA;NA;NA;NA;NA;NA;NA;NA;NA;NA;NA;NA;NA;NA;NA;NA;NA;NA;NA;NA;;;
ES;1B1b;EM;CO2;ES_EM_1B1b_CO2;;kt;17,6283904;17,4582003;16,20648065;16,77195024;16,43157011;13,38462025;13,24736976;14,52654037;14,44419057;12,79719005;15,27200499;14,5375209;14,42223019;72,033051;72,80079469;89,906275;124,940801;93,551635;43,353671;14,009971;37,131392;43,859368;23,480242;3,50009;29,493947;28,64670786;6,648086;9,733316;10,32233;19,041573;23,332609;97,84417645
ES;1B2a;EM;CO2;ES_EM_1B2a_CO2;;kt;1476,6050531913522;1438,458792404514;1541,1688679534827;1569,6943201265597;1839,5353030449594;1608,9734819789808;1546,103768545144;1590,0596751259886;1696,8029387067384;1765,0358044142365;1902,5406203335242;1785,4620221406649;1823,2383304716386;1640,3775970179163;1931,1919977628663;1992,8117284365924;2046,5686086619105;1953,3284102120645;1882,6388267187056;1913,9640873729707;1960,7550792052446;2341,689337831861;2984,7258386680264;3333,0771740602117;3459,784682633725;3433,811149837083;3519,5868543288466;3567,5464032961904;3472,1034905223796;3283,251304639221;3189,8547508477345;3143,836776037311
ES;1B2b;EM;CO2;ES_EM_1B2b_CO2;;kt;0,08853607489237;0,09433650094476;0,08816533519999;0,05105403558664;0,01711030092399;0,0187463090279;0,02356473696547;0,02761429773566;0,03450275629863;0,0475305337787;0,11086762251416;0,12346063409999;0,14997819716129;0,11838154805247;0,12272282964338;0,08607074601355;0,13911107886432;0,08366183245917;0,24800434389604;0,16213850050486;0,14373154819922;0,14482453845931;0,19783051289302;0,21578879904413;0,21274537993057;0,17368807354064;0,17868819271406;0,12548557879924;0,15133236372133;0,12468448264805;0,0843945167106;0,09941539121822
ES;1B2c;EM;CO2;ES_EM_1B2c_CO2;;kt;274,67133299274417;297,74929382522265;297,4278274677111;251,88099522815446;233,45316452641262;240,96705419544693;234,97422454001227;210,4602570529559;230,80849402868282;215,8115292906035;214,63719415627938;237,83210112016437;230,80657667535365;187,85972800231497;229,50767758718078;213,85229478069488;244,535354547067;518,3653893452458;377,8823275748452;328,3613997394574;281,7828797782443;353,36495710630203;370,7714363788884;497,72493714373763;575,1221132045656;244,04014446417872;237,21647590387255;245,69465289469852;311,4092777072152;342,46714280426295;345,0334848195508;268,8386493300291
ES;2A1;EM;CO2;ES_EM_2A1_CO2;;kt;12279,005699;11700,779075;10438,315285;9913,557865;11498,993083;12364,557166;12114,611543;12751,533891;13808,94194;14431,604035;14727,623971;15014,36895;15530,168284;16037,505734;16292,143058;16791,774036;16744,748886;16823,910075;14389,498377;11401,950912;11197,402656;9522,6894;8754,20412;7642,35595;8896,821001;9216,019;9413,648999999992;9448,701000155279;9667,445967539456;9064,16806019526;8191,764250278155;8471,587406199194
ES;2A2;EM;CO2;ES_EM_2A2_CO2;;kt;1108,9272692369375;1122,8613386076986;1139,5680210595133;1158,445269753048;1237,7697642578432;1225,8866833640943;1180,4244029330318;1232,6245112446036;1263,4059536754255;1293,0935901269095;1405,935900052105;1396,1307821739483;1461,557903088588;1522,5111304214574;1579,9130944949181;1495,2083806561666;1603,2858232544065;1698,6390548167997;1608,9480936829564;1385,2584806651146;1511,4110416402596;1445,1711761822594;1255,4721938268724;1378,5978301388338;1346,6071276475757;1380,3108059601327;1276,9382212907076;1442,7378424046879;1484,8191005623478;1493,8599636268732;1333,8355285910886;1514,565073898052
ES;2A3;EM;CO2;ES_EM_2A3_CO2;;kt;374,491262;377,953561;386,242006;388,082102;433,760825;437,601094;448,959583;474,974261;489,632916;504,123248;544,475742;580,246558;602,48068;570,553425;572,048778;560,714653;571,022388518038;560,413987643975;514,020878234608;439,511023485126;471,22514961042197;473,8699985241395;464,3707362050917;474,37307540901;471,0733909937842;472,7955913606826;470,74648582931735;471,7904351648643;480,0737158550969;502,20783165276754;440,1406723652463;463,6984751937477
ES;2A4;EM;CO2;ES_EM_2A4_CO2;;kt;1357,5649463789998;1269,106314971;1173,295894103;1141,586052958;1276,3264272812;1488,9264570002001;1524,3533402362;1598,81996244;1750,0109496281;1923,8469775707001;2085,7448413592;2136,865985676;2238,9663176743998;2305,1092849192;2454,857290739;2580,209054136128;2746,1122432502902;2409,229589689724;1897,417586643564;1107,557585473797;1029,43886872076;1237,0764284441761;1091,7853783926969;905,506938452758;990,0478689602514;1074,1038384133847;998,4772641037049;1028,527536374411;1024,5664936693688;919,5398956755241;818,3628301473716;844,0663062383351
ES;2B1;EM;CO2;ES_EM_2B1_CO2;;kt;399,7195747597461;478,98195503080717;425,343120621928;311,3572919306917;406,5254241279045;425,1046001727115;460,00808613397186;466,4526655372749;430,6193339605972;369,53071297999634;356,1115434249999;384,295387475;353,0635488414286;358,97639311571425;369,5277632486194;372,74316475753284;326,8584577841875;355,52942970147353;300,8852260428327;259,895957851736;403,0997525633115;417,2351511632633;414,23172003651325;397,03342776365577;405,70595949472886;349,1910867187834;335,4013299737256;348,44735658637524;371,0720747662204;339,6270140414144;339,4745541143548;290,8404244140706
ES;2B5;EM;CO2;ES_EM_2B5_CO2;;kt;76,265854;59,601424;52,687088;47,337319;63,698665;70,840062;68,773452;64,74941;64,078606;66,691339;59,731961;64,015267;65,05514;68,79176;67,950539;64,276422;65,157534;64,736923;72,672286;64,805396;46,275494;67,246083;64,228438;61,404558;58,378561;56,031871;55,104785;54,629528;58,589994;58,13616;43,175712;57,310995
ES;2B6;EM;CO2;ES_EM_2B6_CO2;;kt;NA;NA;NA;NA;NA;NA;NA;NA;NA;NA;NA;NA;NA;NA;NA;NA;NA;NA;NA;NA;NA;NA;NA;NA;NA;NA;NA;NA;NA;NA;NA;NA
ES;2B7;EM;CO2;ES_EM_2B7_CO2;;kt;270,192;253,38;209,45;220,671;253,26;305,696;297,66;266,976;253,552;257,286;279,128;305,322;331,272;305,694;315,018;348,735;350,84;333,396;327,988;235,136;264,528;296,926;294,588;269,872;307,284;308,328;334,359;318,45;301,371;321,408;265,589;283,182
ES;2B8;EM;CO2;ES_EM_2B8_CO2;;kt;1683,500798079348;1650,3301387581732;1712,851490207048;1834,4763273129333;2049,207297236943;2042,9213241288626;2114,606236106803;2001,4518060635019;2196,5432619888174;2258,1481280860944;2158,65483130924;2198,5346301458453;2119,121493519706;2265,680367928;2225,258598449089;2157,051809062522;2166,286640399655;2359,7807694169337;1788,4644629749998;1822,7887001667996;1968,4946709601306;1919,42190920831;1659,0159729703132;1553,1231249096004;1887,9605090086002;1970,8434228135732;2038,161111127004;2034,754538979984;2043,6061649691057;1893,133611691134;1971,5310964234031;1924,2459270792867
ES;2B10;EM;CO2;ES_EM_2B10_CO2;;kt;;;;;;;;;;;;;207,3912216781284;311,9593747746168;491,3844619964661;630,954862610447;738,2998282554663;816,645229336602;866,2265844723823;849,046757950526;891,4439983154953;823,6311376728313;848,0914115711853;930,8454470926233;847,7149861146047;837,1834364595974;853,1179138543571;891,9148639529095;868,8231750680117;884,4487079546628;772,4758440830022;795,9157334060717
ES;2C1;EM;CO2;ES_EM_2C1_CO2;;kt;2500,731146018;2403,606994834;2238,60975994;2443,072246688;2477,841761556;1280,06329887;1298,5668015659999;1508,382279892;1612,786062128;1513,1552508;1584,375961;1599,3676090000001;1700,273749;1575,161863;1636,64233;2084,700493969856;2352,3505029590096;2100,3185350918;2008,0347169076376;1793,6885434475555;2117,6966752986127;1638,2631173443485;1421,0336835948483;1551,7830682823417;1994,496139620302;2874,3614163287775;2416,1268047751296;1425,8750321695877;1621,4421898063213;1424,836081698006;1345,5708937557504;1864,5639790142627
ES;2C2;EM;CO2;ES_EM_2C2_CO2;;kt;285,35266242207535;250,2167223085102;157,86762855368704;243,38958336214833;303,59151171988054;354,57052186734234;374,1880372582409;424,96684664092;472,72470229579716;444,7483097743233;500,1407623575719;514,0825162986421;537,3610637440471;566,9007333215627;592,0352637564932;635,5401435447628;624,7505723609668;655,5128588404782;681,2784514399352;269,9936469526561;620,6202800825325;655,8713256005614;640,758543426901;606,125866922246;637,5049750574502;595,3393597759058;571,9522076139591;646,4508112412054;669,7534959984456;496,5359475252056;310,29680912623667;391,3333941671083
ES;2C3;EM;CO2;ES_EM_2C3_CO2;;kt;610,293;607,958;611,383;602,951;569,78;609,743;608,475;611,957;605,048;610,306;615,439;625,717;637,76;640,527;648,505;661,653;681,655;672,137;686,086;595,785;617,822;684,129;581,8;573,271;581,143792361857;596,8730154692411;608,0339002;610,3634632;614,1418282;392,6391059;354,1888236;334,0668175
ES;2C5;EM;CO2;ES_EM_2C5_CO2;;kt;47,186;43,637;11,0;13,6;13,8;15,0;17,2;18,04;18,84;19,5;23,946;24,3200000008;23,110399998;20,5500000022;21,0;23,2578000008;25,8900000014;25,5999999988;29,0000000012;27,5999999992;32,5999999988;34,1939999992;32,4452399992;34,6925999996;34,6925999996;35,2114578;33,755;37,6844;37,437;37,803;34,3977598;40,425806
ES;2C6;EM;CO2;ES_EM_2C6_CO2;;kt;33,1584484888;36,4170289912;42,0224628088;47,781258144;42,301046116;40,2384040536;40,5831157216;43,8051145776;46,5951686088;41,1065146624;56,370910116;52,9181654904;57,515677441;51,764228742;56,662553753;54,397143678;55,956325003;82,168500189;77,050687252;83,301714093;78,602135924;95,639121342;90,793095239;79,029;72,453;69,531;74,289;76,049;76,378;78,19971217;78,51018375;69,49712499
ES;2C7;EM;CO2;ES_EM_2C7_CO2;;kt;59,95733922;43,466585141;30,371424983;54,78688874;67,66329907;93,56526734;101,947363022;98,68600195;103,652617363;156,048172756;144,633409004;144,742783918;144,434545524;145,185255161;161,48413485;176,39469127;164,3355686;173,686969953;181,970633071;61,704851692;156,032689504;180,932495328;152,217630576;157,34580291903893;161,77925252074718;149,39932800095522;137,917782972229;106,116606107992;113,5193977389836;89,54839496115838;93,42692533673724;128,87867064907218
ES;2D1;EM;CO2;ES_EM_2D1_CO2;;kt;160,406462;154,473653;156,099791;120,499889;165,296461;167,09093;144,248466;178,059659;201,574124;227,750423;231,043436;250,808726;262,826328;267,443287;283,866833;292,323283;299,165523;314,164704;353,756418;310,318786;316,259228;292,731639;300,630291;280,599688;286,09029;293,916137;306,420484;317,853054;321,034678;326,525754;276,258534;310,358255
ES;2D2;EM;CO2;ES_EM_2D2_CO2;;kt;32,428002;31,838406;24,763202;27,711198;30,6592;31,248801;110,2552;91,977598;114,971997;206,359998;224,637601;187,492801;79,595997;41,861601;34,786403;94,335998;61,3184;24,763201;18,867197;20,0464;20,636;25,3528;17,098401;42,451201;44,809603;24,763195;25,9424;25,942401;27,121598;25,942402;24,763203;26,303822
ES;2D3;EM;CO2;ES_EM_2D3_CO2;;kt;NA;NA;NA;NA;NA;NA;NA;NA;NA;NA;NA;NA;NA;NA;NA;4,605979;14,864088;25,345213;32,730294;35,067545;36,796406;37,649831;36,523266;36,637607;40,410977;46,751025;52,15858;55,215698;56,992884;58,469532;55,949437;59,818122
ES;3G;EM;CO2;ES_EM_3G_CO2;;kt;82,847315;82,847315;83,516928;108,370276;97,96110099999999;97,49329900000001;108,23547;110,651463;116,21865999999999;110,511798;109,134472;94,965038;116,108514;83,387691;95,279118;97,932899;78,391721;71,035979;45,697602;50,160189;53,854327;52,752858;45,14555;41,529048;37,9067;39,037459;40,142239;41,243447;25,76757;32,20096;30,373295;30,506092
ES;3H;EM;CO2;ES_EM_3H_CO2;;kt;437,841611;372,574491;379,907853;300,146771;324,29265;256,427685;397,615816;383,619808;436,241833;475,048617;529,642659;499,592413;453,754879;505,836157;456,891548;349,659811;417,189516;426,274298;316,983019;436,19184;473,270756;420,10676;421,814807;485,91378;587,467568;511,071482;511,625108;609,755361;507,866603;455,24398;544,95541;316,019654
ES;3I;EM;CO2;ES_EM_3I_CO2;;kt;77,156211;91,942557;75,020276;75,613087;94,178172;74,439061;88,911761;80,326392;88,315563;119,06264;122,98565;82,12172;67,378093;91,657384;81,737251;88,058508;87,070733;77,903285;63,497055;64,236767;81,660427;72,218819;62,806805;71,910414;78,957525;75,138686;60,73607;52,747273;75,496175;72,110144;62,488298;47,100496
ES;4A;EM;CO2;ES_EM_4A_CO2;;kt;-34545,98075264891;-34807,637845172016;-35427,00664205186;-35815,661479819806;-35512,801830845274;-36437,472946559894;-36935,64274734674;-37202,828703303916;-38452,670221958266;-40151,35012477021;-42108,54361783842;-43140,17792614423;-42016,459148943606;-41767,24423093092;-42422,8442383566;-42361,937347173865;-43003,239394119824;-43670,87645679963;-43860,71789323484;-43878,84576020121;-43501,25612098913;-42973,43311262424;-42297,426771879924;-42059,01305648315;-41652,713847140665;-41126,466378407604;-40981,55219219895;-40650,83931207869;-40682,79704365623;-40487,179640904404;-40330,599160062244;-40046,57441738897
ES;4B;EM;CO2;ES_EM_4B_CO2;;kt;1972,4920515847916;1955,7490236025287;1931,1159404639411;1908,5569689930276;1891,6957697158455;1867,8454074931585;1847,7624446155694;1825,2615794348972;1807,632042890089;1790,7506788053022;1777,4023156091903;1602,0770197406296;1559,1956081450453;1514,1914765134238;1468,0185941162397;903,3206576286509;-132,6620225884923;876,9458676434369;675,5204019396771;887,901900755034;-1215,3687424676975;-1628,0054861981214;-609,061120204511;1482,2100918242204;34,0252758157775;-2253,650693076157;-2672,0615741259057;-3039,3087294777747;-3073,524201247796;-3043,634002926212;-2821,5995781819847;-3532,184022597457
ES;4C;EM;CO2;ES_EM_4C_CO2;;kt;-805,0498407670843;-798,0624391255903;-994,1692087640221;-1048,3428153721056;-845,8626460981903;-1086,8316476125992;-1225,5219080398465;-1253,614165999514;-1249,8892377588552;-1353,9472116099355;-1244,8022749357963;-1518,536801863398;-1548,981848996466;-1503,4183843149349;-1536,668788581411;-1443,2612702243043;-1556,2976317637144;-1655,6819625548521;-1712,3137343137823;-1637,0762987676383;-1714,2051806820898;-1589,7218937781154;-1383,1955833177465;-1457,7855810476135;-1430,50521417999;-1323,8666501740472;-1402,3582050966106;-1363,3617530282067;-1524,6902944990163;-1527,542575321423;-1543,0900390360641;-1583,556151939425
ES;4D;EM;CO2;ES_EM_4D_CO2;;kt;-138,0104194150316;-137,19539045667327;-141,2850107564857;-143,74635266894606;-145,23944575128536;-140,9974587916395;-143,44603161993726;-140,8913250227395;-138,40206520370444;-138,1462718777263;-136,75400939336137;-150,2761741416024;-139,17288785992517;-128,1166478997656;-119,35499079274295;-103,8961691990718;-89,01831067700655;-43,59365455113155;-54,29783675979747;-72,31342043465645;-129,0553717785057;-113,8174130797067;-119,18655465307285;-123,29325959840284;-116,62410284420096;-111,81923237773542;-116,26285179427234;-117,25674273171892;-102,27827063476893;-96,34779545012258;-82,5894313605693;-78,52526168987728
ES;4E;EM;CO2;ES_EM_4E_CO2;;kt;800,8058572612948;807,9801860018242;815,1545147423537;822,3288434828831;829,5031722234127;836,6775009639421;843,8518297044716;851,026158445001;858,6302952172389;866,7174569441955;874,8994587177204;1021,2289636891951;1035,6597640809541;1049,9739089388406;1064,3887030006463;1078,816118569573;1093,287865856083;2618,0487251543186;2713,9288539639338;2809,808982773549;2348,817977773019;2414,407510145915;2479,9970425188108;1507,4880099790041;1517,4880098214207;1527,4880096638374;1663,997442531034;1677,9293694383657;1691,8612963456972;1705,7932232530286;1719,72515016036;1729,838363188589
ES;4F;EM;CO2;ES_EM_4F_CO2;;kt;4,66624524229868;4,76821833310163;4,87019142390459;4,97216451470747;5,07413760551038;5,1761106963133;5,27808378711614;5,38005687791906;5,4837405432472;5,5894767634925;5,69532345275565;7,86708289942326;8,03664605153242;8,20472187540042;8,37428524990054;8,54408273213906;8,71388021437751;5,89865021624843;6,03840424680325;6,178158277358;5,40355432220835;5,20793870015243;5,01232307809648;4,55315465960737;4,29023567459234;4,02731668957736;5,41307247462264;5,51859014594016;5,62410781725772;5,72962548857527;5,83514315989287;5,94153139353709
ES;4G;EM;CO2;ES_EM_4G_CO2;;kt;-2019,727148539949;-2129,8785776638706;-997,0721694150768;-1626,63934032901;-1829,1304769339163;-2181,7787957126493;-2071,5744060196926;-1844,4562933074526;-1357,7303096986018;-2967,706690364217;-3396,3469643002;-3662,4580879590453;-3834,8194399773274;-3768,7214086533345;-3792,817129361706;-3307,9033007940707;-3874,3400660910224;-2796,1598557227626;-2244,883289703781;-394,45714399032215;-367,8017135443012;-241,9921645575305;-33,28092473638906;-42,08088278263704;-867,0549254447193;-1836,3561579969362;-1703,7882640681917;-2561,1998607336077;-2748,4387738291916;-2168,0623797369226;-1357,5594863072538;-1476,9132666615633
ES;5A1;EM;CO2;ES_EM_5A1_CO2;;kt;NA;NA;NA;NA;NA;NA;NA;NA;NA;NA;NA;NA;NA;NA;NA;NA;NA;NA;NA;NA;NA;NA;NA;NA;NA;NA;NA;NA;NA;NA;NA;NA
ES;5A2;EM;CO2;ES_EM_5A2_CO2;;kt;NA;NA;NA;NA;NA;NA;NA;NA;NA;NA;NA;NA;NA;NA;NA;NA;NA;NA;NA;NA;NA;NA;NA;NA;NA;NA;NA;NA;NA;NA;NA;NA
ES;5C1;EM;CO2;ES_EM_5C1_CO2;;kt;89,627204;62,337114;66,829638;54,532441;57,04594;29,132177;29,792887;11,738508;11,548852;12,412064;12,373816;12,368364;12,366926;6,049256;1,336192;0,841412;;;;;;;;;;;;;;;;
ES;5C2;EM;CO2;ES_EM_5C2_CO2;;kt;34,752282;38,283034;49,083061;47,263912;34,337513;21,934676;12,310871;15,914263;10,971329;6,899086;2,098277;;;;;;;;;;;;;;;;;;;;;
ES;5E;EM;CO2;ES_EM_5E_CO2;;kt;NA;NA;NA;NA;NA;NA;NA;NA;NA;NA;NA;NA;NA;NA;NA;NA;NA;NA;NA;NA;NA;NA;NA;NA;NA;NA;27,596836;NA;NA;NA;NA;NA
ES;6_OTHER;EM;CO2;ES_EM_6_OTHER_CO2;;kt;NA;NA;NA;NA;NA;NA;NA;NA;NA;NA;NA;NA;NA;NA;NA;NA;NA;NA;NA;NA;NA;NA;NA;NA;NA;NA;NA;NA;NA;NA;NA;NA
ES;1A1a;EM;CH4;ES_EM_1A1a_CH4;;kt;0,69047375968851;0,69670610361256;0,78021786950363;0,71160309573985;0,72395258489672;0,78861163226516;0,6536317420452;0,78964420679532;0,76718764408744;0,92708327932131;0,99124792950821;0,94653724512847;1,13454147496909;1,15249498444847;1,29989856842768;1,50728043074995;1,48805421088066;1,53046538139641;1,4104995158293;1,18513425201449;0,98507526136729;1,11247185668709;1,26535917523377;1,66090679424193;1,69662461150182;2,47218906438158;1,91810577060382;2,17179859052604;2,08701994920979;1,69363238600533;1,15084512170009;1,50936886553588
ES;1A1b;EM;CH4;ES_EM_1A1b_CH4;;kt;0,30831423294524;0,31290945131349;0,31994659893273;0,31640071511384;0,3462134273584;0,34667532160349;0,35700464322532;0,35820639332192;0,35626260486714;0,36150522619637;0,36020954715796;0,36265126585328;0,35008341746312;0,34190274646746;0,35215073257961;0,33325924471218;0,33544139014703;0,3321908390495;0,3223535891792;0,28842976512918;0,26663597907267;0,2517205735849;0,2371111129187;0,22006339467589;0,20465749722035;0,20120673670533;0,19583371510908;0,19080666781078;0,19262135162407;0,18521369397272;0,16480390622927;0,16712121408627
ES;1A1c;EM;CH4;ES_EM_1A1c_CH4;;kt;0,90608503482457;1,46315096445;1,23933696003;1,03603995744;0,27241831215;0,50029560799;1,37708768;0,81390794;0,69904441999;0,52042017899;0,503053893;0,04278150401;0,043260624;0,037418013;0,04137582397;0,34309650722373;6,75926439486853;6,05789525907159;5,93406264984111;4,89023449242585;5,40393824220014;2,84060359640299;2,82797729601736;2,74537992610968;2,26386366509648;0,77431272085663;1,08626660492071;1,1197199490508;1,03561463482209;1,50390733513159;1,25469049722378;1,01902845135103
ES;1A2a;EM;CH4;ES_EM_1A2a_CH4;;kt;0,15603850362715;0,2445405282497;0,16915193115894;0,15333668670667;0,27620501967335;0,54484026122184;0,37580124415614;0,16972829255333;0,14410405534609;0,0892207964185;0,18949102397436;1,11524328143925;0,59528768485763;1,6810582399507;2,33879814787588;1,20592133441035;0,0854831205593;0,08973940579339;0,11322289307195;0,11354494852005;0,10832793032866;0,08923838890435;0,14043860696239;0,06422956927742;0,0726430422584;0,59643537748584;0,31000785739645;0,45188325605267;0,44418016165648;0,26351559865356;0,53840177282845;0,42538292820944
ES;1A2b;EM;CH4;ES_EM_1A2b_CH4;;kt;0,0590120448114;0,10437255375854;0,1310821823804;0,13392790501123;0,16047896198217;0,2127662092219;0,22584124756678;0,24577393475439;0,36782615943363;0,33584874726424;0,46109052662791;0,7844588070161;1,31732733586533;1,07695079031651;1,36624357868928;0,41100983354732;0,38057055866006;0,3523269816103;0,36670099250274;0,81852427831684;1,05842362619632;0,56111380549543;0,18904902708441;0,15468302075189;0,04740303040969;0,13768922309787;0,14969506705065;0,19282520946494;0,3769245963285;0,71862422599612;0,56862629002727;1,45567544683801
ES;1A2c;EM;CH4;ES_EM_1A2c_CH4;;kt;0,46694990177313;0,63520711760277;0,96250772172092;1,0246079050081;1,09585250742289;2,03477640438525;2,19875916698722;2,58650027618867;3,09138272273556;4,10474848214724;5,82204437693141;5,2263051567963;6,26623873434356;7,73200194043058;9,53547290805518;11,16282986063964;11,1160614484405;9,45288318697999;9,47103723950867;5,71639846807537;6,34051671517012;8,43377317238257;9,82924315438042;12,76242231275213;10,83328971806335;11,3548545609323;11,65963635717102;12,39465775194114;13,27149703774838;13,10776968119564;12,73387131850289;13,42787552198784
ES;1A2d;EM;CH4;ES_EM_1A2d_CH4;;kt;1,18475408308902;1,36193095755002;1,47019842573995;1,59322970097876;1,87007338200821;2,37285590371856;2,57636629546175;3,00477682911437;3,48721164694622;4,00907932161354;4,60011253234457;4,22082773852836;4,8585493505921;4,42852175004459;4,46588899372911;4,30311014435157;4,11482936834199;4,4121031994082;4,69620986899072;4,33484074840625;4,41248904997041;5,37665204648992;5,88224954115476;5,446031162459;4,54833119182456;4,69389948785625;4,85923510287036;5,09328758926345;5,09215753511824;5,48804601467685;4,28530712332159;4,72358450082334
ES;1A2e;EM;CH4;ES_EM_1A2e_CH4;;kt;0,244885223;0,385254108;0,480178579;0,569049529;0,702318766;1,144680206;1,379306559;1,743715981;2,168945581;3,387305131;4,037951814;4,694328448;5,587463004;6,281104729;6,301442107;5,809350612;4,142734533;3,579968741;3,646799212;3,699887937;3,720238089;3,379870664;4,482951695;5,421686458;4,5666892;6,280217116;6,49482466557494;7,40398260606862;7,75276415192431;7,32031021287117;7,09762785274869;8,17919985835919
ES;1A2f;EM;CH4;ES_EM_1A2f_CH4;;kt;0,83147380394942;1,21118907723095;1,40771461959073;1,41867162366473;1,60781352008206;2,12113865411894;2,78265140032864;3,56060488188619;4,54439996006936;5,84723343437187;6,37605927809575;7,03646117109848;6,41533164945924;8,67371199356135;7,48330606223126;9,31852934561208;6,67376896256236;6,57353864280832;6,38013030702741;4,85508287930495;5,12967683187454;5,01723590904721;5,2464713009397;4,28893371961205;1,56937725342314;2,05942987083601;2,14634342177333;2,84771552368867;3,03067612674485;2,51569034099546;2,45668597202682;2,87622615203365
ES;1A2g;EM;CH4;ES_EM_1A2g_CH4;;kt;2,22964153414298;2,02769625160773;1,76502518330652;2,08961889008447;2,23631747435397;2,96229214589571;3,34453292268567;3,80028659445;4,90203499150763;5,25296148253141;6,29786853218019;7,39852815337544;7,67193604407486;9,41718517028345;12,11496330454234;15,31664116485956;7,10190390174083;11,14666476387608;10,45805117620516;10,27095403964699;10,83792167858675;7,88443569039107;8,74845351290215;9,52492538700955;8,68448399074536;7,28232874881013;8,33822195145371;8,38846107027491;9,14576947014619;8,95302867714932;8,11357580985003;8,50949393634733
ES;1A3a;EM;CH4;ES_EM_1A3a_CH4;;kt;0,02564643627645;0,02831686539359;0,03118693259955;0,0306771339454;0,0325866934274;0,03567425318845;0,03877696250435;0,04138260641648;0,04400394263748;0,04807725741247;0,0515721621582;0,05256664213476;0,05057540279006;0,05307461087929;0,05881849285486;0,06236831116638;0,06443054406293;0,06757453214452;0,06091438418455;0,05391905632269;0,05298919238532;0,05128517061296;0,04209498008718;0,03535421074464;0,03531744302874;0,03699846199475;0,03974647264581;0,04191901840679;0,04540708392113;0,04624638242567;0,02203301086767;0,03107565123352
ES;1A3b;EM;CH4;ES_EM_1A3b_CH4;;kt;15,909390183;16,840280259;17,822936744;15,818096066;15,36550428;13,996096072;13,87579348;13,048680541;12,765651319;12,25839876;11,160170576;10,767955425;9,868564634;9,654021283;9,264782745;8,531333847;7,785187438;7,330587986;6,555322838;5,913840437;5,437397797;4,829049078;4,346196791;4,044845464;4,039027093;3,968401815;4,023845053;4,099312518;4,110138051;4,147916486;3,259499021;4,011750628
ES;1A3c;EM;CH4;ES_EM_1A3c_CH4;;kt;0,023618;0,02319194;0,023016503;0,019829293;0,018482957;0,018409927;0,017905725;0,01821728;0,01834158;0,018166661;0,017268196;0,017783579;0,017234214;0,017510505;0,017276855;0,017398346;0,017277475;0,016972743;0,016375088;0,015299865;0,015098087;0,015536795;0,014465527;0,013624525;0,013861631;0,013675185;0,013079544;0,013650053;0,014091805;0,013741537;0,009524215;0,008291553
ES;1A3d;EM;CH4;ES_EM_1A3d_CH4;;kt;0,486471374;0,513193528;0,529385981;0,542393026;0,571321611;0,551430597;0,586937346;0,472405972;0,492275251;0,465190473;0,405669215;0,403800758;0,406602502;0,455456259;0,470008739;0,451365183;0,491831009;0,42605181;0,385830408;0,320651493;0,307441841;0,238797209;0,249801669;0,148323611;0,094653126;0,125329429;0,177141436;0,281035657;0,289043581;0,303235307;0,227599572;0,258808359
ES;1A3e;EM;CH4;ES_EM_1A3e_CH4;;kt;0,00041064;0,000445;0,000408744;0,000806946;0,00120061;0,00129424;0,00247326;0,00301733;0,001593315;0,0016835;0,002549974;0,00416998;0,004922187;0,004936982;0,00420105;0,00428201947927;0,00227276379003;0,00186495966016;0,00220680890773;0,00220616181479;0,00256756514884;0,00239061980505;0,00219169598828;0,002580971624;0,00240570652467;0,00193315549631;0,0020895804641;0,00244305780521;0,00260487326712;0,0024004317162;0,0017659393828;0,00265356868936
ES;1A4a;EM;CH4;ES_EM_1A4a_CH4;;kt;0,46584856;0,551444716;0,600187368;0,528571472;0,625853599;0,759064298;0,770007676;0,903790382;1,005679039;1,29623562;1,913012964;2,118969848;2,4958801;2,568149798;3,107971242;3,46310990367046;4,60497561589741;4,80986230800386;6,91364434000413;7,88065797287374;9,57508335332565;9,98649536233695;11,61859297250847;5,74837023890334;3,30386233113713;3,19040420442329;3,51476908540494;4,26450970732595;4,51964862886714;4,66453851081172;4,7830111243145;5,40226509902072
ES;1A4b;EM;CH4;ES_EM_1A4b_CH4;;kt;31,76333435;33,205514512;34,024512792;33,094937827;32,846542077;29,984955514;30,087715496;30,081024325;29,7460942;29,140604574;29,162130348;29,668460972;29,739216901;29,722599374;30,339716761;30,475222782;30,318124474;30,184561175;30,423915149;35,141601043;35,23254558;34,364816482;34,558294284;34,408415822;34,519137399;34,387578844;25,435074054;25,37586732;25,402627157;25,334366838;25,151059526;25,090411704
ES;1A4c;EM;CH4;ES_EM_1A4c_CH4;;kt;0,900650695;0,830057589;0,821870671;0,824668086;0,820862327;0,785682705;0,763810997;0,753248148;0,758997618;0,777952368;0,882702847;0,857519931;0,850654478;0,956122912;0,964427504;0,941576002;0,969974541;0,946564395;0,928043469;1,232823558;1,257700944;1,363604662;1,407574291;1,423536805;1,518745584;1,456751621;1,393233916;1,365930125;1,385286148;1,388615323;1,361647216;1,348714096
ES;1A5b;EM;CH4;ES_EM_1A5b_CH4;;kt;0,016130088;0,016638236;0,017744785;0,014805381;0,014472281;0,015377921;0,018080777;0,018742805;0,017230214;0,016852582;0,014924809;0,01502274;0,014431237;0,015034849;0,016001246;0,01627564;0,016261902;0,015663062;0,018044286;0,014276288;0,014606237;0,018702245;0,01250831;0,005163359;0,008682915;0,018079379;0,010371066;0,010089148;0,010568408;0,012071406;0,011543296;0,010867957
ES;1B1a;EM;CH4;ES_EM_1B1a_CH4;;kt;64,81341214;51,71018386299999;57,73776202699999;53,048940428;48,992088029;44,97847003200001;45,918023156;45,286329631;36,054359453;34,332653994;33,398893556;32,601667057;30,28447903;29,098691364;26,427908862;24,126250259;23,052410433;21,244612543;19,044532956;16,269782205;13,989585488;11,367285158;9,037735998;8,556356536;6,2852;4,21449426;3,341072028;3,290281779;3,016124514;0,633405681;1,066189619;0,949675666
ES;1B1b;EM;CH4;ES_EM_1B1b_CH4;;kt;0,0003211;0,000318;0,0002952005;0,0003054996;0,0002992999;0,0002437995;0,0002412994;0,0002646003;0,0002631003;0,0002330995;0,0002781791;0,0002648;0,0002627001;0,0002711296;0,0002839141;0,00027417;0,000284012;0,000274219;0,00026568538;0,000172113291;0,0002049974;0,0002113834;0,00018028431;0,000163895375;0,0001545802874;0,0001571234;0,0001568532;0,0001586116;0,0001364954;0,00010749778875;5,27089e-05;0,0001111921
ES;1B2a;EM;CH4;ES_EM_1B2a_CH4;;kt;0,15534733468455;0,15820597418381;0,13421532703033;0,12829257154734;0,13810701067134;0,13812261450326;0,14013076916947;0,14138175083733;0,14827607216208;0,15056469631598;0,14598651636729;0,14450066201365;0,14647633690712;0,13538006512338;0,14697006261984;0,15203881815808;0,15005879589484;0,14665083759993;0,15319977727989;0,10252901751612;0,10272672045377;0,10632936421066;0,12221455206499;0,1197197394322;0,11760780908129;0,12454461316086;0,12783883920608;0,12966118601933;0,13038943190887;0,1301718825279;0,11281930745672;0,11129072132131
ES;1B2b;EM;CH4;ES_EM_1B2b_CH4;;kt;5,42411283118277;5,70055872664464;5,91195849181681;6,24126539385971;7,13528513351714;7,53189223939188;5,69368503074731;6,3012939238909;8,04520762174401;9,32246397761045;8,01544015320375;7,9645212044725;9,84909660182558;8,5322413574616;8,40079663315962;8,44985624910987;11,12183557191856;11,15051951423956;12,6073599671336;11,30787827609391;10,62882290027556;8,83813025085028;7,7643378715747;7,81698337904062;6,92089427587847;6,66956870561894;7,18649284758401;6,10741153037368;6,96777371963578;7,048523458779;5,57675221336602;5,03204610537046
ES;1B2c;EM;CH4;ES_EM_1B2c_CH4;;kt;0,94822188763402;1,22167869360115;1,20511705008184;0,95864849453471;0,86412905568894;0,69472896089099;0,5500534055709;0,40168063794289;0,5653876356491;0,61583136573055;0,500142560901;0,8960942040272;1,60878527816374;0,98561087023859;0,83170416028553;1,28296608603437;1,04300242117573;2,11541361225218;2,80920720227736;2,62318857219241;2,33243227197111;3,36199295400406;2,78834907071722;3,58268769160352;4,03575172515623;1,37441824256715;1,20617958444934;0,97925895904469;1,24923576461884;0,8581648848822;1,33637626910106;1,62312555962366
ES;2B1;EM;CH4;ES_EM_2B1_CH4;;kt;NA;NA;NA;NA;NA;NA;NA;NA;NA;NA;NA;NA;NA;NA;NA;NA;NA;NA;NA;NA;NA;NA;NA;NA;NA;NA;NA;NA;NA;NA;NA;NA
ES;2B5;EM;CH4;ES_EM_2B5_CH4;;kt;0,183060576;0,149250633;0,122911132;0,123007852;0,169861796;0,181238308;0,173063948;0,161511433;0,150418904;0,158601692;0,154435538;0,167618486;0,163711378;0,155289988;0,163937648;0,164873608;0,167369954;0,165374944;0,20068644;0,181362782;0,118799086;0,186659649;0,186129498;0,181121315;0,173757;0,1813866;0,1637304;0,1709214;0,1770108;0,166311;0,108540821;0,157750782
ES;2B8;EM;CH4;ES_EM_2B8_CH4;;kt;3,168747132;3,0407480813;3,03438581074;3,29212672;3,668248011;3,70026461;3,809948391;3,65771904;3,99538209;4,178938471;3,96106884;4,04627436;3,94107406;4,251234821;4,37849664;4,26646756;4,21398802;4,55526018;3,54068358;3,75195271;4,11706414;4,00544754;3,50354746;3,26025632;4,00582043;4,22478998;4,34483306;4,3269246;4,303156448;3,901145911;3,97581894062;3,73843806184
ES;2B10;EM;CH4;ES_EM_2B10_CH4;;kt;NA;NA;NA;NA;NA;NA;NA;NA;NA;NA;NA;NA;NA;NA;NA;NA;NA;NA;NA;NA;NA;NA;NA;NA;NA;NA;NA;NA;NA;NA;NA;NA
ES;2C1;EM;CH4;ES_EM_2C1_CH4;;kt;1,11154664501666;1,14116945181055;1,03188607098816;1,05788282798154;1,05719297954766;0,73907069552321;0,67234535425769;0,47370285778265;0,3978721034722;0,64850638465389;0,8520039670707;0,84964501482717;0,83895354180342;0,7789347234675;0,85112876824925;0,85794190851803;0,82127403642849;0,86590098096463;0,83681146396716;0,63542721885849;0,78516770407588;0,76794624522;0,64726080095;0,73371667102;0,8461065899;0,870147995;0,8214667268;0,86917096043363;0,80982446414;0,79527656963609;0,48397804100693;0,74928574758
ES;2C2;EM;CH4;ES_EM_2C2_CH4;;kt;0,0488657;0,0569491;0,0262106000065;0,0411332999974;0,0463995999961;0,0495703000013;0,0503984;0,05512;0,0565097;0,0572845;0,0649493;0,06981;0,0763659;0,0864305;0,087542;0,0834158;0,0810524;0,0865293;0,0898365;0,0416143000052;0,0881322;0,089544;0,0856687;0,0918697;0,1056835;0,099502;0,0932256;0,0983502;0,1148579315;0,0880061;0,048152702;0,079137708
ES;2C7;EM;CH4;ES_EM_2C7_CH4;;kt;NA;NA;NA;NA;NA;NA;NA;NA;NA;NA;NA;NA;NA;NA;NA;NA;NA;NA;NA;NA;NA;NA;NA;NA;NA;NA;NA;NA;NA;NA;NA;NA
ES;2D1;EM;CH4;ES_EM_2D1_CH4;;kt;NA;NA;NA;NA;NA;NA;NA;NA;NA;NA;NA;NA;NA;NA;NA;NA;NA;NA;NA;NA;NA;NA;NA;NA;NA;NA;NA;NA;NA;NA;NA;NA
ES;2D2;EM;CH4;ES_EM_2D2_CH4;;kt;NA;NA;NA;NA;NA;NA;NA;NA;NA;NA;NA;NA;NA;NA;NA;NA;NA;NA;NA;NA;NA;NA;NA;NA;NA;NA;NA;NA;NA;NA;NA;NA
ES;2D3;EM;CH4;ES_EM_2D3_CH4;;kt;;;;;;;;;;;;;;;;NA;NA;NA;NA;NA;NA;NA;NA;NA;NA;NA;NA;NA;NA;NA;NA;NA
ES;3A1;EM;CH4;ES_EM_3A1_CH4;;kt;342,11158885000003;332,419354436;325,87040730999996;327,221381891;340,000995793;363,975585963;389,60465047199995;381,227723283;388,593594587;403,969002892;407,412973311;419,374075781;423,399968476;425,789978969;431,037492893;416,912249402;408,879330475;415,709307464;401,064518894;393,26953703;407,72045845599996;403,860376283;394,823005605;384,94787857899996;399,863960472;406,139165547;411,501898448;417,608456811;423,002554324;425,674819074;427,975507945;435,21037501
ES;3A2;EM;CH4;ES_EM_3A2_CH4;;kt;151,642253581;152,188865917;158,05359726;156,320254914;153,355977487;146,875894749;164,143011969;163,472976021;165,278973422;167,503284108;182,310475353;174,390156302;173,740914217;174,034115805;166,0842216;172,805815048;170,576145569;170,598444038;152,559298447;153,556026662;150,721211952;136,487046932;128,323973692;126,434538875;118,872582493;122,676518773;122,037110212;121,965375487;120,34932878;117,466779183;117,915705729;115,155749886
ES;3A3;EM;CH4;ES_EM_3A3_CH4;;kt;18,383349928;17,414978043;19,33205578;19,598003794;19,559759466;21,122053986;20,607293299;21,421224559;23,281257645;24,551810613;28,562268055;28,270484187;28,537563669;28,931224757;30,409955374;30,382095234;21,535557534;22,309757416;20,709618164;20,773175223;20,462716862;20,580730049;20,161259164;20,104110971;20,509960723;22,050352095;22,733675412;23,419726574;24,314665679;24,743028988;25,816090182;26,85510131
ES;3A4;EM;CH4;ES_EM_3A4_CH4;;kt;51,670381194;45,327319384;44,842380383;45,932806586;48,712567254;43,563546317;47,033094216;46,775477319;45,39521212;42,745041033;44,760371759;46,699241726;46,626645219;47,416217516;41,108414171;41,124666273;40,210437219;42,83832578;44,337502884;44,939873888;44,672547334;42,721158516;40,596209863;40,346042207;40,460244313;42,195082453;45,04384604;43,465114405;39,963201779;38,259025039;38,103844464;37,859226386
ES;3B;EM;CH4;ES_EM_3B_CH4;;kt;285,759853632;256,029075018;269,162657314;261,793560594;281,442068479;297,18630689;283,485312454;304,057847769;307,347592612;312,29902978399997;345,24394643299996;349,557008665;341,675760742;350,701008614;347,114955136;308,180087755;299,4190244;308,747009658;283,97960939;298,768066112;254,042297404;268,93153034700003;256,882266334;242,945787775;259,197338637;270,749986286;271,110655468;281,10646781;279,740950043;286,328129667;298,792591187;297,291833604
ES;3C;EM;CH4;ES_EM_3C_CH4;;kt;14,857566393;15,427936529;14,42064524;9,316217625;11,857147901;10,702757811;17,545936912;18,798956648;18,716470153;17,978625749;19,130363695;19,152549607;18,395504939;19,25885777;20,062100595;19,411149696;17,627454659;16,972144396;15,972793659;19,398921238;19,89691829;19,87319477;18,071665244;18,047714699;17,690749228;17,59963913;18,786442331;17,328016293;16,970246602;16,743067295;16,532364641;16,532364641
ES;3D;EM;CH4;ES_EM_3D_CH4;;kt;IE;IE;IE;IE;IE;IE;IE;IE;IE;IE;IE;IE;IE;IE;IE;IE;IE;IE;IE;IE;IE;IE;IE;IE;IE;IE;IE;IE;IE;IE;IE;IE
ES;3F;EM;CH4;ES_EM_3F_CH4;;kt;25,048663477;25,000887015;21,159250039;21,062405095;18,529134785;15,106302755;23,266743931;21,911263847;23,653478256;20,798570806;8,833530465;2,95389083;3,242802622;3,234394131;1,408511005;1,266465352;0,618550466;0,513012633;0,318810165;0,316738569;0,401517319;0,711007033;0,580186953;0,469545452;0,911110439;0,927742198;0,640335467;0,762979215;0,899862735;0,808848689;0,739568896;0,739568896
ES;4A;EM;CH4;ES_EM_4A_CH4;;kt;5,26004536059598;8,89528355350867;3,15429120872626;2,2844715580195;15,16308335264835;3,25143076761786;0,89217652900375;2,00315990499256;3,06977525051318;1,86269637366685;3,35613235318988;1,55352632835343;2,1641637843609;4,48824255193214;5,09980499808005;5,25278723588435;6,24770432067009;1,84271539304604;0,77654408875236;2,76317323763605;0,83660446619738;1,5821421719099;5,95149432923879;1,49643299384007;0,78685549214955;2,72821258084991;1,77648273559888;5,18708580043939;0,79268668335206;1,33998803651741;0,68276358064445;2,24256925310454
ES;4B;EM;CH4;ES_EM_4B_CH4;;kt;0,2287703376;0,5383116896;0,3468634674;0,102261732;0,4256574991;0,2191741761;0,22316378;0,1210223113;0,109966902;0,09404008;0,28778037;0,23741842;0,30687428;0,29298849;0,24936761;0,1654130836;0,478762547;0,1860523954;0,2340844545;0,3094640922;0,1338599448;0,1290225191;0,4488012456;0,2400916202;0,1808201029;0,2253466642;0,204096123;0,2766348807;0,2851816602;0,2860945572;0,1858775784;0,3066680581
ES;4C;EM;CH4;ES_EM_4C_CH4;;kt;7,058961395;7,500235991;3,751904463;3,216286765;10,450150556;5,956321707;2,7662512022;4,574421148;5,2784757028;3,3724883256;8,0542721833;3,8766954848;4,3431212731;4,8801638924;4,0708631385;6,82424539335;4,70602505178;2,932845582475;2,224866430932;4,4254777641;2,53418254263999;4,6966984699;7,57384467143;2,2825422916;2,173049267114;4,26127032233;2,47860472808;5,95491110734;1,13737440875;2,496329686245;2,01141588856;3,506429529423
ES;4D;EM;CH4;ES_EM_4D_CH4;;kt;1,292567201e-05;1,274364912e-05;1,048846377e-05;8,92154081e-06;7,76389016e-06;9,03041953e-06;7,46889397e-06;8,02222121e-06;8,54465294e-06;8,11751335e-06;8,16683448e-06;8,28073837e-06;9,40674905e-06;1,051414798e-05;1,065131655e-05;1,361933181e-05;1,634148589e-05;1,62233013e-05;1,51173913e-05;1,092100076e-05;1,209056293e-05;1,611237529e-05;1,142370404e-05;1,528657208e-05;1,541220137e-05;1,474980931e-05;2,103127384e-05;1,577810831e-05;1,727635393e-05;1,49500717e-05;1,593258581e-05;1,593258581e-05
ES;5A1;EM;CH4;ES_EM_5A1_CH4;;kt;172,947319185;183,892450913;196,671341646;209,095210396;220,344323177;235,963358169;250,112778197;266,919326005;281,720417996;296,916123512;309,579472016;325,36019807;336,517193479;331,585118478;318,382877591;331,283862727;343,702447845;355,241499682;365,838854909;421,170792525;383,916956264;409,368615504;410,11480299;399,827095883;366,281163791;397,781313926;380,797253538;374,000347278;370,289982942;359,371195159;349,667435664;348,167168849
ES;5A2;EM;CH4;ES_EM_5A2_CH4;;kt;46,004847916;49,549008935;54,075335372;57,510823089;59,636055073;60,016813552;58,963973684;60,09373055;60,655659319;60,853368871;59,259502261;57,897873714;55,305708339;53,183684162;51,05346867;49,095798656;47,457111259;45,776118177;44,04743813;42,044421879;39,923696319;37,909359115;35,89689747;33,948961752;32,151154334;30,482373755;28,926376439;27,470390429;26,10415726;24,819265236;23,608681835;22,46642271
ES;5B1;EM;CH4;ES_EM_5B1_CH4;;kt;4,766468224;3,52787848;2,72842248;2,900268336;3,290897411;3,878936342;4,451225991;5,584819274;5,603089634;6,171632992;7,67954273;8,467938352;10,377463175;11,047096817;13,21652293;13,718865757;14,628304589;15,480243945;16,892023748;17,506151998;18,130172;17,17412;16,49978;15,198084;13,894464;14,59812;14,334744;14,359008;13,009368;11,885256;12,461492;12,461492
ES;5B2;EM;CH4;ES_EM_5B2_CH4;;kt;;;;;;;;;;;;;0,0140272;0,033448;0,0552896;0,0551632;0,04214304;0,06088848;0,115163344;0,301407076;0,287019208;0,44537354;0,615127836;1,0871978;1,318524361;1,268506979;0,895330627;0,962622231;1,003070785;0,923279574;1,09591875;1,162890202
ES;5C1;EM;CH4;ES_EM_5C1_CH4;;kt;0,00170965154;0,00200690734;0,00228271952;0,00260806612;0,0037573549;0,00387982066;0,00392434532;0,00355666126;0,00389188798;0,00392376206;0,00678487652;0,0053496674;0,0067038427;0,0074599632;0,00381846926;0,00387144132;0,00400001886;0,00894292542;0,00881285934;0,00599977822;0,0061498;0,00606930286;0,0073212143;0,00483061566;0,005188825;0,00541077752;0,0051031162;0,00506458472;0,00496735506;0,00441473608;0,00459274912;0,0045903158
ES;5C2;EM;CH4;ES_EM_5C2_CH4;;kt;8,644061023;8,076783743;8,66148025;7,590794405;6,804329078;4,872231819;9,152597281;10,922696648;8,527222194;7,650972592;9,537180321;11,693246772;8,805311322;12,779044953;9,655189932;8,17872609;10,458871551;10,760903451;9,940686967;11,665027636;12,052160439;12,802551667;7,740428191;14,781106658;8,925734476;12,268042946;11,979953298;11,319895212;15,69122974;10,838533212;13,636879673;13,636879673
ES;5D1;EM;CH4;ES_EM_5D1_CH4;;kt;138,436179541;133,52117512;128,937072326;119,424269921;115,5380243;113,014806327;108,848665736;102,425756013;85,578976217;75,113751845;68,513696164;57,338665961;53,027841314;45,148579576;39,307020551;36,881699254;43,309486552;53,13044673;47,379994178;42,209653423;37,017444177;40,661334124;40,695196457;27,823726631;27,734174418;28,637534013;28,630424642;26,854071193;26,782944224;22,118892222;22,227439335;14,420636543
ES;5D2;EM;CH4;ES_EM_5D2_CH4;;kt;68,7678306845625;66,5670772198125;63,014867579375;62,7148848650625;66,8912890715;65,0918278904375;63,5670252090625;66,3068627859375;67,2889204161875;66,1144466988125;63,5180562049375;62,2426030831875;62,1154763521875;62,2739188668125;60,90886810075;59,7624161315;58,6757385231875;58,62482879796875;54,5022023209375;51,4293192814375;52,3190449678125;51,408056818125;47,085707566;44,9972524544375;45,816405702875;46,07198659694322;46,96704876762156;47,52495878019656;48,45925947363938;48,46333779564687;46,46702709454781;48,99077920045031
ES;5E;EM;CH4;ES_EM_5E_CH4;;kt;1,755415146;1,679303857;1,576128357;1,457753123;1,247993237;1,066709073;0,911087315;0,777209861;0,643814359;0,66008576;0,668276407;0,685685335;0,744364943;0,763166849;0,758008337;0,701496474;0,711152868;0,768774662;0,771170913;0,41938274;0,031514885;0,030710974;0,031397408;0,012983146;0,016892517;0,018310114;0,266972705;0,020100282;0,020113825;0,021138385;0,020107899;0,020107899
ES;6_OTHER;EM;CH4;ES_EM_6_OTHER_CH4;;kt;NA;NA;NA;NA;NA;NA;NA;NA;NA;NA;NA;NA;NA;NA;NA;NA;NA;NA;NA;NA;NA;NA;NA;NA;NA;NA;NA;NA;NA;NA;NA;NA
ES;1A1a;EM;N2O;ES_EM_1A1a_N2O;;kt;0,9190075080126;0,96347949901509;1,11993399873793;1,1417578867729;1,25503994930297;1,46826466198145;1,28191444539141;1,52420685388919;1,44855272035717;1,67877378800931;1,6819213126242;1,65515944652228;1,90666553048859;1,94887032480569;2,18930626198056;2,57631503281798;2,60284946794379;2,80811939929282;2,87415575697995;2,52862584938921;2,04367342348593;2,13580639769351;1,98912123967434;1,69930212864253;1,70288166238905;1,9213961514038;1,58561193214013;2,03784101785811;1,79610393973516;1,63407625928995;1,37348573747876;1,43241631159898
ES;1A1b;EM;N2O;ES_EM_1A1b_N2O;;kt;0,04268067623127;0,04344521317819;0,04538571496088;0,04605401765546;0,05098417814364;0,05156875035794;0,05317733398954;0,05295766594142;0,05223046944052;0,05303789943935;0,05287318258546;0,05509341021794;0,05284430742781;0,05134674604631;0,05177947912928;0,0492711370165;0,04978097756312;0,04870730749535;0,04711864436588;0,04107543904107;0,03700566635108;0,03292146269041;0,02875907160291;0,02474984899375;0,02231093901568;0,02146679431503;0,02049520356375;0,01999245855312;0,02005686300211;0,01888373594685;0,01680080925956;0,0171544322282
ES;1A1c;EM;N2O;ES_EM_1A1c_N2O;;kt;0,009147324684;0,010750816745;0,007070106203;0,006641201744;0,006258981815;0,004594606299;0,0044353345;0,0036636808;0,003681737699;0,004550204799;0,0030804522;0,002680264401;0,0020619939;0,0019359085;0,001977806097;0,00288649456043;0,03772445137213;0,03434015828492;0,04011945163772;0,06265560120469;0,06401507031053;0,05358250521086;0,05637482759625;0,05112703468134;0,04316528836236;0,022434048433;0,02194343354169;0,02222641512787;0,01750955467411;0,00697374138008;0,0049238845559;0,00642766566407
ES;1A2a;EM;N2O;ES_EM_1A2a_N2O;;kt;0,03005908059426;0,04064652546915;0,02681080958687;0,0249750156636;0,04770717126628;0,05619766662656;0,0418941796068;0,02946251425157;0,02187758045909;0,01989278309448;0,02266819765625;0,03164382940302;0,02926810516802;0,0312745022483;0,04402442890609;0,03303707988811;0,02716173142426;0,02939798949422;0,03146631928216;0,02487355549062;0,03048059033892;0,02872190998904;0,03639463326979;0,02127706647387;0,02441879870436;0,02737146811174;0,02411707009816;0,02700825820078;0,02627955978069;0,02523717780004;0,04185660256692;0,03834723185465
ES;1A2b;EM;N2O;ES_EM_1A2b_N2O;;kt;0,00836896967843;0,01184337274529;0,01200519756736;0,00921398870274;0,01099574024616;0,01195696185758;0,01255128507932;0,01829423150732;0,01818501865498;0,01670947238116;0,02047666752953;0,02430717093482;0,02687662386968;0,02532113949315;0,02617312160081;0,02041402701197;0,01806851611402;0,01810365881703;0,01621256183697;0,01872852971841;0,02005256083989;0,01572321487004;0,01252376657868;0,00838442668153;0,00613707540389;0,0054415659632;0,00519901755132;0,00530745438392;0,00607569159345;0,00860084343965;0,00712855828724;0,01255138916979
ES;1A2c;EM;N2O;ES_EM_1A2c_N2O;;kt;0,05199654677583;0,05539664520324;0,05865069230295;0,05797984281744;0,06524114553842;0,10062123199251;0,08859884468879;0,06881125120744;0,06679319454682;0,07013531257593;0,08049436942775;0,07173641824182;0,07821418113833;0,08594795044637;0,08526213115411;0,08681768306644;0,08448096749232;0,07696148077331;0,07740736380732;0,05240971798355;0,05647075730145;0,06708909058691;0,0754675843826;0,08832355596224;0,0776797724774;0,08144794243592;0,08270130068063;0,08652093006382;0,09148615351774;0,08992637761173;0,08712205376717;0,09076637430251
ES;1A2d;EM;N2O;ES_EM_1A2d_N2O;;kt;0,06912942476766;0,07451860346191;0,07245347166013;0,06940076962774;0,08029179217676;0,09151995395798;0,08638537881811;0,09374043310876;0,10035542052126;0,10427046918703;0,10779241346444;0,09819248170419;0,10262028133875;0,11691331009978;0,12024677247546;0,11833293187797;0,14175105527976;0,13785150086492;0,1086589214491;0,1170330140105;0,10896416676023;0,11024386839476;0,12160116027041;0,11037191597325;0,13502144793509;0,12107959295762;0,13216515975007;0,12452136031789;0,11817349174966;0,11300899237974;0,0941786999154;0,09994187953834
ES;1A2e;EM;N2O;ES_EM_1A2e_N2O;;kt;0,02176844;0,024908672;0,024497791;0,024114953;0,027532564;0,036692625;0,031683095;0,033423492;0,03459142;0,085678045;0,080457463;0,0830862;0,095379291;0,100967973;0,095920742;0,088766265;0,077401412;0,071721283;0,081438885;0,065323644;0,056254119;0,060706378;0,070997835;0,060370972;0,04445323;0,06640102;0,10038439870187;0,11291616756902;0,11514486949759;0,12491270388319;0,11928405355541;0,11780720997602
ES;1A2f;EM;N2O;ES_EM_1A2f_N2O;;kt;0,16946364445157;0,18697337006398;0,1802113103033;0,15533644198791;0,14821995102756;0,16563782254013;0,18133701389457;0,16060971101209;0,14426723294328;0,15515735468984;0,14267862283349;0,14054631200649;0,1358465784062;0,15825662054418;0,14299433323003;0,15906297010933;0,15223967358908;0,16339997013509;0,14182894349028;0,12709036695717;0,13644345212956;0,15325218256909;0,1318954754987;0,10952223653419;0,11279415594978;0,12746580220299;0,13395490173376;0,13848498154651;0,14657424159085;0,15001906713568;0,14459182837518;0,15580910344534
ES;1A2g;EM;N2O;ES_EM_1A2g_N2O;;kt;0,39998897230886;0,35509308425604;0,28716544071167;0,28635283083323;0,25530872413335;0,27153419095713;0,26198076035097;0,2453546077403;0,29303682655815;0,25930919454807;0,27229377910303;0,29210512895621;0,30462829619494;0,3427553242195;0,35651594589162;0,37719360287622;0,31744156002214;0,35871120528469;0,34506184127354;0,29003964973385;0,26720144173943;0,24397896162063;0,24025768858969;0,174714421542;0,145852046474;0,171862753201;0,201051869827;0,219466140249;0,227932498134;0,248967159154;0,220290127224;0,224337215436
ES;1A3a;EM;N2O;ES_EM_1A3a_N2O;;kt;0,04498944563166;0,04966830728579;0,05453724594708;0,05365145298189;0,05662051784913;0,06198526076024;0,06770541765367;0,07228964688382;0,07685919249862;0,08385680727151;0,08995043841559;0,09172401955598;0,08828050610515;0,09261398547165;0,1025365390516;0,1086728517144;0,11070929398722;0,11536927642921;0,10810963594791;0,0948966225042;0,09465704537835;0,09196249734479;0,07641368206136;0,06529676360488;0,06488702941569;0,06759068575039;0,07282246802404;0,07620113646551;0,08220137123152;0,08498727786155;0,04120202839194;0,05910235766122
ES;1A3b;EM;N2O;ES_EM_1A3b_N2O;;kt;1,556597806;1,616137616;1,648217024;2,233831236;3,957391919;4,697434718;5,635324866;5,200081921;5,125667512;5,008854026;3,437531541;2,959255229;2,795759708;2,833880741;2,851043646;2,884910463;2,961419362;3,080199232;2,987839397;2,779357033;2,767178016;2,712909067;2,586000179;2,571339307;2,641470518;2,735493854;2,836141101;2,941437658;3,03780237;3,081586617;2,603592398;2,953560685
ES;1A3c;EM;N2O;ES_EM_1A3c_N2O;;kt;0,00316914;0,003111969;0,003088424;0,002660755;0,002480101;0,002470306;0,002402639;0,002444454;0,002461142;0,002437654;0,002317105;0,002386263;0,002312534;0,002349618;0,002318261;0,002334564;0,002318343;0,002277463;0,002197258;0,002052975;0,002025904;0,002084779;0,001941033;0,001828182;0,00185999;0,001834979;0,001755059;0,001831606;0,001890882;0,001843884;0,001277989;0,001112593
ES;1A3d;EM;N2O;ES_EM_1A3d_N2O;;kt;0,138991818;0,146626727;0,151253135;0,154969435;0,163234749;0,157551599;0,167696382;0,134973137;0,140650077;0,132911566;0,115905494;0,115371647;0,116172151;0,130130365;0,134288218;0,128961481;0,140523139;0,121729092;0,110237262;0,091614715;0,087840523;0,068227773;0,071371895;0,042378179;0,027043756;0,035808408;0,05061184;0,080295905;0,082583887;0,086638666;0,065028446;0,073945245
ES;1A3e;EM;N2O;ES_EM_1A3e_N2O;;kt;5,2512e-05;4,7044e-05;5,2323e-05;0,000127759;0,000162037;0,000180304;0,000290573;0,000364061;0,000212757;0,000215412;0,000290614;0,000448797;0,00052529;0,000529315;0,00044809;0,0004320434532;0,00022863980782;0,0001878880636;0,00022620386505;0,00022532386184;0,00025983527681;0,00024212591528;0,00022164724219;0,00026193552604;0,00024271407972;0,00019527566536;0,00021140702865;0,00025983045198;0,00027520016648;0,00025182274205;0,00018340760574;0,00026835664105
ES;1A4a;EM;N2O;ES_EM_1A4a_N2O;;kt;0,022272512;0,026639885;0,029082041;0,024931549;0,026408724;0,028976578;0,02949959;0,030367681;0,029836685;0,033062025;0,047109974;0,050192204;0,050544041;0,052293784;0,058520179;0,06152563160329;0,06317572919987;0,05636589358235;0,05775196508041;0,06651390097339;0,05982655182253;0,0622020526817;0,05859954202702;0,05751611234755;0,04954749057545;0,04452196668045;0,0512287020743;0,0594013588845;0,0608552422706;0,05669321191909;0,05632375796985;0,06049027237208
ES;1A4b;EM;N2O;ES_EM_1A4b_N2O;;kt;0,414547306;0,425827145;0,432186361;0,429871122;0,431427294;0,406585807;0,411272214;0,411865442;0,4099065;0,409836984;0,415325838;0,418075066;0,418589014;0,42513373;0,437895668;0,437861414;0,429474659;0,427752739;0,427832861;0,487058337;0,49207624;0,478705623;0,480724887;0,481756645;0,484063298;0,489250131;0,366855362;0,365199643;0,369075794;0,363626458;0,365725681;0,365009025
ES;1A4c;EM;N2O;ES_EM_1A4c_N2O;;kt;0,270428027;0,276881535;0,283609931;0,287689283;0,290966452;0,294389396;0,298642201;0,302737672;0,309430247;0,316504052;0,326131933;0,335950469;0,342279378;0,343622669;0,35145654;0,35590969;0,361056358;0,366407319;0,354824009;0,371174158;0,376195768;0,379303247;0,384854597;0,387170079;0,416149724;0,414790495;0,420086479;0,418058148;0,425563291;0,424486004;0,426219934;0,4318004
ES;1A5b;EM;N2O;ES_EM_1A5b_N2O;;kt;0,008120916;0,008249968;0,008957859;0,008232494;0,008549724;0,009353685;0,010711159;0,011335835;0,011495201;0,011808568;0,011691926;0,011794451;0,01135671;0,011955164;0,013072015;0,013806889;0,014362541;0,01480531;0,01637311;0,014156048;0,015532477;0,015681361;0,013356076;0,009449392;0,011750572;0,014284532;0,013888579;0,013770487;0,012945142;0,012946815;0,012618487;0,011553485
ES;1B1a;EM;N2O;ES_EM_1B1a_N2O;;kt;NA;NA;NA;NA;NA;NA;NA;NA;NA;NA;NA;NA;NA;NA;NA;NA;NA;NA;NA;NA;NA;NA;NA;NA;NA;NA;NA;NA;NA;;;
ES;1B1b;EM;N2O;ES_EM_1B1b_N2O;;kt;NE;NE;NE;NE;NE;NE;NE;NE;NE;NE;NE;NE;NE;NE;NE;NE;NE;NE;NE;NE;NE;NE;NE;NE;NE;NE;NE;NE;NE;NE;NE;NE
ES;1B2c;EM;N2O;ES_EM_1B2c_N2O;;kt;0,0007801053001;0,00098701840209;0,00097075538761;0,00075503564648;0,0006615739594;0,00054664154407;0,00044058959841;0,00031223147984;0,00043218185357;0,00024808849695;0,00019116596513;0,00030105388365;0,00028322071359;0,00027638293807;0,00022863088046;0,00014877350275;0,00012836568553;0,00016358918767;0,00015345703415;0,00012285118295;0,00013193545711;0,00016192179539;0,00060180477672;0,0024351180231;0,00367114828218;0,00037143244263;0,00015291825667;0,00012295391548;0,00010830915763;6,605031809e-05;5,916490389e-05;6,369315876e-05
ES;2B1;EM;N2O;ES_EM_2B1_N2O;;kt;NA;NA;NA;NA;NA;NA;NA;NA;NA;NA;NA;NA;NA;NA;NA;NA;NA;NA;NA;NA;NA;NA;NA;NA;NA;NA;NA;NA;NA;NA;NA;NA
ES;2B2;EM;N2O;ES_EM_2B2_N2O;;kt;9,16111213029028;8,04950689387375;6,8702319497889;5,72257737742917;6,97015868399604;7,64901704056734;7,86945287334999;7,49664327232836;7,07810824502166;7,68933793262995;7,42331914077797;6,6427712;5,6827808;5,8942304;5,591766982;5,9675242;5,0187392;3,900369239;3,186;2,8884988;1,6270568;0,8334228;0,5191456;0,6238892;0,59302;0,5729457782;0,57065;0,45309;0,50155377;0,49933;0,4581934;0,43657
ES;2B4;EM;N2O;ES_EM_2B4_N2O;;kt;0,420381;0,403983;0,489645;0,514458;0,526806;0,549252;0,568989;0,637884;0,624186;0,621279;0,660195;0,652446;0,702549;0,740223;0,795771;0,820764;0,807444;0,856647;0,730692;0,75303;0,838737;0,699021;0,855252;0,85086;0,833013;0,851301;0,892035;0,868932;0,925092;0,871299;0,874531549;0,776628
ES;2B10;EM;N2O;ES_EM_2B10_N2O;;kt;NA;NA;NA;NA;NA;NA;NA;NA;NA;NA;NA;NA;NA;NA;NA;NA;NA;NA;NA;NA;NA;NA;NA;NA;NA;NA;NA;NA;NA;NA;NA;NA
ES;2C7;EM;N2O;ES_EM_2C7_N2O;;kt;NA;NA;NA;NA;NA;NA;NA;NA;NA;NA;NA;NA;NA;NA;NA;NA;NA;NA;NA;NA;NA;NA;NA;NA;NA;NA;NA;NA;NA;NA;NA;NA
ES;2D1;EM;N2O;ES_EM_2D1_N2O;;kt;NA;NA;NA;NA;NA;NA;NA;NA;NA;NA;NA;NA;NA;NA;NA;NA;NA;NA;NA;NA;NA;NA;NA;NA;NA;NA;NA;NA;NA;NA;NA;NA
ES;2D2;EM;N2O;ES_EM_2D2_N2O;;kt;NA;NA;NA;NA;NA;NA;NA;NA;NA;NA;NA;NA;NA;NA;NA;NA;NA;NA;NA;NA;NA;NA;NA;NA;NA;NA;NA;NA;NA;NA;NA;NA
ES;2D3;EM;N2O;ES_EM_2D3_N2O;;kt;;;;;;;;;;;;;;;;NA;NA;NA;NA;NA;NA;NA;NA;NA;NA;NA;NA;NA;NA;NA;NA;NA
ES;2G3;EM;N2O;ES_EM_2G3_N2O;;kt;1,35715251;1,632381643;1,930925616;2,150068101;2,330273229;2,450893322;2,521813352;2,557774341;2,42155044;2,292584876;2,245198835;2,437989385;2,220227955;1,915719689;1,651188957;2,13626755;2,69604578;2,50645733;2,483704207;2,396047591;2,275004003;1,983549772;1,591916186;1,300760348;1,309262949;1,039812005;1,103698;1,141539997;1,361415002;1,915753004;2,212992006;2,064599999
ES;2H;EM;N2O;ES_EM_2H_N2O;;kt;0,000280087476;0,000225852038;0,00022289941332;0,000254177663;0,00026025151557;4,8115999e-05;0,00011561010055;0,0001807712;0,000216520897;0,000150161;0,000110207101;0,000162589696;0,000143724;0,000108172347;6,2876825e-05;0,000114190852;9,7403643e-05;0,000100098096;0,00011114559659;4,2721685e-05;0,000166770807;0,000104624522;0,000216080495;0,000211667602;0,00041065859;0,0006847991;0,0005543766;0,000140431403;0,000216377614;0,000120853363;0,000251020491;0,000267296098
ES;3B;EM;N2O;ES_EM_3B_N2O;;kt;6,115057367;6,154160907;6,412871467;6,416147174;6,567280408;6,807566995;7,154617475;7,158865056;7,522228402;7,099614912;7,61937742;7,907910961;7,841822303;7,731621292;7,377808147;7,242329137;7,11057705;7,140265467;6,651594407;6,556121493;6,54388012;6,405091339;6,406962414;6,344168159;6,429263263;6,580246526;6,648800846;6,736941277;6,829607913;6,77577071;6,874603231;6,868928539
ES;3D;EM;N2O;ES_EM_3D_N2O;;kt;21,610889977;21,369362915;20,718962304;18,679314603;20,854945295;19,990299769;23,598598944;22,271129177;23,608334573;24,376652904;26,028144647;24,612878582;23,566928216;25,546229512;23,896861729;21,551213612;22,002677452;22,72314839;19,017849922;19,332972674;21,588037702;20,499598893;20,105389789;21,592626114;23,383591852;23,227854832;22,47005163;23,517644228;23,394378743;22,856610215;23,719868527;23,095772739
ES;3F;EM;N2O;ES_EM_3F_N2O;;kt;0,649409794;0,648171145;0,54857315;0,546062367;0,480384964;0,391644896;0,603211876;0,568069808;0,613238323;0,539222215;0,229017463;0,07658235;0,084072667;0,08385466;0,036516954;0,032834287;0,016036497;0,013300328;0,008265448;0,008211741;0,01040971;0,018433518;0,015041886;0,012173401;0,023621381;0,024052579;0,016601291;0,019780941;0,023329773;0,02097015;0,019174008;0,019174008
ES;4A;EM;N2O;ES_EM_4A_N2O;;kt;0,5624596687756;0,76384533253441;0,4465459027186;0,39871560066015;1,11143682536495;0,45278172268435;0,32255716682677;0,38430320241532;0,44359483631839;0,37710764089904;0,46001062902352;0,35949253584715;0,39247301820681;0,52155972003234;0,55477444096743;0,56189635301881;0,61646124909576;0,36642732991608;0,30126366415134;0,40482459273365;0,28553371815217;0,31529169056719;0,54409150654537;0,28536562125644;0,23479723586063;0,32895727977059;0,26703623198152;0,44772276492825;0,19565473747126;0,21813613351967;0,17337181328798;0,25361482650507
ES;4B;EM;N2O;ES_EM_4B_N2O;;kt;0,41739668892027;0,45242366732313;0,44167478986599;0,42601284060885;0,4623417822617;0,45020999096456;0,45730628917742;0,45467255113028;0,46045194522313;0,46572526934599;0,49015575106885;0,48618602877618;0,49315619348352;0,49251690319085;0,48916266989818;0,48205914028552;0,51110486409285;0,47188273960592;0,463454505449;0,45587788807207;0,41603218280306;0,39003502812405;0,38924928358504;0,35243318698806;0,32628087674108;0,3082876893541;0,28455072073529;0,27130929738647;0,24997713305766;0,23147074741885;0,20112790792004;0,19600777230675
ES;4C;EM;N2O;ES_EM_4C_N2O;;kt;0,65829702536959;0,69912457938394;0,35742287859829;0,30905591881264;0,97007639932699;0,56030755184134;0,26957750969569;0,43520855217004;0,50002905894439;0,32654138931874;0,75454587592309;0,37735441119475;0,41984219447679;0,46877760145883;0,39478600480087;0,64608285676791;0,45258121080094;0,29044583385665;0,22556787722975;0,42625687790255;0,26036355013597;0,45682270011752;0,71853070122806;0,23461418227849;0,2238193870777;0,41368544263233;0,2496853845704;0,56585233278547;0,12475534780554;0,2475989345551;0,20208925791867;0,33811834862619
ES;4D;EM;N2O;ES_EM_4D_N2O;;kt;0,00037850242345;0,00035999230269;0,00034132196094;0,00032270481044;0,00030411928987;0,00028572111811;0,00026710438474;0,00024865109432;0,00023019541618;0,00021166635198;0,00019317411027;0,00017672947365;0,00016036305604;0,00014399520006;0,00012755236141;0,00011132830014;9,508523788e-05;9,519434324e-05;9,522711386e-05;9,502104172e-05;9,803522407e-05;0,00010126983793;0,00010383127624;0,00010547915474;0,00010683820684;0,00010813635797;0,00010731788729;0,00010560798149;0,00010441984751;0,00010293614113;0,00010170814968;9,836161232e-05
ES;4E;EM;N2O;ES_EM_4E_N2O;;kt;0,10961982904846;0,11091857666838;0,1122173242883;0,11351607190822;0,11481481952814;0,11611356714806;0,11741231476798;0,11871106238791;0,12000981000783;0,12130855762775;0,12260730524767;0,12499711397561;0,12738692270355;0,12977673143149;0,13216654015943;0,13455634888736;0,1369461576153;0,15988703278335;0,18282790795139;0,20576878311943;0,22171853398522;0,23766828485101;0,25361803571679;0,2550609763855;0,25650391705421;0,25794685772292;0,260454537982;0,26296221824107;0,26546989850015;0,26797757875922;0,2704852590183;0,27190187816935
ES;4F;EM;N2O;ES_EM_4F_N2O;;kt;0,00101654446779;0,00104211550631;0,00106768654483;0,00109325758335;0,00111882862187;0,00114439966039;0,00116997069891;0,00119554173743;0,00122111277595;0,00124668381447;0,00127225485299;0,00129757715942;0,00132289946585;0,00134822177227;0,0013735440787;0,00139886638513;0,00142418869156;0,00146411841456;0,00150404813757;0,00154397786057;0,00148799225403;0,00143200664749;0,00137602104095;0,00130090133096;0,00122578162098;0,00115066191099;0,00117969068531;0,00120871945963;0,00123774823394;0,00126677700826;0,00129580578258;0,00132508328899
ES;5B1;EM;N2O;ES_EM_5B1_N2O;;kt;0,285988093;0,211672708;0,163705348;0,174016101;0,197453844;0,23273618;0,26707356;0,335089157;0,336185377;0,370297979;0,460772562;0,508076301;0,622647791;0,66282581;0,792991376;0,823131948;0,877698277;0,928814639;1,013521424;1,050369118;1,08781032;1,0304472;0,9899868;0,91188504;0,83366784;0,8758872;0,86008464;0,86154048;0,78056208;0,71311536;0,74768952;0,74768952
ES;5C1;EM;N2O;ES_EM_5C1_N2O;;kt;0,03010742;0,029344613;0,03284705;0,034452182;0,046485569;0,043877091;0,044452363;0,041139894;0,044053257;0,043385555;0,073251551;0,059439165;0,071871078;0,077538214;0,041040822;0,04146927;0,0425106;0,093460999;0,092093928;0,063728686;0,064835961;0,064260078;0,077840101;0,05219379;0,055433069;0,057145769;0,055512269;0,05371146;0,052527422;0,046312201;0,048463815;0,048190578
ES;5C2;EM;N2O;ES_EM_5C2_N2O;;kt;0,756304384;0,669833569;0,734673627;0,645638375;0,579293248;0,447124757;0,835768289;0,981653607;0,792825725;0,749397191;0,90807978;1,053172596;0,85298905;1,171408863;0,91660623;0,799706518;0,988221241;0,987047157;0,92394279;1,050520428;1,086674607;1,134086315;0,744532718;1,309056991;0,853389001;1,093244644;1,07683981;1,018680544;1,384705395;0,998948959;1,232764935;1,232764935
ES;5D1;EM;N2O;ES_EM_5D1_N2O;;kt;2,89542502;2,75841149;2,74197958;2,77344754;2,76289684;2,64815111;2,63457015;2,76489363;2,79307982;3,09736675;3,23196426;3,34527645;3,45987771;3,54270105;3,74953732;3,72861911;3,68018938;3,35356443;3,13722306;3,55141331;3,48539502;3,00958622;3,01446197;3,26430765;3,14286352;3,09904958;3,13076221;3,30395548;3,3132624;3,27779406;3,53031254;3,20219454
ES;5D2;EM;N2O;ES_EM_5D2_N2O;;kt;IE;IE;IE;IE;IE;IE;IE;IE;IE;IE;IE;IE;IE;IE;IE;IE;IE;IE;IE;IE;IE;IE;IE;IE;IE;IE;IE;IE;IE;IE;IE;IE
ES;5E;EM;N2O;ES_EM_5E_N2O;;kt;NA;NA;NA;NA;NA;NA;NA;NA;NA;NA;NA;NA;NA;NA;NA;NA;NA;NA;NA;NA;NA;NA;NA;NA;NA;NA;0,003822259;NA;NA;NA;NA;NA
ES;6_OTHER;EM;N2O;ES_EM_6_OTHER_N2O;;kt;NA;NA;NA;NA;NA;NA;NA;NA;NA;NA;NA;NA;NA;NA;NA;NA;NA;NA;NA;NA;NA;NA;NA;NA;NA;NA;NA;NA;NA;NA;NA;NA
ES;2B9;EM;HFC;ES_EM_2B9_HFC;;kt;2546,9599974704;2309,3759991072;2927,8880013764;2393,2000039432;3664,2000044143997;4915,3600040424;5386,68599504;6180,8883197800005;5438,7371384024;6302,5906900268;6789,775600192001;3188,0444611880002;1253,040978744;1865,7594537768;844,058973809974;733,255474720709;926,92340425765;761,362668217452;742,801560404743;580,523194034087;989,714569109873;426,352188813606;317,355978423383;203,311353407597;142,832710011723;;;;;;;
ES;2B10;EM;HFC;ES_EM_2B10_HFC;;kt;NA;NA;NA;NA;NA;NA;NA;NA;NA;NA;NA;NA;NA;NA;NA;NA;NA;NA;NA;NA;NA;NA;NA;NA;NA;NA;NA;NA;NA;NA;NA;NA
ES;2C7;EM;HFC;ES_EM_2C7_HFC;;kt;NA;NA;NA;NA;NA;NA;NA;NA;NA;NA;NA;NA;NA;NA;NA;NA;NA;NA;NA;NA;NA;NA;NA;NA;NA;NA;NA;NA;NA;NA;NA;NA
ES;2E3;EM;HFC;ES_EM_2E3_HFC;;kt;;;;;;;;;;;;;;;;;;;;NA;NA;NA;NA;;;;;;;;;
ES;2F1;EM;HFC;ES_EM_2F1_HFC;;kt;;;;;;;446,40062808754;912,59186373025;1659,836815742735;2498,84159893731;3582,285216268489;4695,92935449937;5726,458563818992;6858,9462177160585;8058,551000154651;9505,910453755998;11809,712396335213;13969,350688265531;14990,82803839819;13928,63859811982;13956,357363713203;13942,447573241468;14060,56472351353;14147,582833554627;14098,510757022206;7724,831958087743;7479,235562182786;5610,748946074482;3936,958555528356;3838,568784692596;3088,267029443626;3203,84339241568
ES;2F2;EM;HFC;ES_EM_2F2_HFC;;kt;;;;;;;;;;;;;;38,9083239569;452,37434759895;444,35273679488404;413,69348164446;371,060483767944;287,921535863078;177,389217569316;166,915800253012;141,569290384394;135,39367370451;76,983981682232;77,8504363391;85,204569058252;75,811776327546;64,719046429636;50,852993595342;44,83946081009;42,249564999372;40,101952685156
ES;2F3;EM;HFC;ES_EM_2F3_HFC;;kt;;;;;;0,84280850805;1,605253937;4,78219085925;19,09840047185;43,03556852142;57,4169943865;72,46831893863;85,10482624798;103,49629707868;116,18041579933;122,24498176445;124,46431629437;134,0865658501;142,2660373751;148,94922305218;154,15508304715;159,07872404998;162,96365588118;163,52100936571;154,0984782781;145,93682920473;130,45179846325;118,37495189357;107,69519537299;97,69195106935;89,13680945691;81,22096722587
ES;2F4;EM;HFC;ES_EM_2F4_HFC;;kt;;;;;;;;2,702579776;390,3313641864;434,7685464317;444,4252608328;400,454047136;338,9505582918;518,7794044017;391,7811734226;346,01607976;343,0282187332;352,959918445362;361,806770261514;329,876659105086;310,627520018086;311,50131824198996;289,407548363072;277,903816439376;278,5277004363;225,909465554848;268,8886461384;288,363120999176;299,6190434448;296,3304937558;277,851564834714;287,576265208286
ES;2H;EM;HFC;ES_EM_2H_HFC;;kt;NA;NA;NA;NA;NA;NA;NA;NA;NA;NA;NA;NA;NA;NA;NA;NA;NA;NA;NA;NA;NA;NA;NA;NA;NA;NA;NA;NA;NA;NA;NA;NA
ES;6_OTHER;EM;HFC;ES_EM_6_OTHER_HFC;;kt;NA;NA;NA;NA;NA;NA;NA;NA;NA;NA;NA;NA;NA;NA;NA;NA;NA;NA;NA;NA;NA;NA;NA;NA;NA;NA;NA;NA;NA;NA;NA;NA
ES;2B10;EM;PFC;ES_EM_2B10_PFC;;kt;NA;NA;NA;NA;NA;NA;NA;NA;NA;NA;NA;NA;NA;NA;NA;NA;NA;NA;NA;NA;NA;NA;NA;NA;NA;NA;NA;NA;NA;NA;NA;NA
ES;2C3;EM;PFC;ES_EM_2C3_PFC;;kt;1046,2724450327332;976,8804636548026;922,2660709944452;957,8444906022286;933,2306809222923;948,2286618219761;899,7914436669159;920,9150663404552;846,8920268653574;768,8366934949622;444,33036699306894;244,94484209567634;251,65591679598558;240,68879926742227;232,730430097868;188,7245858755572;175,8413425175862;166,36717248983865;160,60045569341608;107,3855106006576;93,80465502122503;80,23820992031608;48,31359779824335;59,85781195106515;55,73093914116944;77,37950480733224;76,439929473648;107,615879229636;111,206125307685;36,710428124835;22,127093008488;28,358012685978
ES;2C7;EM;PFC;ES_EM_2C7_PFC;;kt;NA;NA;NA;NA;NA;NA;NA;NA;NA;NA;NA;NA;NA;NA;NA;NA;NA;NA;NA;NA;NA;NA;NA;NA;NA;NA;NA;NA;NA;NA;NA;NA
ES;2E3;EM;PFC;ES_EM_2E3_PFC;;kt;;;;;;;;;;;;;;;;;;;;NA;NA;NA;NA;;;;;;;;;
ES;2F1;EM;PFC;ES_EM_2F1_PFC;;kt;;;;;;;0,0061648253;0,0126226831;0,0236830455;0,0361135909;0,0520334632;0,0684446224;0,0837140265;0,1003072134;0,1182269972;0,2791832902;0,4595143739;0,6292069813;0,7116343965;0,6251395221;0,6295862775;0,6049919179;0,5337657145;0,5007506655;1,2818748641;6,8872114903;5,6823064439;8,2658168819;6,9419248032;12,1043556599;7,3054810111;23,009539951
ES;2F3;EM;PFC;ES_EM_2F3_PFC;;kt;;;;;;0,065963908;0,2529999632;0,2548399908;0,2268719816;0,2503319632;0,222363954;0,200192;0,180135954;0,1621040552;0,1459119816;0,1312840092;0,1182199816;0,1063519908;0,0957720184;0,0862039448;0,0775560276;0,0698279724;0,0628359908;0,0564879908;0,0508760368;0,045816;0,0412159724;0,037076;0,0333818964;0,0300435292;0,027039444;0,0243352512
ES;2F4;EM;PFC;ES_EM_2F4_PFC;;kt;;;;;;;;;NA;NA;NA;NA;NA;NA;NA;NA;NA;NA;NA;NA;NA;NA;NA;NA;NA;;;;;;;
ES;2G2;EM;PFC;ES_EM_2G2_PFC;;kt;;;;;;;;;;;;;;;;;;;;;;NA;NA;NA;NA;;;;;;;
ES;2H;EM;PFC;ES_EM_2H_PFC;;kt;NA;NA;NA;NA;NA;NA;NA;NA;NA;NA;NA;NA;NA;NA;NA;NA;NA;NA;NA;NA;NA;NA;NA;NA;NA;NA;NA;NA;NA;NA;NA;NA
ES;6_OTHER;EM;PFC;ES_EM_6_OTHER_PFC;;kt;NA;NA;NA;NA;NA;NA;NA;NA;NA;NA;NA;NA;NA;NA;NA;NA;NA;NA;NA;NA;NA;NA;NA;NA;NA;NA;NA;NA;NA;NA;NA;NA
ES;2B10;EM;FGAS_IPCC;ES_EM_2B10_FGAS_IPCC;;kt;NA;NA;NA;NA;NA;NA;NA;NA;NA;NA;NA;NA;NA;NA;NA;NA;NA;NA;NA;NA;NA;NA;NA;NA;NA;NA;NA;NA;NA;NA;NA;NA
ES;2C7;EM;FGAS_IPCC;ES_EM_2C7_FGAS_IPCC;;kt;NA;NA;NA;NA;NA;NA;NA;NA;NA;NA;NA;NA;NA;NA;NA;NA;NA;NA;NA;NA;NA;NA;NA;NA;NA;NA;NA;NA;NA;NA;NA;NA
ES;2E3;EM;FGAS_IPCC;ES_EM_2E3_FGAS_IPCC;;kt;;;;;;;;;;;;;;;;;;;;NA;NA;NA;NA;;;;;;;;;
ES;2F1;EM;FGAS_IPCC;ES_EM_2F1_FGAS_IPCC;;kt;;;;;;;;;;;;;;;;;;;;;;120,47885497984198;472,44807520616104;634,702737618496;495,36961971661896;468,43067963819004;541,020365030771;832,2171477018071;1533,492011526281;1363,766558886946;1355,865239909617;1350,56289851032
ES;2F4;EM;FGAS_IPCC;ES_EM_2F4_FGAS_IPCC;;kt;;;;;;;;;NA;NA;NA;NA;NA;NA;NA;NA;NA;NA;NA;NA;NA;NA;NA;NA;NA;;;;;;;
ES;2H;EM;FGAS_IPCC;ES_EM_2H_FGAS_IPCC;;kt;NA;NA;NA;NA;NA;NA;NA;NA;NA;NA;NA;NA;NA;NA;NA;NA;NA;NA;NA;NA;NA;NA;NA;NA;NA;NA;NA;NA;NA;NA;NA;NA
ES;6_OTHER;EM;FGAS_IPCC;ES_EM_6_OTHER_FGAS_IPCC;;kt;NA;NA;NA;NA;NA;NA;NA;NA;NA;NA;NA;NA;NA;NA;NA;NA;NA;NA;NA;NA;NA;NA;NA;NA;NA;NA;NA;NA;NA;NA;NA;NA
ES;2B10;EM;SF6;ES_EM_2B10_SF6;;kt;NA;NA;NA;NA;NA;NA;NA;NA;NA;NA;NA;NA;NA;NA;NA;NA;NA;NA;NA;NA;NA;NA;NA;NA;NA;NA;NA;NA;NA;NA;NA;NA
ES;2C7;EM;SF6;ES_EM_2C7_SF6;;kt;NA;NA;NA;NA;NA;NA;NA;NA;NA;NA;NA;NA;NA;NA;NA;NA;NA;NA;NA;NA;NA;NA;NA;NA;NA;NA;NA;NA;NA;NA;NA;NA
ES;2E3;EM;SF6;ES_EM_2E3_SF6;;kt;;;;;;;;;;;;;;;;;;;;NA;NA;NA;NA;;;;;;;;;
ES;2F4;EM;SF6;ES_EM_2F4_SF6;;kt;;;;;;;;;NA;NA;NA;NA;NA;NA;NA;NA;NA;NA;NA;NA;NA;NA;NA;NA;NA;;;;;;;
ES;2G1;EM;SF6;ES_EM_2G1_SF6;;kt;0,002806560001;0,003016084;0,003156031996;0,003332740003;0,003665456005;0,004364944003;0,004823381002;0,006622193997;0,006855211999;0,007284006;0,008109336002;0,007117417987;0,007855241003;0,007626786004;0,008721444003;0,009234209;0,010077380003;0,010337507002;0,010677249002;0,010047779002;0,010179785994;0,010411006002;0,009568652007;0,009294434013;0,009111740002;0,009605106;0,009958494998;0,009764235;0,009822301002;0,009864242013;0,009977167996;0,010176743993
ES;2G2;EM;SF6;ES_EM_2G2_SF6;;kt;;;;;;1,28e-05;1,2800003e-05;1,44e-05;2,4792001e-05;2,6392001e-05;6,3128e-05;3,9397999e-05;5,7568e-05;0,000107072001;4,0997998e-05;9,0502e-05;9,8502e-05;0,000119871999;6,8182002e-05;9,5350003e-05;0,000122502001;7,8173004e-05;8,0562502e-05;8,5300002e-05;0,000103244712;0,000113551228;0,000122872402;0,000127303223;0,000136948917;0,000142771671;0,000144336999;4,4584e-05
ES;2H;EM;SF6;ES_EM_2H_SF6;;kt;NA;NA;NA;NA;NA;NA;NA;NA;NA;NA;NA;NA;NA;NA;NA;NA;NA;NA;NA;NA;NA;NA;NA;NA;NA;NA;NA;NA;NA;NA;NA;NA
ES;6_OTHER;EM;SF6;ES_EM_6_OTHER_SF6;;kt;NA;NA;NA;NA;NA;NA;NA;NA;NA;NA;NA;NA;NA;NA;NA;NA;NA;NA;NA;NA;NA;NA;NA;NA;NA;NA;NA;NA;NA;NA;NA;NA
ES;2B10;EM;NF3;ES_EM_2B10_NF3;;kt;NA;NA;NA;NA;NA;NA;NA;NA;NA;NA;NA;NA;NA;NA;NA;NA;NA;NA;NA;NA;NA;NA;NA;NA;NA;NA;NA;NA;NA;NA;NA;NA
ES;2C7;EM;NF3;ES_EM_2C7_NF3;;kt;NA;NA;NA;NA;NA;NA;NA;NA;NA;NA;NA;NA;NA;NA;NA;NA;NA;NA;NA;NA;NA;NA;NA;NA;NA;NA;NA;NA;NA;NA;NA;NA
ES;2E3;EM;NF3;ES_EM_2E3_NF3;;kt;;;;;;;;;;;;;;;;;;;;NE;NE;NE;NE;;;;;;;;;
ES;2F4;EM;NF3;ES_EM_2F4_NF3;;kt;;;;;;;;;NA;NA;NA;NA;NA;NA;NA;NA;NA;NA;NA;NA;NA;NA;NA;NA;NA;;;;;;;
ES;2H;EM;NF3;ES_EM_2H_NF3;;kt;NA;NA;NA;NA;NA;NA;NA;NA;NA;NA;NA;NA;NA;NA;NA;NA;NA;NA;NA;NA;NA;NA;NA;NA;NA;NA;NA;NA;NA;NA;NA;NA
ES;6_OTHER;EM;NF3;ES_EM_6_OTHER_NF3;;kt;NA;NA;NA;NA;NA;NA;NA;NA;NA;NA;NA;NA;NA;NA;NA;NA;NA;NA;NA;NA;NA;NA;NA;NA;NA;NA;NA;NA;NA;NA;NA;NA
