{
    "version": {
      "metadata_ver": "1.27.4",
      "country": "DEU",
      "metadata_type": "CRT"
    },
    "country_specific_data": {
      "variables": [],
      "nodes": [
        {"uid": "EDEB45B3-3045-48F4-A427-FAC4BC003C2D"}
      ],
      "grids": [],
      "drop_downs": [],
      "line_description": [],
      "dimension_instances": []    
    },
    "data": {
      "values": []
    }
  }