[
  {
    "id": "aa31fd0a7dd7d443",
    "type": "catch",
    "z": "23cf5ead1691723f",
    "name": "Catch All Errors",
    "scope": null,
    "uncaught": false,
    "x": 500,
    "y": 60,
    "wires": [
      [
        "9b196534033e4b9e"
      ]
    ]
  },
  {
    "id": "6f06f8372829daea",
    "type": "debug",
    "z": "23cf5ead1691723f",
    "name": "Debug Errors",
    "active": true,
    "tosidebar": true,
    "console": false,
    "tostatus": false,
    "complete": "true",
    "targetType": "full",
    "statusVal": "",
    "statusType": "auto",
    "x": 850,
    "y": 60,
    "wires": []
  },
  {
    "id": "9b196534033e4b9e",
    "type": "function",
    "z": "23cf5ead1691723f",
    "name": "Handle error",
    "func": "try {\n  const options = {\n    transports: [\n      new winstonLoki({\n        host: 'https://loki.swcode.io',\n        basicAuth: '',\n        labels: {\n          app: 'SoestApp Datenplattform',\n          version: '1.0.0'\n        },\n        replaceTimestamp: true,\n        onConnectionError: (err) => console.error(err)\n      }),\n    ],\n    onConnectionError: (err) => {\n      console.error(err);\n    },\n    batching: false,\n    gracefulShutdown: false\n  };\n  const logger = winston.createLogger(options);\n  logger.error(JSON.stringify(msg));\n} catch(err) {\n  node.warn('Logging via Winston failed. Please check');\n  node.warn(err);\n}\n\nreturn msg;",
    "outputs": 1,
    "timeout": 0,
    "noerr": 0,
    "initialize": "",
    "finalize": "",
    "libs": [
      {
        "var": "winston",
        "module": "winston"
      },
      {
        "var": "winstonLoki",
        "module": "winston-loki"
      }
    ],
    "x": 690,
    "y": 60,
    "wires": [
      [
        "6f06f8372829daea"
      ]
    ]
  }
]