{
  "actionType": "append",
  "entities": [
    {
      "id": "1",
      "type": "PointOfInterest",
      "additionalInfoURL": "https://www.soest.de/03leben_wohnen/jugendundsoziales/kinder_und_jugendarbeit/117040100000090807.php?ajaxsearch\\u003D1",
      "address": {
        "streetAddress": "Märkische Straße"
      },
      "category": [
        "Spielplatz"
      ],
      "contactPoint": {
        "telephone": "02921/1032335",
        "email": "a.spiekermann@soest.de",
        "contactPerson": "Anke Spiekermann"
      },
      "dateModified": "2019-01-01T00:00:00.000+01:00",
      "location": {
        "type": "Point",
        "coordinates": [
          8.088875517,
          51.568723228
        ]
      },
      "name": "Märkische Straße",
      "source": "https://www.soest.de/03leben_wohnen/jugendundsoziales/kinder_und_jugendarbeit/117040100000090807.php?ajaxsearch\\u003D1"
    },
    {
      "id": "218",
      "type": "PointOfInterest",
      "additionalInfoURL": "http://www.bezreg-arnsberg.nrw.de/themen/s/standorte/soest/st53.php",
      "address": {
        "streetAddress": "Stiftstraße 53"
      },
      "category": [
        "Öffentliche Verwaltung"
      ],
      "contactPoint": {
        "telephone": "02921/108-0",
        "email": "poststelle@bezreg-arnsberg.nrw.de",
        "contactPerson": "Robert Zerhau"
      },
      "dateModified": "2016-06-01T00:00:00.000+02:00",
      "location": {
        "type": "Point",
        "coordinates": [
          8.107398943,
          51.576927931
        ]
      },
      "name": "Bezirksregierung Arnsberg - Amt für Agrarordnung",
      "source": "http://www.bezreg-arnsberg.nrw.de/themen/s/standorte/soest/st53.php"
    },
    {
      "id": "331",
      "type": "PointOfInterest",
      "additionalInfoURL": "https://www.wph-soest.de/",
      "address": {
        "streetAddress": "Oestinghauser Straße 18"
      },
      "category": [
        "Behinderteneinrichtung"
      ],
      "contactPoint": {
        "telephone": "02921 9699 - 0",
        "email": "wph-soest@perthes-stiftung.de",
        "contactPerson": "Christian Stratmann"
      },
      "dateModified": "2020-08-01T00:00:00.000+02:00",
      "location": {
        "type": "Point",
        "coordinates": [
          8.112535639,
          51.581390416
        ]
      },
      "name": "Walpurgis-Haus",
      "source": "https://www.wph-soest.de/"
    }
  ]
}