<svg height="48" viewBox="0 -960 960 960" width="48" xmlns="http://www.w3.org/2000/svg">
  <path
    d="M321-160q-24 0-42-18t-18-42v-100h124v-127q-38 3-76-10.5T241-500v-58h-50L60-689q36-34 86-55.5T248-766q30 0 68.5 9.5T385-726v-74h455v535q0 44-30.5 74.5T735-160H321Zm124-160h245v55q0 20 12.5 32.5T735-220q20 0 32.5-12.5T780-265v-475H445v57l241 241v43h-43L517-525l-17 20q-13 15-26 23t-29 15v147ZM218-618h83v89q17 11 33.5 16.5T368-507q25 0 51-13.5t38-27.5l17-20-69-69q-32-32-72-50.5T248-706q-27 0-49 6.5T154-682l64 64Zm412 358H321v40h323q-6-6-10-16.5t-4-23.5Zm-309 40v-40 40Z" />
</svg>
