[
    {
        "id": "36c6598ad02a8ffd",
        "type": "subflow",
        "name": "toBerlinTime",
        "info": "",
        "category": "",
        "in": [
            {
                "x": 60,
                "y": 80,
                "wires": [
                    {
                        "id": "260ddeb516e9a234"
                    }
                ]
            }
        ],
        "out": [
            {
                "x": 360,
                "y": 80,
                "wires": [
                    {
                        "id": "260ddeb516e9a234",
                        "port": 0
                    }
                ]
            }
        ],
        "env": [],
        "meta": {},
        "color": "#DDAA99"
    },
    {
        "id": "260ddeb516e9a234",
        "type": "function",
        "z": "36c6598ad02a8ffd",
        "name": "toISODate",
        "func": "const {DateTime } = luxon;\n\nfunction convertToBerlinTime(dateInput) {\n    if (!dateInput) return null;\n    const parsedDate = DateTime.fromISO(dateInput, { zone: 'Europe/Berlin' });\n    if (!parsedDate.isValid) throw new Error(`Invalid date input: ${dateInput}`);\n    return parsedDate.toISO();\n}\n\nglobal.set('toBerlinTime', convertToBerlinTime);\n\nreturn msg;\n",
        "outputs": 1,
        "timeout": 0,
        "noerr": 0,
        "initialize": "",
        "finalize": "",
        "libs": [
            {
                "var": "luxon",
                "module": "luxon"
            }
        ],
        "x": 210,
        "y": 80,
        "wires": [
            []
        ]
    }
]