{
  "name": "feature-waste",
  "$schema": "../../node_modules/nx/schemas/project-schema.json",
  "sourceRoot": "libs/feature-waste/src",
  "prefix": "lib",
  "projectType": "library",
  "tags": [],
  "targets": {
    "build": {
      "executor": "@nx/angular:package",
      "outputs": ["{workspaceRoot}/dist/{projectRoot}"],
      "options": {
        "project": "libs/feature-waste/ng-package.json"
      },
      "configurations": {
        "production": {
          "tsConfig": "libs/feature-waste/tsconfig.lib.prod.json"
        },
        "development": {
          "tsConfig": "libs/feature-waste/tsconfig.lib.json"
        }
      },
      "defaultConfiguration": "production"
    },
    "test": {
      "executor": "@nx/jest:jest",
      "outputs": ["{workspaceRoot}/coverage/{projectRoot}"],
      "options": {
        "jestConfig": "libs/feature-waste/jest.config.ts"
      }
    },
    "lint": {
      "executor": "@nx/eslint:lint"
    }
  }
}
