{
  "images": [
    {
      "filename": "splash screen icon.png",
      "idiom": "universal"
    },
    {
      "appearances": [
        {
          "appearance": "luminosity",
          "value": "dark"
        }
      ],
      "idiom": "universal"
    }
  ],
  "info": {
    "author": "xcode",
    "version": 1
  }
}
