[
    {
        "id": "6a16a7a2a721f7cf",
        "type": "subflow",
        "name": "HTTP Error catching",
        "info": "",
        "category": "",
        "in": [
            {
                "x": 40,
                "y": 80,
                "wires": [
                    {
                        "id": "87f56a30a2dcf1a6"
                    }
                ]
            }
        ],
        "out": [
            {
                "x": 500,
                "y": 80,
                "wires": [
                    {
                        "id": "87f56a30a2dcf1a6",
                        "port": 0
                    }
                ]
            }
        ],
        "env": [],
        "meta": {},
        "color": "#DDAA99"
    },
    {
        "id": "87f56a30a2dcf1a6",
        "type": "function",
        "z": "6a16a7a2a721f7cf",
        "name": "Catch unsuccessful responses",
        "func": "let response = {\n    statusCode: msg.statusCode,\n    body: msg.payload.body,\n};\n\nif (response.statusCode < 200 || response.statusCode >= 300) {\n    node.error(\"Unsuccessful response: \", msg);\n    throw new Error(JSON.stringify(response))\n}\n\nmsg.payload = response\n\nreturn msg;",
        "outputs": 1,
        "timeout": 0,
        "noerr": 0,
        "initialize": "",
        "finalize": "",
        "libs": [],
        "x": 270,
        "y": 80,
        "wires": [
            []
        ]
    },
    {
        "id": "c3db24e71d923aa8",
        "type": "catch",
        "z": "6a16a7a2a721f7cf",
        "name": "Catch All Errors",
        "scope": null,
        "uncaught": false,
        "x": 380,
        "y": 20,
        "wires": [
            [
                "c272e358e46a0354"
            ]
        ]
    },
    {
        "id": "c272e358e46a0354",
        "type": "function",
        "z": "6a16a7a2a721f7cf",
        "name": "Handle error",
        "func": "let response = {\n    statusCode: msg.statusCode,\n    body: msg.payload.body,\n};\n\ntry {\n  const options = {\n    transports: [\n      new winstonLoki({\n        host: env.get(\"LOKI_HOST\"),\n        basicAuth: env.get(\"LOKI_AUTH_TOKEN\"),\n        labels: {\n          app: 'SoestApp Datenplattform',\n          version: '1.0.0'\n        },\n        replaceTimestamp: true,\n        onConnectionError: (err) => console.error(err)\n      }),\n    ],\n    onConnectionError: (err) => {\n      console.error(err);\n    },\n    batching: false,\n    gracefulShutdown: false\n  };\n  const logger = winston.createLogger(options);\n  logger.error(JSON.stringify(response));\n} catch(err) {\n  node.warn('Logging via Winston failed. Please check');\n  node.warn(err);\n}\n\nreturn msg;",
        "outputs": 1,
        "timeout": 0,
        "noerr": 0,
        "initialize": "",
        "finalize": "",
        "libs": [
            {
                "var": "winston",
                "module": "winston"
            },
            {
                "var": "winstonLoki",
                "module": "winston-loki"
            }
        ],
        "x": 570,
        "y": 20,
        "wires": [
            []
        ]
    }
]