Statistik_Code;Statistik_Label;Zeit_Code;Zeit_Label;Zeit;1_Merkmal_Code;1_Merkmal_Label;1_Auspraegung_Code;1_Auspraegung_Label;2_Merkmal_Code;2_Merkmal_Label;2_Auspraegung_Code;2_Auspraegung_Label;BEVSTD__Bevoelkerungsstand__Anzahl
12411;Fortschreibung des Bevölkerungsstandes;STAG;Stichtag;31.12.2023;KREISE;Kreise und kreisfreie Städte;05515;      Münster, kreisfreie Stadt;GES;Geschlecht;;Insgesamt;322904
12411;Fortschreibung des Bevölkerungsstandes;STAG;Stichtag;31.12.2023;KREISE;Kreise und kreisfreie Städte;05515;      Münster, kreisfreie Stadt;GES;Geschlecht;GESM;männlich;155052
12411;Fortschreibung des Bevölkerungsstandes;STAG;Stichtag;31.12.2023;KREISE;Kreise und kreisfreie Städte;05515;      Münster, kreisfreie Stadt;GES;Geschlecht;GESW;weiblich;167852
12411;Fortschreibung des Bevölkerungsstandes;STAG;Stichtag;31.12.2022;KREISE;Kreise und kreisfreie Städte;05515;      Münster, kreisfreie Stadt;GES;Geschlecht;;Insgesamt;320946
12411;Fortschreibung des Bevölkerungsstandes;STAG;Stichtag;31.12.2022;KREISE;Kreise und kreisfreie Städte;05515;      Münster, kreisfreie Stadt;GES;Geschlecht;GESM;männlich;153935
12411;Fortschreibung des Bevölkerungsstandes;STAG;Stichtag;31.12.2022;KREISE;Kreise und kreisfreie Städte;05515;      Münster, kreisfreie Stadt;GES;Geschlecht;GESW;weiblich;167011
12411;Fortschreibung des Bevölkerungsstandes;STAG;Stichtag;31.12.2021;KREISE;Kreise und kreisfreie Städte;05515;      Münster, kreisfreie Stadt;GES;Geschlecht;;Insgesamt;317713
12411;Fortschreibung des Bevölkerungsstandes;STAG;Stichtag;31.12.2021;KREISE;Kreise und kreisfreie Städte;05515;      Münster, kreisfreie Stadt;GES;Geschlecht;GESM;männlich;152515
12411;Fortschreibung des Bevölkerungsstandes;STAG;Stichtag;31.12.2021;KREISE;Kreise und kreisfreie Städte;05515;      Münster, kreisfreie Stadt;GES;Geschlecht;GESW;weiblich;165198
12411;Fortschreibung des Bevölkerungsstandes;STAG;Stichtag;31.12.2020;KREISE;Kreise und kreisfreie Städte;05515;      Münster, kreisfreie Stadt;GES;Geschlecht;;Insgesamt;316403
12411;Fortschreibung des Bevölkerungsstandes;STAG;Stichtag;31.12.2020;KREISE;Kreise und kreisfreie Städte;05515;      Münster, kreisfreie Stadt;GES;Geschlecht;GESM;männlich;152025
12411;Fortschreibung des Bevölkerungsstandes;STAG;Stichtag;31.12.2020;KREISE;Kreise und kreisfreie Städte;05515;      Münster, kreisfreie Stadt;GES;Geschlecht;GESW;weiblich;164378
12411;Fortschreibung des Bevölkerungsstandes;STAG;Stichtag;31.12.2019;KREISE;Kreise und kreisfreie Städte;05515;      Münster, kreisfreie Stadt;GES;Geschlecht;;Insgesamt;315293
12411;Fortschreibung des Bevölkerungsstandes;STAG;Stichtag;31.12.2019;KREISE;Kreise und kreisfreie Städte;05515;      Münster, kreisfreie Stadt;GES;Geschlecht;GESM;männlich;151230
12411;Fortschreibung des Bevölkerungsstandes;STAG;Stichtag;31.12.2019;KREISE;Kreise und kreisfreie Städte;05515;      Münster, kreisfreie Stadt;GES;Geschlecht;GESW;weiblich;164063
12411;Fortschreibung des Bevölkerungsstandes;STAG;Stichtag;31.12.2018;KREISE;Kreise und kreisfreie Städte;05515;      Münster, kreisfreie Stadt;GES;Geschlecht;;Insgesamt;314319
12411;Fortschreibung des Bevölkerungsstandes;STAG;Stichtag;31.12.2018;KREISE;Kreise und kreisfreie Städte;05515;      Münster, kreisfreie Stadt;GES;Geschlecht;GESM;männlich;150836
12411;Fortschreibung des Bevölkerungsstandes;STAG;Stichtag;31.12.2018;KREISE;Kreise und kreisfreie Städte;05515;      Münster, kreisfreie Stadt;GES;Geschlecht;GESW;weiblich;163483
12411;Fortschreibung des Bevölkerungsstandes;STAG;Stichtag;31.12.2017;KREISE;Kreise und kreisfreie Städte;05515;      Münster, kreisfreie Stadt;GES;Geschlecht;;Insgesamt;313559
12411;Fortschreibung des Bevölkerungsstandes;STAG;Stichtag;31.12.2017;KREISE;Kreise und kreisfreie Städte;05515;      Münster, kreisfreie Stadt;GES;Geschlecht;GESM;männlich;150360
12411;Fortschreibung des Bevölkerungsstandes;STAG;Stichtag;31.12.2017;KREISE;Kreise und kreisfreie Städte;05515;      Münster, kreisfreie Stadt;GES;Geschlecht;GESW;weiblich;163199
