{
  "policies": [
    {
      "id": "91928ae7-2a89-491b-94d2-17b42329bde4",
      "name": "BSI: Network Policies missing",
      "description": "The Policy checks, if the pods are selected by an egress and an ingress network policy.",
      "rationale": "APP.4.4.A4, APP.4.4.A7, SYS.1.6.A5 It should be ensured, that workloads are separatet on the network layer.",
      "remediation": "Ensure each deployment has Network Policies defined for egress and ingress",
      "disabled": false,
      "categories": [
        "Security Best Practices",
        "BSI"
      ],
      "lifecycleStages": [
        "DEPLOY"
      ],
      "eventSource": "NOT_APPLICABLE",
      "exclusions": [
        {
          "name": "",
          "deployment": {
            "name": "",
            "scope": {
              "cluster": "",
              "namespace": "^kube.+|^openshift.+",
              "label": null
            }
          },
          "image": null,
          "expiration": null
        }
      ],
      "scope": [],
      "severity": "MEDIUM_SEVERITY",
      "enforcementActions": [],
      "notifiers": [],
      "lastUpdated": "2023-01-03T10:00:15.762506048Z",
      "SORTName": "",
      "SORTLifecycleStage": "",
      "SORTEnforcement": false,
      "policyVersion": "1.1",
      "policySections": [
        {
          "sectionName": "Ingress Network Policy missing",
          "policyGroups": [
            {
              "fieldName": "Has Ingress Network Policy",
              "booleanOperator": "OR",
              "negate": false,
              "values": [
                {
                  "value": "false"
                }
              ]
            }
          ]
        },
        {
          "sectionName": "Egress Network Policy missing",
          "policyGroups": [
            {
              "fieldName": "Has Egress Network Policy",
              "booleanOperator": "OR",
              "negate": false,
              "values": [
                {
                  "value": "false"
                }
              ]
            }
          ]
        }
      ],
      "mitreAttackVectors": [
        {
          "tactic": "TA0007",
          "techniques": [
            "T1046"
          ]
        }
      ],
      "criteriaLocked": false,
      "mitreVectorsLocked": false,
      "isDefault": false
    }
  ]
}