{
  "policies": [
    {
      "id": "876e1baf-60d7-431a-a1ba-433f95a22c6d",
      "name": "BSI: Environment Variable Contains Secret",
      "description": "Alert on deployments with environment variables that contain 'SECRET'",
      "rationale": "SYS.1.6.A8 Using secrets in environment variables may allow inspection into your secrets from the host or even through the orchestrator UI.",
      "remediation": "Migrate your secrets from environment variables to orchestrator secrets or your security team's secret management solution.",
      "categories": [
        "Security Best Practices",
        "BSI"
      ],
      "lifecycleStages": [
        "DEPLOY"
      ],
      "exclusions": [
        {
          "name": "Don't alert on deployment noobaa-core in namespace openshift-storage",
          "deployment": {
            "name": "noobaa-core",
            "scope": {
              "namespace": "openshift-storage"
            }
          }
        },
        {
          "name": "Don't alert on deployment noobaa-endpoint in namespace openshift-storage",
          "deployment": {
            "name": "noobaa-endpoint",
            "scope": {
              "namespace": "openshift-storage"
            }
          }
        },
        {
          "name": "Don't alert on deployment ocs-operator in namespace openshift-storage",
          "deployment": {
            "name": "ocs-operator",
            "scope": {
              "namespace": "openshift-storage"
            }
          }
        },
        {
          "name": "Don't alert on deployment ocm-agent in openshift-ocm-agent-operator namespace",
          "deployment": {
            "name": "ocm-agent",
            "scope": {
              "namespace": "openshift-ocm-agent-operator"
            }
          }
        },
        {
          "name": "Don't alert on router-default in openshift-ingress namespace",
          "deployment": {
            "name": "router-default",
            "scope": {
              "namespace": "openshift-ingress"
            }
          }
        },
        {
          "name": "Don't alert on image-registry in openshift-image-registry namespace",
          "deployment": {
            "name": "image-registry",
            "scope": {
              "namespace": "openshift-image-registry"
            }
          }
        },
        {
          "name": "Don't alert on thanos-ruler-user-workload in openshift-user-workload-monitoring namespace",
          "deployment": {
            "name": "thanos-ruler-user-workload",
            "scope": {
              "namespace": "openshift-user-workload-monitoring"
            }
          }
        },
        {
          "name": "Don't alert on klusterlet-addon-controller-v2 in namespace open-cluster-management",
          "deployment": {
            "name": "klusterlet-addon-controller-v2",
            "scope": {
              "namespace": "open-cluster-management"
            }
          }
        },
        {
          "name": "Don't alert on managedcluster-import-controller-v2 in namespace multicluster-engine",
          "deployment": {
            "name": "managedcluster-import-controller-v2",
            "scope": {
              "namespace": "multicluster-engine"
            }
          }
        }
      ],
      "severity": "HIGH_SEVERITY",
      "policyVersion": "1.1",
      "policySections": [
        {
          "policyGroups": [
            {
              "fieldName": "Environment Variable",
              "values": [
                {
                  "value": "RAW=.*SECRET.*|.*PASSWORD.*|.*PASSWORT.*|.*KEY.*|.*KENNWORT.*|.*TOKEN.*="
                }
              ]
            }
          ]
        }
      ],
      "criteriaLocked": true,
      "mitreVectorsLocked": true,
      "isDefault": false,
      "disabled": true
    }
  ]
}