{
  "policies": [
    {
      "id": "db5ac041-a0a0-40d7-b1cd-71d0dc513833",
      "name": "BSI: Require Resource Limits",
      "description": "the policy checks, if the deployment has requests and limits specified",
      "rationale": "SYS.1.6.A15 If a container does not have resource requests or limits specified then the host may become over-provisioned.",
      "remediation": "Add ",
      "categories": [
        "DevOps Best Practices",
        "Docker CIS",
        "BSI"
      ],
      "lifecycleStages": [
        "DEPLOY"
      ],
      "exclusions": [
        {
          "name": "Don't alert on system namespaces",
          "deployment": {
            "scope": {
              "namespace": "^kube.*|^openshift.*|^redhat.*|^istio-system$"
            }
          }
        },
        {
          "name": "Don't alert on management-infra namespace",
          "deployment": {
            "scope": {
              "namespace": "management-infra"
            }
          }
        },
        {
          "name": "Don't alert on deployment application-manager in namespace open-cluster-management-agent-addon",
          "deployment": {
            "name": "application-manager",
            "scope": {
              "namespace": "open-cluster-management-agent-addon"
            }
          }
        },
        {
          "name": "Don't alert on deployment cert-policy-controller in namespace open-cluster-management-agent-addon",
          "deployment": {
            "name": "cert-policy-controller",
            "scope": {
              "namespace": "open-cluster-management-agent-addon"
            }
          }
        },
        {
          "name": "Don't alert on deployment cluster-manager in namespace multicluster-engine",
          "deployment": {
            "name": "cluster-manager",
            "scope": {
              "namespace": "multicluster-engine"
            }
          }
        },
        {
          "name": "Don't alert on deployment cluster-manager-placement-controller in namespace open-cluster-management-hub",
          "deployment": {
            "name": "cluster-manager-placement-controller",
            "scope": {
              "namespace": "open-cluster-management-hub"
            }
          }
        },
        {
          "name": "Don't alert on deployment cluster-manager-registration-controller in namespace open-cluster-management-hub",
          "deployment": {
            "name": "cluster-manager-registration-controller",
            "scope": {
              "namespace": "open-cluster-management-hub"
            }
          }
        },
        {
          "name": "Don't alert on deployment cluster-manager-registration-webhook in namespace open-cluster-management-hub",
          "deployment": {
            "name": "cluster-manager-registration-webhook",
            "scope": {
              "namespace": "open-cluster-management-hub"
            }
          }
        },
        {
          "name": "Don't alert on deployment cluster-manager-work-webhook in namespace open-cluster-management-hub",
          "deployment": {
            "name": "cluster-manager-work-webhook",
            "scope": {
              "namespace": "open-cluster-management-hub"
            }
          }
        },
        {
          "name": "Don't alert on deployment cluster-proxy in namespace multicluster-engine",
          "deployment": {
            "name": "cluster-proxy",
            "scope": {
              "namespace": "multicluster-engine"
            }
          }
        },
        {
          "name": "Don't alert on deployment cluster-proxy-addon-manager in namespace multicluster-engine",
          "deployment": {
            "name": "cluster-proxy-addon-manager",
            "scope": {
              "namespace": "multicluster-engine"
            }
          }
        },
        {
          "name": "Don't alert on deployment cluster-proxy-addon-user in namespace multicluster-engine",
          "deployment": {
            "name": "cluster-proxy-addon-user",
            "scope": {
              "namespace": "multicluster-engine"
            }
          }
        },
        {
          "name": "Don't alert on deployment cluster-proxy-proxy-agent in namespace open-cluster-management-agent-addon",
          "deployment": {
            "name": "cluster-proxy-proxy-agent",
            "scope": {
              "namespace": "open-cluster-management-agent-addon"
            }
          }
        },
        {
          "name": "Don't alert on deployment cluster-proxy-service-proxy in namespace open-cluster-management-agent-addon",
          "deployment": {
            "name": "cluster-proxy-service-proxy",
            "scope": {
              "namespace": "open-cluster-management-agent-addon"
            }
          }
        },
        {
          "name": "Don't alert on deployment config-policy-controller in namespace open-cluster-management-agent-addon",
          "deployment": {
            "name": "config-policy-controller",
            "scope": {
              "namespace": "open-cluster-management-agent-addon"
            }
          }
        },
        {
          "name": "Don't alert on deployment console-chart-console-v2 in namespace open-cluster-management",
          "deployment": {
            "name": "console-chart-console-v2",
            "scope": {
              "namespace": "open-cluster-management"
            }
          }
        },
        {
          "name": "Don't alert on deployment console-mce-console in namespace multicluster-engine",
          "deployment": {
            "name": "console-mce-console",
            "scope": {
              "namespace": "multicluster-engine"
            }
          }
        },
        {
          "name": "Don't alert on deployment governance-policy-framework in namespace open-cluster-management-agent-addon",
          "deployment": {
            "name": "governance-policy-framework",
            "scope": {
              "namespace": "open-cluster-management-agent-addon"
            }
          }
        },
        {
          "name": "Don't alert on deployment grc-policy-addon-controller in namespace open-cluster-management",
          "deployment": {
            "name": "grc-policy-addon-controller",
            "scope": {
              "namespace": "open-cluster-management"
            }
          }
        },
        {
          "name": "Don't alert on deployment grc-policy-propagator in namespace open-cluster-management",
          "deployment": {
            "name": "grc-policy-propagator",
            "scope": {
              "namespace": "open-cluster-management"
            }
          }
        },
        {
          "name": "Don't alert on deployment hive-clustersync in namespace hive",
          "deployment": {
            "name": "hive-clustersync",
            "scope": {
              "namespace": "hive"
            }
          }
        },
        {
          "name": "Don't alert on deployment hive-controllers in namespace hive",
          "deployment": {
            "name": "hive-controllers",
            "scope": {
              "namespace": "hive"
            }
          }
        },
        {
          "name": "Don't alert on deployment hive-operator in namespace multicluster-engine",
          "deployment": {
            "name": "hive-operator",
            "scope": {
              "namespace": "multicluster-engine"
            }
          }
        },
        {
          "name": "Don't alert on deployment hiveadmission in namespace hive",
          "deployment": {
            "name": "hiveadmission",
            "scope": {
              "namespace": "hive"
            }
          }
        },
        {
          "name": "Don't alert on deployment iam-policy-controller in namespace open-cluster-management-agent-addon",
          "deployment": {
            "name": "iam-policy-controller",
            "scope": {
              "namespace": "open-cluster-management-agent-addon"
            }
          }
        },
        {
          "name": "Don't alert on deployment infrastructure-operator in namespace multicluster-engine",
          "deployment": {
            "name": "infrastructure-operator",
            "scope": {
              "namespace": "multicluster-engine"
            }
          }
        },
        {
          "name": "Don't alert on deployment insights-client in namespace open-cluster-management",
          "deployment": {
            "name": "insights-client",
            "scope": {
              "namespace": "open-cluster-management"
            }
          }
        },
        {
          "name": "Don't alert on deployment insights-metrics in namespace open-cluster-management",
          "deployment": {
            "name": "insights-metrics",
            "scope": {
              "namespace": "open-cluster-management"
            }
          }
        },
        {
          "name": "Don't alert on deployment klusterlet-addon-search in namespace open-cluster-management-agent-addon",
          "deployment": {
            "name": "klusterlet-addon-search",
            "scope": {
              "namespace": "open-cluster-management-agent-addon"
            }
          }
        },
        {
          "name": "Don't alert on deployment klusterlet-addon-workmgr in namespace open-cluster-management-agent-addon",
          "deployment": {
            "name": "klusterlet-addon-workmgr",
            "scope": {
              "namespace": "open-cluster-management-agent-addon"
            }
          }
        },
        {
          "name": "Don't alert on deployment klusterlet-registration-agent in namespace open-cluster-management-agent",
          "deployment": {
            "name": "klusterlet-registration-agent",
            "scope": {
              "namespace": "open-cluster-management-agent"
            }
          }
        },
        {
          "name": "Don't alert on deployment klusterlet-work-agent in namespace open-cluster-management-agent",
          "deployment": {
            "name": "klusterlet-work-agent",
            "scope": {
              "namespace": "open-cluster-management-agent"
            }
          }
        },
        {
          "name": "Don't alert on deployment ocm-controller in namespace multicluster-engine",
          "deployment": {
            "name": "ocm-controller",
            "scope": {
              "namespace": "multicluster-engine"
            }
          }
        },
        {
          "name": "Don't alert on deployment ocm-proxyserver in namespace multicluster-engine",
          "deployment": {
            "name": "ocm-proxyserver",
            "scope": {
              "namespace": "multicluster-engine"
            }
          }
        },
        {
          "name": "Don't alert on deployment ocm-webhook in namespace multicluster-engine",
          "deployment": {
            "name": "ocm-webhook",
            "scope": {
              "namespace": "multicluster-engine"
            }
          }
        },
        {
          "name": "Don't alert on deployment search-api in namespace open-cluster-management",
          "deployment": {
            "name": "search-api",
            "scope": {
              "namespace": "open-cluster-management"
            }
          }
        },
        {
          "name": "Don't alert on deployment search-collector in namespace open-cluster-management",
          "deployment": {
            "name": "search-collector",
            "scope": {
              "namespace": "open-cluster-management"
            }
          }
        },
        {
          "name": "Don't alert on deployment search-indexer in namespace open-cluster-management",
          "deployment": {
            "name": "search-indexer",
            "scope": {
              "namespace": "open-cluster-management"
            }
          }
        },
        {
          "name": "Don't alert on deployment search-postgres in namespace open-cluster-management",
          "deployment": {
            "name": "search-postgres",
            "scope": {
              "namespace": "open-cluster-management"
            }
          }
        },
        {
          "name": "Don't alert on deployment submariner-addon in namespace open-cluster-management",
          "deployment": {
            "name": "submariner-addon",
            "scope": {
              "namespace": "open-cluster-management"
            }
          }
        },
        {
          "name": "Don't alert on deployment volsync-addon-controller in namespace open-cluster-management",
          "deployment": {
            "name": "volsync-addon-controller",
            "scope": {
              "namespace": "open-cluster-management"
            }
          }
        }
      ],
      "severity": "MEDIUM_SEVERITY",
      "policyVersion": "1.1",
      "policySections": [
        {
          "policyGroups": [
            {
              "fieldName": "Container CPU Request",
              "values": [
                {
                  "value": "0.000000"
                }
              ]
            }
          ]
        },
        {
          "policyGroups": [
            {
              "fieldName": "Container Memory Limit",
              "values": [
                {
                  "value": "0.000000"
                }
              ]
            }
          ]
        }
      ],
      "criteriaLocked": true,
      "mitreVectorsLocked": true,
      "isDefault": false,
      "disabled": true
    },
    {
      "id": "11d88b9c-e809-419d-b26e-e7475f72896c",
      "name": "BSI: Disallow latest tag",
      "description": "the policy checks, if the deployment is referencing a latest tag",
      "rationale": "SYS.1.6.A6 The latest tag is typically moving. So there is no guarantee which image is used.",
      "remediation": "Change the tag to a version string (i.e. SemVer)",
      "categories": [
        "DevOps Best Practices",
        "Supply Chain Security",
        "BSI"
      ],
      "lifecycleStages": [
        "BUILD",
        "DEPLOY"
      ],
      "exclusions": [
        {
          "name": "Don't alert on deployment sre-pod-network-connectivity-check-pruner in namespace openshift-network-diagnostics",
          "deployment": {
            "name": "sre-pod-network-connectivity-check-pruner",
            "scope": {
              "namespace": "openshift-network-diagnostics"
            }
          }
        },
        {
          "name": "Don't alert on deployment osd-delete-ownerrefs-serviceaccounts in namespace openshift-sre-pruning",
          "deployment": {
            "name": "osd-delete-ownerrefs-serviceaccounts",
            "scope": {
              "namespace": "openshift-sre-pruning"
            }
          }
        },
        {
          "name": "Don't alert on deployment sre-build-test in namespace openshift-build-test",
          "deployment": {
            "name": "sre-build-test",
            "scope": {
              "namespace": "openshift-build-test"
            }
          }
        },
        {
          "name": "Don't alert on deployment osd-delete-backplane-script-resources in namespace openshift-backplane-managed-scripts",
          "deployment": {
            "name": "osd-delete-backplane-script-resources",
            "scope": {
              "namespace": "openshift-backplane-managed-scripts"
            }
          }
        },
        {
          "name": "Don't alert on deployment sre-ebs-iops-reporter in namespace openshift-monitoring",
          "deployment": {
            "name": "sre-ebs-iops-reporter",
            "scope": {
              "namespace": "openshift-monitoring"
            }
          }
        },
        {
          "name": "Don't alert on deployment sre-stuck-ebs-vols in namespace openshift-monitoring",
          "deployment": {
            "name": "sre-stuck-ebs-vols",
            "scope": {
              "namespace": "openshift-monitoring"
            }
          }
        },
        {
          "name": "Don't alert on deployment osd-delete-backplane-serviceaccounts in namespace openshift-backplane",
          "deployment": {
            "name": "osd-delete-backplane-serviceaccounts",
            "scope": {
              "namespace": "openshift-backplane"
            }
          }
        },
        {
          "name": "Don't alert on deployment deployments-pruner in namespace openshift-sre-pruning",
          "deployment": {
            "name": "deployments-pruner",
            "scope": {
              "namespace": "openshift-sre-pruning"
            }
          }
        },
        {
          "name": "Don't alert on deployment osd-patch-subscription-source in namespace openshift-marketplace",
          "deployment": {
            "name": "osd-patch-subscription-source",
            "scope": {
              "namespace": "openshift-marketplace"
            }
          }
        },
        {
          "name": "Don't alert on deployment sre-dns-latency-exporter in namespace openshift-monitoring",
          "deployment": {
            "name": "sre-dns-latency-exporter",
            "scope": {
              "namespace": "openshift-monitoring"
            }
          }
        },
        {
          "name": "Don't alert on deployment osd-rebalance-infra-nodes in namespace openshift-monitoring",
          "deployment": {
            "name": "osd-rebalance-infra-nodes",
            "scope": {
              "namespace": "openshift-monitoring"
            }
          }
        },
        {
          "name": "Don't alert on deployment osd-rebalance-infra-node in namespace openshift-monitoring",
          "deployment": {
            "name": "osd-rebalance-infra-node",
            "scope": {
              "namespace": "openshift-monitoring"
            }
          }
        },
        {
          "name": "Don't alert on kube-system namespace",
          "deployment": {
            "scope": {
              "namespace": "kube-system"
            }
          }
        },
        {
          "name": "Don't alert on istio-system namespace",
          "deployment": {
            "scope": {
              "namespace": "istio-system"
            }
          }
        }
      ],
      "severity": "LOW_SEVERITY",
      "policyVersion": "1.1",
      "policySections": [
        {
          "policyGroups": [
            {
              "fieldName": "Image Tag",
              "values": [
                {
                  "value": "latest"
                }
              ]
            }
          ]
        }
      ],
      "criteriaLocked": true,
      "mitreVectorsLocked": true,
      "isDefault": false,
      "disabled": true
    },
    {
      "id": "6c4e74a4-ff75-4005-b279-4ba6b4113136",
      "name": "BSI: Not a trusted Image Registry",
      "description": "The Policy checks, if the images derive from a trusted registry.",
      "rationale": "SYS.1.6.A6 Images from unknown registries may not be scanned and secured. Requiring use of known registries helps reduce threat exposure.",
      "remediation": "Only reference images from registries, which are defined in this policy.",
      "disabled": true,
      "categories": [
        "Security Best Practices",
        "BSI"
      ],
      "lifecycleStages": [
        "DEPLOY"
      ],
      "eventSource": "NOT_APPLICABLE",
      "exclusions": [
        {
          "name": "",
          "deployment": {
            "name": "",
            "scope": {
              "cluster": "",
              "namespace": "^kube.+|^openshift.+",
              "label": null
            }
          },
          "image": null,
          "expiration": null
        }
      ],
      "scope": [],
      "severity": "MEDIUM_SEVERITY",
      "enforcementActions": [],
      "notifiers": [],
      "lastUpdated": "2023-01-03T11:08:01.787539359Z",
      "SORTName": "",
      "SORTLifecycleStage": "",
      "SORTEnforcement": false,
      "policyVersion": "1.1",
      "policySections": [
        {
          "sectionName": "Trusted Registry",
          "policyGroups": [
            {
              "fieldName": "Image Registry",
              "booleanOperator": "OR",
              "negate": true,
              "values": [
                {
                  "value": "registry.opencode.de"
                },
                {
                  "value": "registry.redhat.io"
                },
                {
                  "value": "registry.access.redhat.com"
                }
              ]
            }
          ]
        }
      ],
      "mitreAttackVectors": [],
      "criteriaLocked": false,
      "mitreVectorsLocked": false,
      "isDefault": false
    },
    {
      "id": "876e1baf-60d7-431a-a1ba-433f95a22c6d",
      "name": "BSI: Environment Variable Contains Secret",
      "description": "Alert on deployments with environment variables that contain 'SECRET'",
      "rationale": "SYS.1.6.A8 Using secrets in environment variables may allow inspection into your secrets from the host or even through the orchestrator UI.",
      "remediation": "Migrate your secrets from environment variables to orchestrator secrets or your security team's secret management solution.",
      "categories": [
        "Security Best Practices",
        "BSI"
      ],
      "lifecycleStages": [
        "DEPLOY"
      ],
      "exclusions": [
        {
          "name": "Don't alert on deployment noobaa-core in namespace openshift-storage",
          "deployment": {
            "name": "noobaa-core",
            "scope": {
              "namespace": "openshift-storage"
            }
          }
        },
        {
          "name": "Don't alert on deployment noobaa-endpoint in namespace openshift-storage",
          "deployment": {
            "name": "noobaa-endpoint",
            "scope": {
              "namespace": "openshift-storage"
            }
          }
        },
        {
          "name": "Don't alert on deployment ocs-operator in namespace openshift-storage",
          "deployment": {
            "name": "ocs-operator",
            "scope": {
              "namespace": "openshift-storage"
            }
          }
        },
        {
          "name": "Don't alert on deployment ocm-agent in openshift-ocm-agent-operator namespace",
          "deployment": {
            "name": "ocm-agent",
            "scope": {
              "namespace": "openshift-ocm-agent-operator"
            }
          }
        },
        {
          "name": "Don't alert on router-default in openshift-ingress namespace",
          "deployment": {
            "name": "router-default",
            "scope": {
              "namespace": "openshift-ingress"
            }
          }
        },
        {
          "name": "Don't alert on image-registry in openshift-image-registry namespace",
          "deployment": {
            "name": "image-registry",
            "scope": {
              "namespace": "openshift-image-registry"
            }
          }
        },
        {
          "name": "Don't alert on thanos-ruler-user-workload in openshift-user-workload-monitoring namespace",
          "deployment": {
            "name": "thanos-ruler-user-workload",
            "scope": {
              "namespace": "openshift-user-workload-monitoring"
            }
          }
        },
        {
          "name": "Don't alert on klusterlet-addon-controller-v2 in namespace open-cluster-management",
          "deployment": {
            "name": "klusterlet-addon-controller-v2",
            "scope": {
              "namespace": "open-cluster-management"
            }
          }
        },
        {
          "name": "Don't alert on managedcluster-import-controller-v2 in namespace multicluster-engine",
          "deployment": {
            "name": "managedcluster-import-controller-v2",
            "scope": {
              "namespace": "multicluster-engine"
            }
          }
        }
      ],
      "severity": "HIGH_SEVERITY",
      "policyVersion": "1.1",
      "policySections": [
        {
          "policyGroups": [
            {
              "fieldName": "Environment Variable",
              "values": [
                {
                  "value": "RAW=.*SECRET.*|.*PASSWORD.*|.*PASSWORT.*|.*KEY.*|.*KENNWORT.*|.*TOKEN.*="
                }
              ]
            }
          ]
        }
      ],
      "criteriaLocked": true,
      "mitreVectorsLocked": true,
      "isDefault": false,
      "disabled": true
    },
    {
      "id": "e3df1f41-9ff0-438a-8d06-be21371f62ad",
      "name": "BSI: Host Path as Storage",
      "description": "The Policy checks, if the deployment mounts volumes of the type hostpath",
      "rationale": "SYS.1.6.A19 Access to information on the host can allow an adversary to gain a foodhold.",
      "remediation": "Mount data from volumes which are not Hostpath.",
      "disabled": true,
      "categories": [
        "Security Best Practices",
        "BSI"
      ],
      "lifecycleStages": [
        "DEPLOY"
      ],
      "eventSource": "NOT_APPLICABLE",
      "exclusions": [
        {
          "name": "",
          "deployment": {
            "name": "",
            "scope": {
              "cluster": "",
              "namespace": "^kube.+|^openshift.+|stackrox",
              "label": null
            }
          },
          "image": null,
          "expiration": null
        }
      ],
      "scope": [],
      "severity": "MEDIUM_SEVERITY",
      "enforcementActions": [],
      "notifiers": [],
      "lastUpdated": "2023-01-03T12:06:45.095967231Z",
      "SORTName": "",
      "SORTLifecycleStage": "",
      "SORTEnforcement": false,
      "policyVersion": "1.1",
      "policySections": [
        {
          "sectionName": "Policy Section 1",
          "policyGroups": [
            {
              "fieldName": "Volume Type",
              "booleanOperator": "OR",
              "negate": false,
              "values": [
                {
                  "value": "HostPath"
                }
              ]
            }
          ]
        }
      ],
      "mitreAttackVectors": [],
      "criteriaLocked": false,
      "mitreVectorsLocked": false,
      "isDefault": false
    },
    {
      "id": "784e0480-d160-4d71-97df-cf4df01d15e0",
      "name": "BSI: Local as Storage",
      "description": "The Policy checks, if the deployment mounts volumes of the type local",
      "rationale": "SYS.1.6.A19 Using local storage makes storage management harder and may allow attackers to overflow the local storage",
      "remediation": "Mount data from volumes which are not local.",
      "disabled": true,
      "categories": [
        "Security Best Practices",
        "BSI"
      ],
      "lifecycleStages": [
        "DEPLOY"
      ],
      "eventSource": "NOT_APPLICABLE",
      "exclusions": [
        {
          "name": "",
          "deployment": {
            "name": "",
            "scope": {
              "cluster": "",
              "namespace": "^kube.+|^openshift.+|stackrox",
              "label": null
            }
          },
          "image": null,
          "expiration": null
        }
      ],
      "scope": [],
      "severity": "MEDIUM_SEVERITY",
      "enforcementActions": [],
      "notifiers": [],
      "lastUpdated": "2023-01-03T12:09:23.016395845Z",
      "SORTName": "",
      "SORTLifecycleStage": "",
      "SORTEnforcement": false,
      "policyVersion": "1.1",
      "policySections": [
        {
          "sectionName": "Policy Section 1",
          "policyGroups": [
            {
              "fieldName": "Volume Type",
              "booleanOperator": "OR",
              "negate": false,
              "values": [
                {
                  "value": "local"
                }
              ]
            }
          ]
        }
      ],
      "mitreAttackVectors": [],
      "criteriaLocked": false,
      "mitreVectorsLocked": false,
      "isDefault": false
    },
    {
      "id": "20dfc2c5-23a4-41de-9b65-f9a95d90038e",
      "name": "BSI: read write root filesystem",
      "description": "This Policy checks, if a Container has a read-write root filesystem",
      "rationale": "SYS.1.6.A23 Container SOLLTEN ihr Dateisystem w\u00e4hrend der Laufzeit nicht ver\u00e4ndern k\u00f6nnen. Dateisysteme SOLLTEN nicht mit Schreibrechten eingebunden sein",
      "remediation": "Ensure that each container has readOnlyRootFilesystem: true set",
      "disabled": true,
      "categories": [
        "Privileges",
        "Docker CIS",
        "BSI"
      ],
      "lifecycleStages": [
        "DEPLOY"
      ],
      "exclusions": [
        {
          "name": "Don't alert on kube-system namespace",
          "deployment": {
            "scope": {
              "namespace": "kube-system"
            }
          }
        },
        {
          "name": "Don't alert on istio-system namespace",
          "deployment": {
            "scope": {
              "namespace": "istio-system"
            }
          }
        },
        {
          "name": "Don't alert on openshift-node namespace",
          "deployment": {
            "scope": {
              "namespace": "openshift-node"
            }
          }
        },
        {
          "name": "Don't alert on openshift-sdn namespace",
          "deployment": {
            "scope": {
              "namespace": "openshift-sdn"
            }
          }
        }
      ],
      "severity": "MEDIUM_SEVERITY",
      "policyVersion": "1.1",
      "policySections": [
        {
          "policyGroups": [
            {
              "fieldName": "Read-Only Root Filesystem",
              "values": [
                {
                  "value": "false"
                }
              ]
            }
          ]
        }
      ],
      "criteriaLocked": true,
      "mitreVectorsLocked": true,
      "isDefault": false
    },
    {
      "id": "cc4161a8-d001-4d2a-83dd-4221f8ef8447",
      "name": "BSI: Container is running with the root user",
      "description": "Containers should run as a non-root user",
      "rationale": "SYS.1.6.A17, SYS.1.6.A18 It is good practice to run the container as a non-root user, where possible. This can be done via the USER directive in the Dockerfile.",
      "remediation": "Ensure that the Dockerfile for each container switches from the root user",
      "categories": [
        "Docker CIS",
        "BSI"
      ],
      "lifecycleStages": [
        "BUILD",
        "DEPLOY"
      ],
      "exclusions": [
        {
          "name": "Don't alert on deployment gcp-cloud-controller-manager in openshift-cloud-controller-manager namespace",
          "deployment": {
            "name": "gcp-cloud-controller-manager",
            "scope": {
              "namespace": "openshift-cloud-controller-manager"
            }
          }
        },
        {
          "name": "Don't alert on deployment haproxy-* in openshift-vsphere-infra namespace",
          "deployment": {
            "name": "haproxy-.*",
            "scope": {
              "namespace": "openshift-vsphere-infra"
            }
          }
        },
        {
          "name": "Don't alert on deployment keepalived-* in openshift-vsphere-infra namespace",
          "deployment": {
            "name": "keepalived-.*",
            "scope": {
              "namespace": "openshift-vsphere-infra"
            }
          }
        },
        {
          "name": "Don't alert on deployment coredns-* in openshift-vsphere-infra namespace",
          "deployment": {
            "name": "coredns-.*",
            "scope": {
              "namespace": "openshift-vsphere-infra"
            }
          }
        },
        {
          "name": "Don't alert on deployment splunk-forwarder-operator in openshift-splunk-forwarder-operator namespace",
          "deployment": {
            "name": "splunk-forwarder-operator",
            "scope": {
              "namespace": "openshift-splunk-forwarder-operator"
            }
          }
        },
        {
          "name": "Don't alert on deployment openshift-controller-manager-operator in openshift-controller-manager-operator namespace",
          "deployment": {
            "name": "openshift-controller-manager-operator",
            "scope": {
              "namespace": "openshift-controller-manager-operator"
            }
          }
        },
        {
          "name": "Don't alert on openshift-backplane namespace",
          "deployment": {
            "scope": {
              "namespace": "openshift-backplane"
            }
          }
        },
        {
          "name": "Don't alert on openshift-multus namespace",
          "deployment": {
            "scope": {
              "namespace": "openshift-multus"
            }
          }
        },
        {
          "name": "Don't alert on openshift-ovn-kubernetes namespace",
          "deployment": {
            "scope": {
              "namespace": "openshift-ovn-kubernetes"
            }
          }
        },
        {
          "name": "Don't alert on openshift-image-registry namespace",
          "deployment": {
            "scope": {
              "namespace": "openshift-image-registry"
            }
          }
        },
        {
          "name": "Don't alert on openshift-controller-manager namespace",
          "deployment": {
            "scope": {
              "namespace": "openshift-controller-manager"
            }
          }
        },
        {
          "name": "Don't alert on openshift-machine-api namespace",
          "deployment": {
            "scope": {
              "namespace": "openshift-machine-api"
            }
          }
        },
        {
          "name": "Don't alert on openshift-cluster-storage-operator namespace",
          "deployment": {
            "scope": {
              "namespace": "openshift-cluster-storage-operator"
            }
          }
        },
        {
          "name": "Don't alert on openshift-monitoring namespace",
          "deployment": {
            "scope": {
              "namespace": "openshift-monitoring"
            }
          }
        },
        {
          "name": "Don't alert on openshift-kube-scheduler namespace",
          "deployment": {
            "scope": {
              "namespace": "openshift-kube-scheduler"
            }
          }
        },
        {
          "name": "Don't alert on openshift-kube-controller-manager namespace",
          "deployment": {
            "scope": {
              "namespace": "openshift-kube-controller-manager"
            }
          }
        },
        {
          "name": "Don't alert on deployment migrator in namespace openshift-kube-storage-version-migrator",
          "deployment": {
            "name": "migrator",
            "scope": {
              "namespace": "openshift-kube-storage-version-migrator"
            }
          }
        },
        {
          "name": "Don't alert on deployment insights-operator in namespace openshift-insights",
          "deployment": {
            "name": "insights-operator",
            "scope": {
              "namespace": "openshift-insights"
            }
          }
        },
        {
          "name": "Don't alert on deployment oauth-openshift in namespace openshift-authentication",
          "deployment": {
            "name": "oauth-openshift",
            "scope": {
              "namespace": "openshift-authentication"
            }
          }
        },
        {
          "name": "Don't alert on deployment authentication-operator in namespace openshift-authentication-operator",
          "deployment": {
            "name": "authentication-operator",
            "scope": {
              "namespace": "openshift-authentication-operator"
            }
          }
        },
        {
          "name": "Don't alert on deployment downloads in namespace openshift-console",
          "deployment": {
            "name": "downloads",
            "scope": {
              "namespace": "openshift-console"
            }
          }
        },
        {
          "name": "Don't alert on deployment cloud-credential-operator in namespace openshift-cloud-credential-operator",
          "deployment": {
            "name": "cloud-credential-operator",
            "scope": {
              "namespace": "openshift-cloud-credential-operator"
            }
          }
        },
        {
          "name": "Don't alert on deployment pod-identity-webhook in namespace openshift-cloud-credential-operator",
          "deployment": {
            "name": "pod-identity-webhook",
            "scope": {
              "namespace": "openshift-cloud-credential-operator"
            }
          }
        },
        {
          "name": "Don't alert on deployment network-operator in namespace openshift-network-operator",
          "deployment": {
            "name": "network-operator",
            "scope": {
              "namespace": "openshift-network-operator"
            }
          }
        },
        {
          "name": "Don't alert on deployment network-check-target in namespace openshift-network-diagnostics",
          "deployment": {
            "name": "network-check-target",
            "scope": {
              "namespace": "openshift-network-diagnostics"
            }
          }
        },
        {
          "name": "Don't alert on deployment network-check-source in namespace openshift-network-diagnostics",
          "deployment": {
            "name": "network-check-source",
            "scope": {
              "namespace": "openshift-network-diagnostics"
            }
          }
        },
        {
          "name": "Don't alert on deployment cluster-version-operator in namespace openshift-cluster-version",
          "deployment": {
            "name": "cluster-version-operator",
            "scope": {
              "namespace": "openshift-cluster-version"
            }
          }
        },
        {
          "name": "Don't alert on deployment machine-approver in namespace openshift-cluster-machine-approver",
          "deployment": {
            "name": "machine-approver",
            "scope": {
              "namespace": "openshift-cluster-machine-approver"
            }
          }
        },
        {
          "name": "Don't alert on deployment kube-apiserver-operator in namespace openshift-kube-apiserver-operator",
          "deployment": {
            "name": "kube-apiserver-operator",
            "scope": {
              "namespace": "openshift-kube-apiserver-operator"
            }
          }
        },
        {
          "name": "Don't alert on deployment ingress-canary in namespace openshift-ingress-canary",
          "deployment": {
            "name": "ingress-canary",
            "scope": {
              "namespace": "openshift-ingress-canary"
            }
          }
        },
        {
          "name": "Don't alert on deployment ingress-operator in namespace openshift-ingress-operator",
          "deployment": {
            "name": "ingress-operator",
            "scope": {
              "namespace": "openshift-ingress-operator"
            }
          }
        },
        {
          "name": "Don't alert on deployment cluster-cloud-controller-manager-operator in namespace openshift-cloud-controller-manager-operator",
          "deployment": {
            "name": "cluster-cloud-controller-manager-operator",
            "scope": {
              "namespace": "openshift-cloud-controller-manager-operator"
            }
          }
        },
        {
          "name": "Don't alert on deployment blackbox-exporter in namespace openshift-route-monitor-operator",
          "deployment": {
            "name": "blackbox-exporter",
            "scope": {
              "namespace": "openshift-route-monitor-operator"
            }
          }
        },
        {
          "name": "Don't alert on deployment thanos-ruler-user-workload in namespace openshift-user-workload-monitoring",
          "deployment": {
            "name": "thanos-ruler-user-workload",
            "scope": {
              "namespace": "openshift-user-workload-monitoring"
            }
          }
        },
        {
          "name": "Don't alert on deployment openshift-apiserver-operator in namespace openshift-apiserver-operator",
          "deployment": {
            "name": "openshift-apiserver-operator",
            "scope": {
              "namespace": "openshift-apiserver-operator"
            }
          }
        },
        {
          "name": "Don't alert on deployment etcd-operator in namespace openshift-etcd-operator",
          "deployment": {
            "name": "etcd-operator",
            "scope": {
              "namespace": "openshift-etcd-operator"
            }
          }
        },
        {
          "name": "Don't alert on deployment openshift-config-operator in namespace openshift-config-operator",
          "deployment": {
            "name": "openshift-config-operator",
            "scope": {
              "namespace": "openshift-config-operator"
            }
          }
        },
        {
          "name": "Don't alert on deployment kube-storage-version-migrator-operator in namespace openshift-kube-storage-version-migrator-operator",
          "deployment": {
            "name": "kube-storage-version-migrator-operator",
            "scope": {
              "namespace": "openshift-kube-storage-version-migrator-operator"
            }
          }
        },
        {
          "name": "Don't alert on deployment apiserver in namespace openshift-oauth-apiserver",
          "deployment": {
            "name": "apiserver",
            "scope": {
              "namespace": "openshift-oauth-apiserver"
            }
          }
        },
        {
          "name": "Don't alert on deployment cloud-network-config-controller in namespace openshift-cloud-network-config-controller",
          "deployment": {
            "name": "cloud-network-config-controller",
            "scope": {
              "namespace": "openshift-cloud-network-config-controller"
            }
          }
        },
        {
          "name": "Don't alert on deployment service-ca in namespace openshift-service-ca",
          "deployment": {
            "name": "service-ca",
            "scope": {
              "namespace": "openshift-service-ca"
            }
          }
        },
        {
          "name": "Don't alert on deployment service-ca-operator in namespace openshift-service-ca-operator",
          "deployment": {
            "name": "service-ca-operator",
            "scope": {
              "namespace": "openshift-service-ca-operator"
            }
          }
        },
        {
          "name": "Don't alert on deployment audit-exporter in namespace openshift-security",
          "deployment": {
            "name": "audit-exporter",
            "scope": {
              "namespace": "openshift-security"
            }
          }
        },
        {
          "name": "Don't alert on deployment route-controller-manager in namespace openshift-route-controller-manager",
          "deployment": {
            "name": "route-controller-manager",
            "scope": {
              "namespace": "openshift-route-controller-manager"
            }
          }
        },
        {
          "name": "Don't alert on StackRox namespace",
          "deployment": {
            "scope": {
              "namespace": "stackrox"
            }
          }
        },
        {
          "name": "Don't alert on kube-system namespace",
          "deployment": {
            "scope": {
              "namespace": "kube-system"
            }
          }
        },
        {
          "name": "Don't alert on openshift-sdn namespace",
          "deployment": {
            "scope": {
              "namespace": "openshift-sdn"
            }
          }
        },
        {
          "name": "Don't alert on openshift-kube-apiserver namespace",
          "deployment": {
            "scope": {
              "namespace": "openshift-kube-apiserver"
            }
          }
        },
        {
          "name": "Don't alert on openshift-etcd namespace",
          "deployment": {
            "scope": {
              "namespace": "openshift-etcd"
            }
          }
        },
        {
          "name": "Don't alert on openshift-apiserver namespace",
          "deployment": {
            "scope": {
              "namespace": "openshift-apiserver"
            }
          }
        },
        {
          "name": "Don't alert on openshift-dns namespace",
          "deployment": {
            "scope": {
              "namespace": "openshift-dns"
            }
          }
        },
        {
          "name": "Don't alert on openshift-cluster-node-tuning-operator namespace",
          "deployment": {
            "scope": {
              "namespace": "openshift-cluster-node-tuning-operator"
            }
          }
        },
        {
          "name": "Don't alert on openshift-cluster-csi-drivers namespace",
          "deployment": {
            "scope": {
              "namespace": "openshift-cluster-csi-drivers"
            }
          }
        },
        {
          "name": "Don't alert on openshift-machine-config-operator namespace",
          "deployment": {
            "scope": {
              "namespace": "openshift-machine-config-operator"
            }
          }
        },
        {
          "name": "Don't alert on deployment cluster-image-set-controller in namespace multicluster-engine",
          "deployment": {
            "name": "cluster-image-set-controller",
            "scope": {
              "namespace": "multicluster-engine"
            }
          }
        },
        {
          "name": "Don't alert on deployment discovery-operator in namespace multicluster-engine",
          "deployment": {
            "name": "discovery-operator",
            "scope": {
              "namespace": "multicluster-engine"
            }
          }
        },
        {
          "name": "Don't alert on deployment hive-clustersync in namespace hive",
          "deployment": {
            "name": "hive-clustersync",
            "scope": {
              "namespace": "hive"
            }
          }
        },
        {
          "name": "Don't alert on deployment hive-controllers in namespace hive",
          "deployment": {
            "name": "hive-controllers",
            "scope": {
              "namespace": "hive"
            }
          }
        },
        {
          "name": "Don't alert on deployment hive-operator in namespace multicluster-engine",
          "deployment": {
            "name": "hive-operator",
            "scope": {
              "namespace": "multicluster-engine"
            }
          }
        },
        {
          "name": "Don't alert on deployment hiveadmission in namespace hive",
          "deployment": {
            "name": "hiveadmission",
            "scope": {
              "namespace": "hive"
            }
          }
        },
        {
          "name": "Don't alert on deployment kube-controller-manager-operator in namespace openshift-kube-controller-manager-operator",
          "deployment": {
            "name": "kube-controller-manager-operator",
            "scope": {
              "namespace": "openshift-kube-controller-manager-operator"
            }
          }
        },
        {
          "name": "Don't alert on deployment openshift-kube-scheduler-operator in namespace openshift-kube-scheduler-operator",
          "deployment": {
            "name": "openshift-kube-scheduler-operator",
            "scope": {
              "namespace": "openshift-kube-scheduler-operator"
            }
          }
        },
        {
          "name": "Don't alert on openshift-logging namespace",
          "deployment": {
            "scope": {
              "namespace": "openshift-logging"
            }
          }
        },
        {
          "name": "Don't alert on deployment osd-patch-subscription-source in namespace openshift-marketplace",
          "deployment": {
            "name": "osd-patch-subscription-source",
            "scope": {
              "namespace": "openshift-marketplace"
            }
          }
        },
        {
          "name": "Don't alert on deployment osd-delete-ownerrefs-serviceaccounts in namespace openshift-backplane-srep",
          "deployment": {
            "name": "osd-delete-ownerrefs-serviceaccounts",
            "scope": {
              "namespace": "openshift-backplane-srep"
            }
          }
        },
        {
          "name": "Don't alert on deployment builds-pruner in namespace openshift-sre-pruning",
          "deployment": {
            "name": "builds-pruner",
            "scope": {
              "namespace": "openshift-sre-pruning"
            }
          }
        },
        {
          "name": "Don't alert on deployment deployments-pruner in namespace openshift-sre-pruning",
          "deployment": {
            "name": "deployments-pruner",
            "scope": {
              "namespace": "openshift-sre-pruning"
            }
          }
        },
        {
          "name": "Don't alert on deployment osd-delete-backplane-script-resources in namespace openshift-backplane-managed-scripts",
          "deployment": {
            "name": "osd-delete-backplane-script-resources",
            "scope": {
              "namespace": "openshift-backplane-managed-scripts"
            }
          }
        },
        {
          "name": "Don't alert on deployment network-node-identity in namespace openshift-network-node-identity",
          "deployment": {
            "name": "network-node-identity",
            "scope": {
              "namespace": "openshift-network-node-identity"
            }
          }
        },
        {
          "name": "Don't alert on deployment aws-cloud-controller-manager in namespace openshift-cloud-controller-manager",
          "deployment": {
            "name": "aws-cloud-controller-manager",
            "scope": {
              "namespace": "openshift-cloud-controller-manager"
            }
          }
        }
      ],
      "severity": "LOW_SEVERITY",
      "policyVersion": "1.1",
      "policySections": [
        {
          "policyGroups": [
            {
              "fieldName": "Image User",
              "values": [
                {
                  "value": "0"
                },
                {
                  "value": "root"
                }
              ]
            }
          ]
        }
      ],
      "criteriaLocked": true,
      "mitreVectorsLocked": true,
      "isDefault": false,
      "disabled": true
    },
    {
      "id": "f4f9c963-9319-4cc3-838b-298ee4c862d7",
      "name": "BSI: Process with UID 0",
      "description": "Alert on deployments that contain processes running with UID 0",
      "rationale": "SYS.1.6.A17, SYS.1.6.A18 Processes that are running with UID 0 run as the root user. This can allow for unintended privilege escalation if a container mounts host directories that are owned by the host's root user",
      "remediation": "Specify the USER instruction in the Docker image or the runAsUser field within the Pod Security Context",
      "disabled": true,
      "categories": [
        "DevOps Best Practices",
        "Security Best Practices",
        "BSI"
      ],
      "lifecycleStages": [
        "RUNTIME"
      ],
      "eventSource": "DEPLOYMENT_EVENT",
      "exclusions": [
        {
          "name": "Don't alert on kube-system namespace",
          "deployment": {
            "scope": {
              "namespace": "kube-system"
            }
          }
        },
        {
          "name": "Don't alert on istio-system namespace",
          "deployment": {
            "scope": {
              "namespace": "istio-system"
            }
          }
        },
        {
          "name": "Don't alert on StackRox Namespace",
          "deployment": {
            "scope": {
              "namespace": "stackrox"
            }
          }
        },
        {
          "name": "Don't alert on istio-system namespace",
          "deployment": {
            "scope": {
              "namespace": "istio-system"
            }
          }
        },
        {
          "name": "Don't alert on deployment aide-worker-fileintegrity in namespace openshift-file-integrity",
          "deployment": {
            "name": "aide-worker-fileintegrity",
            "scope": {
              "namespace": "openshift-file-integrity"
            }
          }
        }
      ],
      "severity": "HIGH_SEVERITY",
      "policyVersion": "1.1",
      "policySections": [
        {
          "policyGroups": [
            {
              "fieldName": "Process UID",
              "values": [
                {
                  "value": "0"
                }
              ]
            }
          ]
        }
      ],
      "criteriaLocked": true,
      "mitreVectorsLocked": true,
      "isDefault": false
    },
    {
      "id": "bd4a6ec2-9b66-4e9a-b88c-483853368095",
      "name": "BSI: CAP_SYS_ADMIN capability added",
      "description": "Alert on deployments with containers escalating with CAP_SYS_ADMIN",
      "rationale": "SYS.1.6.A17 CAP_SYS_ADMIN grants an elevated level of privilege to a container that may not be necessary. https://lwn.net/Articles/486306/ explains what CAP_SYS_ADMIN does and points to possible alternatives.",
      "remediation": "Ensure that the container really needs the CAP_SYS_ADMIN capability or use a userspace derivative.",
      "categories": [
        "Privileges",
        "BSI"
      ],
      "lifecycleStages": [
        "DEPLOY"
      ],
      "severity": "MEDIUM_SEVERITY",
      "policyVersion": "1.1",
      "policySections": [
        {
          "policyGroups": [
            {
              "fieldName": "Add Capabilities",
              "values": [
                {
                  "value": "SYS_ADMIN"
                }
              ]
            }
          ]
        }
      ],
      "criteriaLocked": true,
      "mitreVectorsLocked": true,
      "isDefault": false,
      "disabled": true
    },
    {
      "id": "3f57b187-a154-4888-99a7-339573bf10fa",
      "name": "BSI: Privileged Container",
      "description": "Alert on deployments with containers running in privileged mode",
      "rationale": "SYS.1.6.A17 Containers running as privileged represent greater post-exploitation risk by allowing an attacker to access all host devices, run a daemon in the container, etc.",
      "remediation": "Verify that privileged capabilities are required and cannot be provided with a subset of other controls.",
      "categories": [
        "Privileges",
        "Docker CIS",
        "BSI"
      ],
      "lifecycleStages": [
        "DEPLOY"
      ],
      "exclusions": [
        {
          "name": "Don't alert on deployment splunkforwarder-ds in namespace openshift-security",
          "deployment": {
            "name": "splunkforwarder-ds",
            "scope": {
              "namespace": "openshift-security"
            }
          }
        },
        {
          "name": "Don't alert on deployment mdsd in namespace openshift-azure-logging",
          "deployment": {
            "name": "mdsd",
            "scope": {
              "namespace": "openshift-azure-logging"
            }
          }
        },
        {
          "name": "Don't alert on deployment audit-exporter in namespace openshift-security",
          "deployment": {
            "name": "audit-exporter",
            "scope": {
              "namespace": "openshift-security"
            }
          }
        },
        {
          "name": "Don't alert on deployment apiserver in namespace openshift-oauth-apiserver",
          "deployment": {
            "name": "apiserver",
            "scope": {
              "namespace": "openshift-oauth-apiserver"
            }
          }
        },
        {
          "name": "Don't alert on deployment ovnkube-node in namespace openshift-ovn-kubernetes",
          "deployment": {
            "name": "ovnkube-node",
            "scope": {
              "namespace": "openshift-ovn-kubernetes"
            }
          }
        },
        {
          "name": "Don't alert on deployment oauth-openshift in namespace openshift-authentication",
          "deployment": {
            "name": "oauth-openshift",
            "scope": {
              "namespace": "openshift-authentication"
            }
          }
        },
        {
          "name": "Don't alert on deployment multus-additional-cni-plugins in namespace openshift-multus",
          "deployment": {
            "name": "multus-additional-cni-plugins",
            "scope": {
              "namespace": "openshift-multus"
            }
          }
        },
        {
          "name": "Don't alert on deployment multus in namespace openshift-multus",
          "deployment": {
            "name": "multus",
            "scope": {
              "namespace": "openshift-multus"
            }
          }
        },
        {
          "name": "Don't alert on deployment node-ca in namespace openshift-image-registry",
          "deployment": {
            "name": "node-ca",
            "scope": {
              "namespace": "openshift-image-registry"
            }
          }
        },
        {
          "name": "Don't alert on the stackrox namespace",
          "deployment": {
            "scope": {
              "namespace": "stackrox"
            }
          }
        },
        {
          "name": "Don't alert on kube-system namespace",
          "deployment": {
            "scope": {
              "namespace": "kube-system"
            }
          }
        },
        {
          "name": "Don't alert on istio-system namespace",
          "deployment": {
            "scope": {
              "namespace": "istio-system"
            }
          }
        },
        {
          "name": "Don't alert on openshift-node namespace",
          "deployment": {
            "scope": {
              "namespace": "openshift-node"
            }
          }
        },
        {
          "name": "Don't alert on openshift-sdn namespace",
          "deployment": {
            "scope": {
              "namespace": "openshift-sdn"
            }
          }
        },
        {
          "name": "Don't alert on openshift-kube-apiserver namespace",
          "deployment": {
            "scope": {
              "namespace": "openshift-kube-apiserver"
            }
          }
        },
        {
          "name": "Don't alert on openshift-etcd namespace",
          "deployment": {
            "scope": {
              "namespace": "openshift-etcd"
            }
          }
        },
        {
          "name": "Don't alert on openshift-apiserver namespace",
          "deployment": {
            "scope": {
              "namespace": "openshift-apiserver"
            }
          }
        },
        {
          "name": "Don't alert on openshift-dns namespace",
          "deployment": {
            "scope": {
              "namespace": "openshift-dns"
            }
          }
        },
        {
          "name": "Don't alert on openshift-cluster-node-tuning-operator namespace",
          "deployment": {
            "scope": {
              "namespace": "openshift-cluster-node-tuning-operator"
            }
          }
        },
        {
          "name": "Don't alert on openshift-cluster-csi-drivers namespace",
          "deployment": {
            "scope": {
              "namespace": "openshift-cluster-csi-drivers"
            }
          }
        },
        {
          "name": "Don't alert on openshift-machine-config-operator namespace",
          "deployment": {
            "scope": {
              "namespace": "openshift-machine-config-operator"
            }
          }
        },
        {
          "name": "Don't alert on deployment coredns-ci-ln-*-master-\\d+ in namespace openshift-vsphere-infra",
          "deployment": {
            "name": "coredns-ci-ln-.*-master-\\d+",
            "scope": {
              "namespace": "openshift-vsphere-infra"
            }
          }
        },
        {
          "name": "Don't alert on deployment haproxy-ci-ln-*-master-\\d+ in namespace openshift-vsphere-infra",
          "deployment": {
            "name": "haproxy-ci-ln-.*-master-\\d+",
            "scope": {
              "namespace": "openshift-vsphere-infra"
            }
          }
        },
        {
          "name": "Don't alert on deployment keepalived-ci-ln-*-master-\\d+ in namespace openshift-vsphere-infra",
          "deployment": {
            "name": "keepalived-ci-ln-.*-master-\\d+",
            "scope": {
              "namespace": "openshift-vsphere-infra"
            }
          }
        },
        {
          "name": "Don't alert on deployments coredns-ci-ln-*-worker-* in namespace openshift-vsphere-infra",
          "deployment": {
            "name": "coredns-ci-ln-.*-worker-.*",
            "scope": {
              "namespace": "openshift-vsphere-infra"
            }
          }
        },
        {
          "name": "Don't alert on deployments keepalived-ci-ln-*-worker-* in namespace openshift-vsphere-infra",
          "deployment": {
            "name": "keepalived-ci-ln-.*-worker-.*",
            "scope": {
              "namespace": "openshift-vsphere-infra"
            }
          }
        }
      ],
      "severity": "MEDIUM_SEVERITY",
      "policyVersion": "1.1",
      "policySections": [
        {
          "policyGroups": [
            {
              "fieldName": "Privileged Container",
              "values": [
                {
                  "value": "true"
                }
              ]
            }
          ]
        }
      ],
      "criteriaLocked": true,
      "mitreVectorsLocked": true,
      "isDefault": false,
      "disabled": true
    },
    {
      "id": "047cc937-16dd-4aa0-aa47-604a5a2c9de0",
      "name": "BSI: Container with privilege escalation",
      "description": "Alerts if a deployment has containers with allowPrivilegeEscalation set to true in its security context.",
      "rationale": "SYS.1.6.A17 A container process can run with more privileges than its parent process if the container's security context has the boolean setting allowPrivilegeEscalation enabled. In Kubernetes pods, this setting is true by default. Set the value to false if the pod is to run as a non-root user.",
      "remediation": "Verify that privileged escalation is required and cannot be provided with a subset of other controls. Disable privilege escalation by setting allowPrivilegeEscalation to false.",
      "categories": [
        "Security Best Practices",
        "Privileges",
        "BSI"
      ],
      "lifecycleStages": [
        "DEPLOY"
      ],
      "exclusions": [
        {
          "name": "Don't alert on deployment router-default in namespace openshift-ingress",
          "deployment": {
            "name": "router-default",
            "scope": {
              "namespace": "openshift-ingress"
            }
          }
        }
      ],
      "severity": "MEDIUM_SEVERITY",
      "policyVersion": "1.1",
      "policySections": [
        {
          "sectionName": "Policy Section 1",
          "policyGroups": [
            {
              "fieldName": "Allow Privilege Escalation",
              "values": [
                {
                  "value": "true"
                }
              ]
            }
          ]
        }
      ],
      "criteriaLocked": true,
      "mitreVectorsLocked": true,
      "isDefault": false,
      "disabled": true
    },
    {
      "id": "60cd5431-6ac1-4829-83d6-e337855932dd",
      "name": "BSI: Default Serviceaccount in use",
      "description": "This Policy checks, if the default serviceaccount is used.",
      "rationale": "APP.4.4.A9 Containers should each use their own ServiceAccount to ensure authentication when communicating with Kubernetes system or other pods. APP.4.4.A9",
      "remediation": "serviceAccountName must be set to anything other than \"default\".",
      "disabled": true,
      "categories": [
        "BSI"
      ],
      "lifecycleStages": [
        "DEPLOY"
      ],
      "eventSource": "NOT_APPLICABLE",
      "exclusions": [
        {
          "name": "",
          "deployment": {
            "name": "",
            "scope": {
              "cluster": "",
              "namespace": "^kube-.+|^openshift-.+",
              "label": null
            }
          },
          "image": null,
          "expiration": null
        }
      ],
      "scope": [],
      "severity": "MEDIUM_SEVERITY",
      "enforcementActions": [],
      "notifiers": [],
      "lastUpdated": "2023-01-03T12:15:31.248271580Z",
      "SORTName": "",
      "SORTLifecycleStage": "",
      "SORTEnforcement": false,
      "policyVersion": "1.1",
      "policySections": [
        {
          "sectionName": "Policy Section 1",
          "policyGroups": [
            {
              "fieldName": "Service Account",
              "booleanOperator": "OR",
              "negate": false,
              "values": [
                {
                  "value": "default"
                }
              ]
            }
          ]
        }
      ],
      "mitreAttackVectors": [],
      "criteriaLocked": false,
      "mitreVectorsLocked": false,
      "isDefault": false
    },
    {
      "id": "d2556380-d004-4430-9e38-bb1044ea1ae3",
      "name": "BSI: Pod Service Account Token Automatically Mounted",
      "description": "Protect pod default service account tokens from compromise by minimizing the mounting of the default service account token to only those pods whose application requires interaction with the Kubernetes API.",
      "rationale": "APP.4.4.A9 By default, Kubernetes automatically provisions a service account for each pod and mounts the secret at runtime. This service account is not typically used. If this pod is compromised and the compromised user has access to the service account, the service account could be used to escalate privileges within the cluster. To reduce the likelihood of privilege escalation this service account should not be mounted by default unless the pod requires direct access to the Kubernetes API as part of the pods functionality.",
      "remediation": "Add `automountServiceAccountToken: false` or a value distinct from 'default' for the `serviceAccountName` key to the deployment's Pod configuration.",
      "categories": [
        "Security Best Practices",
        "Privileges",
        "BSI"
      ],
      "lifecycleStages": [
        "DEPLOY"
      ],
      "exclusions": [
        {
          "name": "Don't alert on deployment kube-rbac-proxy-crio-bm-ocp-shift-left-vxhch-master-2.c.acs-team-temp-dev.internal in namespace openshift-config-machine-operator",
          "deployment": {
            "name": "kube-rbac-proxy-crio-bm-ocp-shift-left-vxhch-master-2.c.acs-team-temp-dev.internal",
            "scope": {
              "namespace": "openshift-config-machine-operator"
            }
          }
        },
        {
          "name": "Don't alert on deployment kube-rbac-proxy-crio-bm-ocp-shift-left-vxhch-master-1.c.acs-team-temp-dev.internal in namespace openshift-config-machine-operator",
          "deployment": {
            "name": "kube-rbac-proxy-crio-bm-ocp-shift-left-vxhch-master-1.c.acs-team-temp-dev.internal",
            "scope": {
              "namespace": "openshift-config-machine-operator"
            }
          }
        },
        {
          "name": "Don't alert on deployment kube-rbac-proxy-crio-bm-ocp-shift-left-vxhch-master-0.c.acs-team-temp-dev.internal in namespace openshift-config-machine-operator",
          "deployment": {
            "name": "kube-rbac-proxy-crio-bm-ocp-shift-left-vxhch-master-0.c.acs-team-temp-dev.internal",
            "scope": {
              "namespace": "openshift-config-machine-operator"
            }
          }
        },
        {
          "name": "Don't alert on deployment kube-rbac-proxy-crio-bm-ocp-shift-left-vxhch-worker-c-cfh9c in namespace openshift-config-machine-operator",
          "deployment": {
            "name": "kube-rbac-proxy-crio-bm-ocp-shift-left-vxhch-worker-c-cfh9c",
            "scope": {
              "namespace": "openshift-config-machine-operator"
            }
          }
        },
        {
          "name": "Don't alert on deployment haproxy-* in namespace openshift-vsphere-infra",
          "deployment": {
            "name": "haproxy-.*",
            "scope": {
              "namespace": "openshift-vsphere-infra"
            }
          }
        },
        {
          "name": "Don't alert on deployment keepalived in namespace openshift-vsphere-infra",
          "deployment": {
            "name": "keepalived-.*",
            "scope": {
              "namespace": "openshift-vsphere-infra"
            }
          }
        },
        {
          "name": "Don't alert on deployment coredns-* in namespace openshift-vsphere-infra",
          "deployment": {
            "name": "coredns-.*",
            "scope": {
              "namespace": "openshift-vsphere-infra"
            }
          }
        },
        {
          "name": "Don't alert on deployment apiserver-watcher-* in namespace openshift-kube-apiserver",
          "deployment": {
            "name": "apiserver-watcher-.*",
            "scope": {
              "namespace": "openshift-kube-apiserver"
            }
          }
        },
        {
          "name": "Don't alert on deployment kube-apiserver-* in namespace openshift-kube-apiserver",
          "deployment": {
            "name": "kube-apiserver-.*",
            "scope": {
              "namespace": "openshift-kube-apiserver"
            }
          }
        },
        {
          "name": "Don't alert on deployment kube-apiserver-guard-* in namespace openshift-kube-apiserver",
          "deployment": {
            "name": "kube-apiserver-guard-.*",
            "scope": {
              "namespace": "openshift-kube-apiserver"
            }
          }
        },
        {
          "name": "Don't alert on deployment openshift-kube-scheduler-* in namespace openshift-kube-scheduler",
          "deployment": {
            "name": "openshift-kube-scheduler-.*",
            "scope": {
              "namespace": "openshift-kube-scheduler"
            }
          }
        },
        {
          "name": "Don't alert on deployment openshift-kube-scheduler-guard-* in namespace openshift-kube-scheduler",
          "deployment": {
            "name": "openshift-kube-scheduler-guard-.*",
            "scope": {
              "namespace": "openshift-kube-scheduler"
            }
          }
        },
        {
          "name": "Don't alert on deployment etcd-* in namespace openshift-etcd",
          "deployment": {
            "name": "etcd-.*",
            "scope": {
              "namespace": "openshift-etcd"
            }
          }
        },
        {
          "name": "Don't alert on deployment etcd-guard-* in namespace openshift-etcd",
          "deployment": {
            "name": "etcd-guard-.*",
            "scope": {
              "namespace": "openshift-etcd"
            }
          }
        },
        {
          "name": "Don't alert on deployment kube-controller-manager-* in namespace openshift-kube-controller-manager",
          "deployment": {
            "name": "kube-controller-manager-.*",
            "scope": {
              "namespace": "openshift-kube-controller-manager"
            }
          }
        },
        {
          "name": "Don't alert on deployment kube-controller-manager-guard* in namespace openshift-kube-controller-manager",
          "deployment": {
            "name": "kube-controller-manager-guard.*",
            "scope": {
              "namespace": "openshift-kube-controller-manager"
            }
          }
        },
        {
          "name": "Don't alert on deployment splunkforwarder-ds in openshift-security namespace",
          "deployment": {
            "name": "splunkforwarder-ds",
            "scope": {
              "namespace": "openshift-security"
            }
          }
        },
        {
          "name": "Don't alert on namespace openshift-kube-apiserver",
          "deployment": {
            "scope": {
              "namespace": "openshift-kube-apiserver"
            }
          }
        },
        {
          "name": "Don't alert on namespace openshift-kube-scheduler",
          "deployment": {
            "scope": {
              "namespace": "openshift-kube-scheduler"
            }
          }
        },
        {
          "name": "Don't alert on namespace openshift-etcd",
          "deployment": {
            "scope": {
              "namespace": "openshift-etcd"
            }
          }
        },
        {
          "name": "Don't alert on namespace openshift-kube-controller-manager",
          "deployment": {
            "scope": {
              "namespace": "openshift-kube-controller-manager"
            }
          }
        },
        {
          "name": "Don't alert on deployment blackbox-exporter in  openshift-route-monitor-operator namespace",
          "deployment": {
            "name": "blackbox-exporter",
            "scope": {
              "namespace": "openshift-route-monitor-operator"
            }
          }
        },
        {
          "name": "Don't alert on deployment token-refresher in openshift-monitoring namespace",
          "deployment": {
            "name": "token-refresher",
            "scope": {
              "namespace": "openshift-monitoring"
            }
          }
        },
        {
          "name": "Don't alert on deployment downloads in openshift-console namespace",
          "deployment": {
            "name": "downloads",
            "scope": {
              "namespace": "openshift-console"
            }
          }
        },
        {
          "name": "Don't alert on deployment csi-snapshot-webhook in openshift-cluster-storage-operator namepsace",
          "deployment": {
            "name": "csi-snapshot-webhook",
            "scope": {
              "namespace": "openshift-cluster-storage-operator"
            }
          }
        },
        {
          "name": "Don't alert on deployment network-operator in openshift-network-operator namespace",
          "deployment": {
            "name": "network-operator",
            "scope": {
              "namespace": "openshift-network-operator"
            }
          }
        },
        {
          "name": "Don't alert on deployment network-check-target in openshift-network-diagnostics Namespace",
          "deployment": {
            "name": "network-check-target",
            "scope": {
              "namespace": "openshift-network-diagnostics"
            }
          }
        },
        {
          "name": "Don't alert on deployment machine-config-operator in openshift-machine-config-operator Namespace",
          "deployment": {
            "name": "machine-config-operator",
            "scope": {
              "namespace": "openshift-machine-config-operator"
            }
          }
        },
        {
          "name": "Don't alert on deployment ingress-canary in openshift-ingress-canary Namespace",
          "deployment": {
            "name": "ingress-canary",
            "scope": {
              "namespace": "openshift-ingress-canary"
            }
          }
        },
        {
          "name": "Don't alert on deployment cluster-proxy-service-proxy in namespace open-cluster-management-agent-addon ",
          "deployment": {
            "name": "cluster-proxy-service-proxy",
            "scope": {
              "namespace": "open-cluster-management-agent-addon"
            }
          }
        },
        {
          "name": "Don't alert on deployment multus in namespace openshift-multus",
          "deployment": {
            "name": "multus",
            "scope": {
              "namespace": "openshift-multus"
            }
          }
        },
        {
          "name": "Don't alert on deployment validation-webhook in namespace openshift-validation-webhook",
          "deployment": {
            "name": "validation-webhook",
            "scope": {
              "namespace": "openshift-validation-webhook"
            }
          }
        }
      ],
      "severity": "MEDIUM_SEVERITY",
      "policyVersion": "1.1",
      "policySections": [
        {
          "policyGroups": [
            {
              "fieldName": "Automount Service Account Token",
              "values": [
                {
                  "value": "true"
                }
              ]
            },
            {
              "fieldName": "Service Account",
              "values": [
                {
                  "value": "default"
                }
              ]
            },
            {
              "fieldName": "Namespace",
              "negate": true,
              "values": [
                {
                  "value": "kube-system"
                }
              ]
            }
          ]
        }
      ],
      "criteriaLocked": true,
      "mitreVectorsLocked": true,
      "isDefault": false,
      "disabled": true
    },
    {
      "id": "91928ae7-2a89-491b-94d2-17b42329bde4",
      "name": "BSI: Network Policies missing",
      "description": "The Policy checks, if the pods are selected by an egress and an ingress network policy.",
      "rationale": "APP.4.4.A4, APP.4.4.A7, SYS.1.6.A5 It should be ensured, that workloads are separatet on the network layer.",
      "remediation": "Ensure each deployment has Network Policies defined for egress and ingress",
      "disabled": false,
      "categories": [
        "Security Best Practices",
        "BSI"
      ],
      "lifecycleStages": [
        "DEPLOY"
      ],
      "eventSource": "NOT_APPLICABLE",
      "exclusions": [
        {
          "name": "",
          "deployment": {
            "name": "",
            "scope": {
              "cluster": "",
              "namespace": "^kube.+|^openshift.+",
              "label": null
            }
          },
          "image": null,
          "expiration": null
        }
      ],
      "scope": [],
      "severity": "MEDIUM_SEVERITY",
      "enforcementActions": [],
      "notifiers": [],
      "lastUpdated": "2023-01-03T10:00:15.762506048Z",
      "SORTName": "",
      "SORTLifecycleStage": "",
      "SORTEnforcement": false,
      "policyVersion": "1.1",
      "policySections": [
        {
          "sectionName": "Ingress Network Policy missing",
          "policyGroups": [
            {
              "fieldName": "Has Ingress Network Policy",
              "booleanOperator": "OR",
              "negate": false,
              "values": [
                {
                  "value": "false"
                }
              ]
            }
          ]
        },
        {
          "sectionName": "Egress Network Policy missing",
          "policyGroups": [
            {
              "fieldName": "Has Egress Network Policy",
              "booleanOperator": "OR",
              "negate": false,
              "values": [
                {
                  "value": "false"
                }
              ]
            }
          ]
        }
      ],
      "mitreAttackVectors": [
        {
          "tactic": "TA0007",
          "techniques": [
            "T1046"
          ]
        }
      ],
      "criteriaLocked": false,
      "mitreVectorsLocked": false,
      "isDefault": false
    },
    {
      "id": "d271096a-bd2c-435d-9109-6e3628d78524",
      "name": "BSI: extended security measures missing",
      "description": "The Policy checks, if the workload is associated with a apparmor profile.",
      "rationale": "SYS.1.6.A21 AppArmor can help you to run a more secure deployment by restricting what containers are allowed to do, and/or provide better auditing through system logs. However, it is important to keep in mind that AppArmor is not a silver bullet and can only do so much to protect against exploits in your application code. It is important to provide good, restrictive profiles, and harden your applications and cluster from other angles as well.",
      "remediation": "Ensure your workload has a profile associated. See: https://kubernetes.io/docs/tutorials/security/apparmor/",
      "disabled": true,
      "categories": [
        "Security Best Practices",
        "BSI"
      ],
      "lifecycleStages": [
        "DEPLOY"
      ],
      "eventSource": "NOT_APPLICABLE",
      "exclusions": [],
      "scope": [],
      "severity": "MEDIUM_SEVERITY",
      "enforcementActions": [],
      "notifiers": [],
      "lastUpdated": "2023-07-12T07:30:08.945908828Z",
      "SORTName": "",
      "SORTLifecycleStage": "",
      "SORTEnforcement": false,
      "policyVersion": "1.1",
      "policySections": [
        {
          "sectionName": "Require runtime Profile",
          "policyGroups": [
            {
              "fieldName": "AppArmor Profile",
              "booleanOperator": "OR",
              "negate": false,
              "values": [
                {
                  "value": "unconfined"
                }
              ]
            }
          ]
        }
      ],
      "mitreAttackVectors": [],
      "criteriaLocked": false,
      "mitreVectorsLocked": false,
      "isDefault": false
    },
    {
      "id": "1343aa73-0674-4993-8e75-0ad372854413",
      "name": "BSI: Seccomp missing",
      "description": "The Policy checks, if the workload is associated with the seccomp profile unconfined, which would not apply seccomp at all.",
      "rationale": "SYS.1.6.A21 Seccomp stands for secure computing mode and has been a feature of the Linux kernel since version 2.6.12. It can be used to sandbox the privileges of a process, restricting the calls it is able to make from userspace into the kernel. Kubernetes lets you automatically apply seccomp profiles loaded onto a node to your Pods and containers. (source: https://kubernetes.io/docs/tutorials/security/seccomp/)",
      "remediation": "Ensure your workload has a profile associated. See: https://kubernetes.io/docs/tutorials/security/seccomp/",
      "disabled": true,
      "categories": [
        "Docker CIS",
        "BSI"
      ],
      "lifecycleStages": [
        "DEPLOY"
      ],
      "severity": "MEDIUM_SEVERITY",
      "policyVersion": "1.1",
      "policySections": [
        {
          "sectionName": "Section 1",
          "policyGroups": [
            {
              "fieldName": "Seccomp Profile Type",
              "values": [
                {
                  "value": "UNCONFINED"
                }
              ]
            }
          ]
        }
      ],
      "criteriaLocked": true,
      "mitreVectorsLocked": true,
      "isDefault": false
    }
  ]
}