{
  "policies": [
    {
      "id": "784e0480-d160-4d71-97df-cf4df01d15e0",
      "name": "BSI: Local as Storage",
      "description": "The Policy checks, if the deployment mounts volumes of the type local",
      "rationale": "SYS.1.6.A19 Using local storage makes storage management harder and may allow attackers to overflow the local storage",
      "remediation": "Mount data from volumes which are not local.",
      "disabled": false,
      "categories": [
        "Security Best Practices",
        "BSI"
      ],
      "lifecycleStages": [
        "DEPLOY"
      ],
      "eventSource": "NOT_APPLICABLE",
      "exclusions": [
        {
          "name": "",
          "deployment": {
            "name": "",
            "scope": {
              "cluster": "",
              "namespace": "^kube.+|^openshift.+|stackrox",
              "label": null
            }
          },
          "image": null,
          "expiration": null
        }
      ],
      "scope": [],
      "severity": "MEDIUM_SEVERITY",
      "enforcementActions": [],
      "notifiers": [],
      "lastUpdated": "2023-01-03T12:09:23.016395845Z",
      "SORTName": "",
      "SORTLifecycleStage": "",
      "SORTEnforcement": false,
      "policyVersion": "1.1",
      "policySections": [
        {
          "sectionName": "Policy Section 1",
          "policyGroups": [
            {
              "fieldName": "Volume Type",
              "booleanOperator": "OR",
              "negate": false,
              "values": [
                {
                  "value": "local"
                }
              ]
            }
          ]
        }
      ],
      "mitreAttackVectors": [],
      "criteriaLocked": false,
      "mitreVectorsLocked": false,
      "isDefault": false
    }
  ]
}