{
  "policies": [
    {
      "id": "20dfc2c5-23a4-41de-9b65-f9a95d90038e",
      "name": "BSI: read write root filesystem",
      "description": "This Policy checks, if a Container has a read-write root filesystem",
      "rationale": "SYS.1.6.A23 Container SOLLTEN ihr Dateisystem w\u00e4hrend der Laufzeit nicht ver\u00e4ndern k\u00f6nnen. Dateisysteme SOLLTEN nicht mit Schreibrechten eingebunden sein",
      "remediation": "Ensure that each container has readOnlyRootFilesystem: true set",
      "disabled": true,
      "categories": [
        "Privileges",
        "Docker CIS",
        "BSI"
      ],
      "lifecycleStages": [
        "DEPLOY"
      ],
      "exclusions": [
        {
          "name": "Don't alert on kube-system namespace",
          "deployment": {
            "scope": {
              "namespace": "kube-system"
            }
          }
        },
        {
          "name": "Don't alert on istio-system namespace",
          "deployment": {
            "scope": {
              "namespace": "istio-system"
            }
          }
        },
        {
          "name": "Don't alert on openshift-node namespace",
          "deployment": {
            "scope": {
              "namespace": "openshift-node"
            }
          }
        },
        {
          "name": "Don't alert on openshift-sdn namespace",
          "deployment": {
            "scope": {
              "namespace": "openshift-sdn"
            }
          }
        }
      ],
      "severity": "MEDIUM_SEVERITY",
      "policyVersion": "1.1",
      "policySections": [
        {
          "policyGroups": [
            {
              "fieldName": "Read-Only Root Filesystem",
              "values": [
                {
                  "value": "false"
                }
              ]
            }
          ]
        }
      ],
      "criteriaLocked": true,
      "mitreVectorsLocked": true,
      "isDefault": false
    }
  ]
}