<?xml version="1.0" encoding="UTF-8"?>
<svg id="Ebene_2" data-name="Ebene 2" xmlns="http://www.w3.org/2000/svg" viewBox="0 0 24 24">
  <defs>
    <style>
      .cls-1 {
        fill: #fff;
      }
    </style>
  </defs>
  <polygon class="cls-1" points="10.35 13.43 9.88 12.96 8.01 14.83 7.28 14.09 6.8 14.56 8.01 15.77 10.35 13.43"/>
  <path class="cls-1" d="m9,1v3h-3v2.08H1.98v17h13V6.08h-7.98v-1.08h11v15h-3v1h4v-3h3V1h-13Zm1.21,9.08l.66,1.87,1.87.66-.86,1.79.86,1.79-1.87.66-.66,1.87-1.79-.86-1.79.86-.66-1.87-1.87-.66.86-1.79-.86-1.79,1.87-.66.66-1.87,1.79.86,1.79-.86Zm10.79,6.92h-2V4h-9v-2h11v15Z"/>
</svg>