<?xml version="1.0" encoding="UTF-8"?>
<svg id="Ebene_2" data-name="Ebene 2" xmlns="http://www.w3.org/2000/svg" viewBox="0 0 24 24">
  <defs>
    <style>
      .cls-1 {
        fill: #fff;
      }
    </style>
  </defs>
  <path class="cls-1" d="m7.99,6.81c-.15-.41-.25-.8-.76-.81H2.8c-.5.02-.6.4-.75.81-.24.65-1.05,7.19-1.05,7.19h8s-.77-6.54-1.01-7.19Z"/>
  <path class="cls-1" d="m5.06,5.11c.93,0,1.69-.75,1.69-1.69s-.75-1.69-1.69-1.69-1.69.75-1.69,1.69.75,1.69,1.69,1.69Z"/>
  <path class="cls-1" d="m21.99,6.81c-.15-.41-.25-.8-.76-.81h-4.43c-.5.02-.6.4-.75.81-.24.65-1.05,7.19-1.05,7.19h8s-.77-6.54-1.01-7.19Z"/>
  <path class="cls-1" d="m19.06,5.11c.93,0,1.69-.75,1.69-1.69s-.75-1.69-1.69-1.69-1.69.75-1.69,1.69.75,1.69,1.69,1.69Z"/>
  <path class="cls-1" d="m14.23,15h-4.43c-.5.02-.6.4-.75.81-.24.65-1.05,7.19-1.05,7.19h8s-.77-6.54-1.01-7.19c-.15-.41-.25-.8-.76-.81Z"/>
  <path class="cls-1" d="m12.06,14.11c.93,0,1.69-.75,1.69-1.69s-.75-1.69-1.69-1.69-1.69.75-1.69,1.69.75,1.69,1.69,1.69Z"/>
</svg>