<?xml version="1.0" encoding="UTF-8"?>
<svg id="Ebene_2" data-name="Ebene 2" xmlns="http://www.w3.org/2000/svg" viewBox="0 0 24 24">
  <defs>
    <style>
      .cls-1 {
        fill: #fff;
      }
    </style>
  </defs>
  <path class="cls-1" d="m19.22,17.11v-7.68c0-4-3.24-7.24-7.24-7.24s-7.24,3.24-7.24,7.24v7.68H2v4.92h19.9v-4.92h-2.67Zm-11.02-7.65h2.88v-3.07h1.81v3.07h2.88v1.81h-2.88v5.71h-1.81v-5.71h-2.88v-1.81Z"/>
</svg>