<?xml version="1.0" encoding="UTF-8"?>
<svg id="Ebene_2" data-name="Ebene 2" xmlns="http://www.w3.org/2000/svg" viewBox="0 0 24 24">
  <defs>
    <style>
      .cls-1 {
        fill: #fff;
      }
    </style>
  </defs>
  <path class="cls-1" d="m5.05,7.15c.97,0,1.75-.78,1.75-1.75s-.78-1.75-1.75-1.75-1.75.78-1.75,1.75.78,1.75,1.75,1.75Z"/>
  <path class="cls-1" d="m4.56,2.95l-.43-1.18-.7.26.43,1.19c.22-.12.45-.22.7-.27Z"/>
  <path class="cls-1" d="m3.11,3.85l-1.09-.63-.38.65,1.09.63c.09-.24.22-.45.38-.65Z"/>
  <path class="cls-1" d="m2.56,5.46l-1.24.22.13.74,1.25-.22c-.08-.23-.13-.48-.14-.74Z"/>
  <path class="cls-1" d="m3.75,7.53c-.22-.13-.41-.29-.57-.48l-.81.97.58.48.81-.97Z"/>
  <path class="cls-1" d="m4.68,7.87v1.26h.75v-1.26c-.12.02-.25.04-.38.04s-.25-.02-.38-.04Z"/>
  <path class="cls-1" d="m7.16,8.5l.58-.48-.81-.97c-.17.19-.36.35-.57.48l.81.97Z"/>
  <path class="cls-1" d="m7.41,6.2l1.25.22.13-.74-1.24-.22c0,.26-.06.5-.14.74Z"/>
  <path class="cls-1" d="m8.46,3.87l-.38-.65-1.09.63c.16.2.29.41.38.65l1.09-.63Z"/>
  <path class="cls-1" d="m6.68,2.03l-.7-.26-.43,1.18c.25.05.48.15.7.27l.43-1.19Z"/>
  <path class="cls-1" d="m17.07,8.09c1.19-.12,2.05-1.17,1.94-2.35-.12-1.18-1.17-2.05-2.35-1.94-1.18.12-2.05,1.17-1.94,2.35.12,1.18,1.17,2.05,2.35,1.94Z"/>
  <path class="cls-1" d="m20.06,5.29l-.44,1.19,1.4,1.2-3.37,1.55c-.34-.4-.8-.7-1.34-.84-.53-.14-1.07-.1-1.55.08l-2.57-3.1,2.03-.22-.05-1-3.5.16-.39.71,3.01,4.77c-.07.15-.13.31-.18.48l-1.25,4.85-3.9-1.87-.17,1.67-5.14,4.47,1.31,1.51,3.53-3.08-.48,4.81,1.99.2.57-5.74,2.18,2.06h0s.01.01.01.01h0s0,0,0,0l3.89.16c.49.02.91-.33.99-.81l.38-2.49,1.14-4.44c.05-.18.07-.37.08-.55h0s4.28-2.5,4.28-2.5l.22-.8-2.71-2.45Z"/>
</svg>