<?xml version="1.0" encoding="UTF-8"?>
<svg id="Ebene_2" data-name="Ebene 2" xmlns="http://www.w3.org/2000/svg" viewBox="0 0 24 24">
  <defs>
    <style>
      .cls-1 {
        fill: #fff;
      }
    </style>
  </defs>
  <rect class="cls-1" x="17" y="9.19" width="6" height="13.89"/>
  <rect class="cls-1" x="1" y="12.14" width="6" height="10.94"/>
  <rect class="cls-1" x="9" y="14.97" width="6" height="8.11"/>
  <path class="cls-1" d="m22.9,1.12h-2.83c-.09,0-.13.11-.07.17l1.12,1.12-9.17,7.72-7.53-4.64c-.17-.1-.38-.1-.54,0L.76,7.58l.55.83,2.86-1.91,7.56,4.67c.08.05.17.07.26.07.12,0,.23-.04.32-.12L21.83,3.12l.99.99c.06.06.17.02.17-.07V1.22c0-.06-.04-.1-.1-.1Z"/>
</svg>