<?xml version="1.0" encoding="UTF-8"?>
<svg id="Ebene_2" data-name="Ebene 2" xmlns="http://www.w3.org/2000/svg" viewBox="0 0 24 24">
  <defs>
    <style>
      .cls-1 {
        fill: #fff;
      }
    </style>
  </defs>
  <path class="cls-1" d="m20.28,18.03h-7.01c-1.38,0-2.51,1.12-2.51,2.51s1.12,2.51,2.51,2.51h7.01c1.38,0,2.51-1.12,2.51-2.51s-1.12-2.51-2.51-2.51Z"/>
  <path class="cls-1" d="m14.35,9.08l-3.71,3.71,3.42,3.42,1.41-1.41-2-2,1.71-1.71h3.4s1.71,1.69,1.71,1.69l-2,2,1.41,1.41,3.42-3.42-3.71-3.71h-1.88s0-6.93,0-6.93h-5.9c-.52-.77-1.47-1.19-2.43-.97-1.25.28-2.03,1.52-1.75,2.77.02.07.04.13.06.19l-2.89,3.09s-.02,0-.03,0c-1.25.28-2.03,1.52-1.75,2.77.12.51.4.94.78,1.26v4.77h-1.5v2.94h6.11v-2.94h-1.64v-4.77c.64-.54.98-1.41.78-2.28,0,0,0,0,0-.01l2.25-3.23c.2,0,.41,0,.62-.05,1.18-.27,1.93-1.38,1.78-2.56h4.53v5.94h-2.17Z"/>
</svg>