<?xml version="1.0" encoding="UTF-8"?>
<svg id="Ebene_2" data-name="Ebene 2" xmlns="http://www.w3.org/2000/svg" viewBox="0 0 24 24">
  <defs>
    <style>
      .cls-1 {
        fill: #fff;
      }
    </style>
  </defs>
  <path class="cls-1" d="m15.42,13.41l-2.41-1.85c-.12-.09-.33-.25-.47-.33l-.65.48c-.2.16-1.61,1.22-3,1.36-.04,0-.09,0-.13,0-.26,0-.69-.06-1.42-.59-.24-.18-.42-.44-.48-.73-.07-.4.07-.79.36-1.05l2.91-2.96s-.13-.13-.33-.14l-1.45-.04c-.08,0-.16-.04-.23-.06l-3.27-2.37L.88,10.52l3.27,1.95c.16.16.29.36.33.59l.26,1.59c.04.22.15.41.32.55l1.5,1.41,2.75,2.65c.38.36.86.44,1.26.07l.18-.15c.41-.35.09-1.01,0-1.33l.49.49c.38.36.98.35,1.34-.02l.17-.17c.36-.38.27-.93,0-1.31l-.18-.28.2.18.45.44c.38.36.98.35,1.34-.02l.17-.17c.35-.42-.23-1.24-.42-1.59l.81.71c.38.36.98.35,1.34-.02l.17-.17c.36-.38.35-.98-.02-1.34l-1.18-1.14Z"/>
  <path class="cls-1" d="m18.56,4.4l-3.19,2.74-2.2-.22c-.17-.02-.33.04-.46.15l-4.57,4.1c-.1.09-.1.25.02.34.25.19.68.46.94.43,1.18-.12,2.53-1.18,2.53-1.18l.83-.62c.46-.28,1.03.19,1.46.52l3.54,2.72s.02,0,.03,0l.13.12,4.96-4.54-4.02-4.56Z"/>
</svg>