<svg width="24" height="24" viewBox="0 0 24 24" fill="none" xmlns="http://www.w3.org/2000/svg">
<path d="M8.34707 10.1671C8.32169 10.1191 8.21134 10.0198 8.21134 10.0198C8.21134 10.0198 8.46522 10.0298 8.52733 10.2455C8.5386 10.2379 8.54976 10.2303 8.56084 10.2227C8.5596 10.1994 8.55181 10.0678 8.53389 10.025C8.51279 9.97463 8.41123 9.86485 8.41123 9.86485C8.41123 9.86485 8.67703 9.89954 8.71035 10.1357C8.73083 10.1253 8.75032 10.1158 8.76862 10.1077C8.76838 10.1077 8.76785 10.1072 8.76785 10.1072C8.76785 10.1072 8.7565 9.95086 8.73539 9.90381C8.71282 9.85344 8.60732 9.74461 8.60732 9.74461C8.60732 9.74461 8.9053 9.77645 8.92046 10.0502C8.9215 10.0497 8.9226 10.0497 8.9226 10.0497C8.9226 10.0497 9.04003 10.1015 9.25042 10.4375C9.37665 10.639 9.63309 11.1071 9.77405 11.1243C10.1215 11.1661 10.9815 10.5844 11.5206 10.3601L11.7882 10.2384L11.7913 10.082L11.5806 10.1552C11.5806 10.1552 11.5587 9.60394 11.6383 9.36536C11.9175 8.52798 12.6367 8.23332 12.8814 8.07934C13.2723 7.83411 13.2569 7.64354 13.2569 7.64354C13.2569 7.64354 12.8187 7.67443 12.5404 7.6022C12.4006 7.56608 12.4028 7.3717 12.4028 7.3717L12.4768 7.36884C12.4737 7.33035 12.4716 7.28853 12.4753 7.26952C12.4903 7.19253 12.5284 7.11601 12.5761 7.11458C12.6105 7.11316 12.655 7.19823 12.6793 7.23435C12.6977 7.26144 12.6948 7.31942 12.6897 7.36029L12.7005 7.35982C12.7045 7.31562 12.71 7.26191 12.7143 7.24528C12.7293 7.18682 12.7973 7.14025 12.8531 7.1393C12.8935 7.13835 12.9784 7.15308 12.9996 7.20963C13.003 7.21866 13.0054 7.2315 13.0071 7.24576C13.0251 7.17257 13.1116 7.11459 13.1574 7.11316C13.1918 7.11221 13.2766 7.13835 13.2948 7.21297C13.3015 7.24101 13.3003 7.29281 13.2976 7.33606L13.4027 7.33178C13.4027 7.33178 13.4127 7.21154 13.3976 7.06659C13.3441 7.0433 13.2536 7.00718 13.1761 6.99435C13.1034 6.98247 12.3774 6.97439 12.3774 6.97439C12.0219 6.93827 11.767 6.75768 11.767 6.4098C11.767 6.4098 11.7742 6.32948 11.8186 6.32948C11.8709 6.32948 11.8899 6.38271 11.8893 6.40933C11.887 6.50913 11.8383 6.59181 12.1121 6.74152C12.3107 6.84987 12.7681 6.84798 13.0872 6.85606C13.2329 6.85986 13.3206 6.88647 13.3717 6.91166C13.3478 6.81281 13.3082 6.71728 13.2427 6.65217C13.2212 6.63031 13.1968 6.6113 13.1714 6.59277C13.143 6.65978 13.0141 6.69162 12.9814 6.69019C12.9338 6.68877 12.8758 6.62794 12.863 6.55047C12.8603 6.53384 12.8569 6.48916 12.8539 6.44307C12.8511 6.44259 12.8483 6.44164 12.8456 6.44069C12.8444 6.48061 12.8419 6.52338 12.8362 6.54666C12.8181 6.62128 12.7456 6.64076 12.7112 6.63934C12.6636 6.63791 12.6056 6.57709 12.5928 6.49962C12.5895 6.47919 12.5853 6.41882 12.5819 6.36369C12.5691 6.36037 12.5562 6.35657 12.5437 6.35324C12.5456 6.38556 12.544 6.42596 12.5278 6.44972C12.5035 6.48584 12.4406 6.61415 12.4062 6.6132C12.3585 6.6113 12.3028 6.52719 12.2878 6.44972C12.2818 6.41931 12.2732 6.29717 12.2695 6.24299C11.9648 6.03816 12.0229 5.57193 12.0229 5.57193H12.8752C12.8752 5.57193 13.2448 5.25922 13.7626 5.21217C14.6425 5.13233 15.0024 5.37233 15.0024 5.37233C15.0024 5.37233 15.3469 5.14849 15.6023 5.37233C15.9223 5.65225 15.5624 6.05193 15.5624 6.05193C15.5624 6.05193 15.7223 6.72774 15.7223 6.9321C15.7223 7.25194 15.5663 7.7134 15.4622 7.98572C15.4076 8.12829 15.3993 8.28465 15.4369 8.43292C15.4988 8.67625 15.6167 9.00845 15.5217 9.50604C15.413 10.0754 15.0878 10.5768 15.1124 10.9014C15.1424 11.2977 15.374 11.8633 15.4764 12.6574C15.5029 12.8632 15.5544 13.1897 15.6079 13.3679C15.7623 13.8816 15.9723 14.191 15.9723 14.191L15.9855 14.5612L15.7979 14.5551C15.7979 14.5551 15.8497 16.1552 15.9514 16.677C15.9725 16.7854 16.0914 17.0677 16.0914 17.0677L16.0886 17.3738C16.0886 17.3738 15.4817 18.1361 15.2224 18.3385C14.5901 18.8328 14.213 18.7301 14.213 18.7301C14.213 18.7301 14.2076 18.7268 14.1992 18.7201C14.1644 18.7158 14.0513 18.704 14.0103 18.713C13.9581 18.7249 13.8348 18.8043 13.8348 18.8043C13.8348 18.8043 13.8954 18.6104 14.0683 18.569C14.0567 18.5505 14.0451 18.5305 14.034 18.5082C13.9865 18.502 13.9154 18.4944 13.8846 18.5001C13.8329 18.5101 13.7089 18.5837 13.7089 18.5837C13.7089 18.5837 13.7829 18.3746 13.9759 18.3566C13.9693 18.3323 13.9636 18.3071 13.9586 18.2805C13.9097 18.2739 13.8384 18.2653 13.8072 18.2705C13.7538 18.28 13.6252 18.3547 13.6252 18.3547C13.6252 18.3547 13.7132 18.1161 13.9379 18.1237C13.9349 18.0933 13.9326 18.0648 13.9308 18.0381C13.8843 18.0315 13.8278 18.0253 13.8008 18.0296C13.7469 18.0386 13.6167 18.1123 13.6167 18.1123C13.6167 18.1123 13.7059 17.878 13.9264 17.8827C13.9269 17.8604 13.9277 17.8395 13.929 17.821C13.8814 17.8119 13.7922 17.7972 13.7556 17.8024C13.7009 17.81 13.5676 17.8818 13.5676 17.8818C13.5676 17.8818 13.683 17.5957 13.9586 17.667C13.9685 17.6427 13.9768 17.6347 13.9768 17.6347L14.4522 17.5776C14.6246 17.5567 14.7164 17.3913 14.6236 17.2445C14.6236 17.2445 13.8759 16.6039 13.636 16.1505C13.1378 15.2095 13.2125 14.2252 13.2125 14.2252L13.0189 14.2276C13.0189 14.2276 13.0431 14.8226 13.0742 15.0184C13.0984 15.1705 13.2235 15.6158 13.2235 15.6158C13.2235 15.6158 12.2669 15.9751 11.7956 17.0525C11.5541 17.6043 11.6744 18.1788 11.2272 18.2444C10.8964 18.2929 10.5822 18.0833 10.1381 17.8937C9.93121 17.8053 9.677 17.7573 9.50582 17.6974C9.30047 17.6256 9.20095 17.5734 9.20095 17.5734C9.20095 17.5734 9.20009 17.5696 9.19886 17.5629C9.1981 17.5639 9.19767 17.5643 9.19767 17.5643C9.19767 17.5643 9.06431 17.4916 9.01498 17.484C8.96214 17.4759 8.81847 17.5049 8.81847 17.5049C8.81847 17.5049 8.97193 17.3143 9.17538 17.3847C9.17381 17.3647 9.17267 17.3433 9.17177 17.322C9.13555 17.3029 9.04597 17.2568 9.00762 17.2511C8.95563 17.2431 8.81419 17.2716 8.81419 17.2716C8.81419 17.2716 8.96979 17.0791 9.17452 17.1566C9.17533 17.1466 9.17642 17.1366 9.17757 17.1266C9.14021 17.1048 9.05272 17.0544 9.01422 17.0463C8.96114 17.0354 8.81419 17.0577 8.81419 17.0577C8.81419 17.0577 8.99445 16.8553 9.20926 16.966C9.21668 16.9389 9.22443 16.9132 9.23246 16.8885C9.19173 16.86 9.13166 16.8206 9.10119 16.8111C9.04896 16.7954 8.89964 16.8039 8.89964 16.8039C8.89964 16.8039 9.08874 16.6276 9.2883 16.7398C9.29567 16.7227 9.30294 16.7065 9.31006 16.6913C9.27684 16.6661 9.18964 16.602 9.15038 16.5891C9.09782 16.5725 8.94655 16.5782 8.94655 16.5782C8.94655 16.5782 9.17191 16.3757 9.38629 16.5525C9.39271 16.5425 9.39656 16.5373 9.39656 16.5373C9.39656 16.5373 9.5973 16.5083 9.83654 16.6276C10.0381 16.7284 10.1182 16.8862 10.3249 16.9765C10.3974 17.0083 10.5833 17.0311 10.5807 16.8885C10.5807 16.8885 10.4533 15.9366 10.5631 15.4105C10.6469 15.0094 10.6831 14.6007 11.383 13.9909C11.5476 13.8474 12.1255 13.4615 12.4293 13.3969L12.7328 13.6711L12.8507 13.5941C12.8507 13.5941 12.3828 13.1911 12.2528 12.9511C11.9929 12.4711 11.9807 12.1517 11.9807 12.1517L12.3329 12.0377L12.3228 11.8713L12.315 11.8566C11.703 12.1323 10.2723 12.4036 9.60367 12.2259C9.04245 12.0766 8.52401 11.5021 8.41071 11.3604C8.22717 11.1314 8.0922 10.869 8.0922 10.869C8.0922 10.869 8.09205 10.8382 8.10474 10.7868C8.10374 10.7868 8.10317 10.7864 8.10317 10.7864C8.10317 10.7864 8.07456 10.6371 8.049 10.5944C8.02157 10.5487 7.90789 10.4561 7.90789 10.4561C7.90789 10.4561 8.09372 10.4542 8.19143 10.5872C8.20321 10.5682 8.21685 10.5483 8.23159 10.5283C8.22455 10.4936 8.2015 10.3852 8.1805 10.3501C8.1535 10.3049 8.04158 10.2142 8.04158 10.2142C8.04158 10.2142 8.26832 10.2113 8.34969 10.3924C8.36242 10.3795 8.37654 10.3672 8.3906 10.3544C8.38552 10.3201 8.36717 10.2051 8.34707 10.1671ZM8.52025 6.64409C8.50775 6.59561 8.43029 6.48299 8.43029 6.48299C8.43029 6.48299 8.60062 6.53146 8.65128 6.67926C8.65555 6.67688 8.65983 6.67403 8.66406 6.67166C8.66734 6.62841 8.672 6.5462 8.66359 6.51388C8.65109 6.46588 8.57357 6.35324 8.57357 6.35324C8.57357 6.35324 8.78943 6.4136 8.80749 6.6094C8.82498 6.6037 8.84218 6.59847 8.8591 6.59419C8.86186 6.54904 8.8639 6.48773 8.85692 6.46112C8.84442 6.41264 8.7669 6.30049 8.7669 6.30049C8.7669 6.30049 8.99003 6.36322 9.00125 6.5671C9.01441 6.56568 9.0271 6.56473 9.03927 6.56378C9.04221 6.51863 9.04478 6.45257 9.03746 6.42453C9.02496 6.37605 8.94745 6.26389 8.94745 6.26389C8.94745 6.26389 9.1961 6.33328 9.18184 6.56567C9.19125 6.56662 9.19658 6.56758 9.19658 6.56758C9.19658 6.56758 9.31391 6.61938 9.52431 6.95538C9.65053 7.15688 9.65985 7.52235 9.76483 7.70627C9.85313 7.8612 10.0618 8.00663 10.4196 8.1321C11.0717 8.35974 11.9513 8.57217 11.9513 8.57217C11.9513 8.57217 11.5488 8.9039 11.4526 9.42572C11.4184 9.61154 11.4137 10.2446 11.4137 10.2446C11.4137 10.2446 10.194 9.57447 9.43924 8.91626C9.04483 8.57218 8.96009 8.32552 8.91761 8.27229C8.82584 8.15776 8.76239 7.81177 8.6623 7.53993C8.56222 7.26809 8.40391 6.98437 8.40391 6.98437C8.40391 6.98437 8.4013 6.97914 8.39987 6.96916C8.38899 6.96583 8.38176 6.96346 8.38176 6.96346C8.38176 6.96346 8.39531 6.82231 8.38362 6.77716C8.37112 6.72916 8.29361 6.61653 8.29361 6.61653C8.29361 6.61653 8.4424 6.65835 8.50333 6.78477C8.50965 6.77907 8.51597 6.77336 8.52301 6.76765C8.52543 6.72393 8.52676 6.6688 8.52025 6.64409ZM-0.000366211 12.0001C-0.000366211 14.739 0.917908 17.263 2.46246 19.2823H21.5368C23.0814 17.263 23.9996 14.739 23.9996 12.0001C23.9996 9.2608 23.0814 6.73677 21.5368 4.71744H2.46246C0.917908 6.73677 -0.000366211 9.2608 -0.000366211 12.0001Z" fill="#FBFCFC"/>
<path d="M11.9996 0.000215348C8.1111 0.000215348 4.65524 1.84989 2.4624 4.71753H21.5367C19.3439 1.84989 15.888 0.000215348 11.9996 0.000215348Z" fill="#E42B23"/>
<path d="M11.9996 24.0001C15.888 24.0001 19.3439 22.15 21.5367 19.2823H2.4624C4.65524 22.15 8.1111 24.0001 11.9996 24.0001Z" fill="#E42B23"/>
<path d="M9.18166 6.56567C9.19591 6.33328 8.94727 6.26389 8.94727 6.26389C8.94727 6.26389 9.02478 6.37605 9.03728 6.42453C9.0446 6.45257 9.04203 6.51863 9.03908 6.56378C9.10681 6.5595 9.15799 6.5633 9.18166 6.56567Z" fill="#E42B23"/>
<path d="M8.76685 6.30042C8.76685 6.30042 8.84436 6.41257 8.85686 6.46105C8.86385 6.48766 8.8618 6.54897 8.85905 6.59412C8.91009 6.58033 8.95809 6.57178 9.00119 6.56703C8.98997 6.36315 8.76685 6.30042 8.76685 6.30042Z" fill="#E42B23"/>
<path d="M8.573 6.35334C8.573 6.35334 8.65051 6.46597 8.66301 6.51397C8.67142 6.54629 8.66676 6.62851 8.66349 6.67175C8.71201 6.64514 8.76024 6.62518 8.80691 6.6095C8.78885 6.4137 8.573 6.35334 8.573 6.35334Z" fill="#E42B23"/>
<path d="M8.61063 6.7039C8.62423 6.69487 8.63782 6.68726 8.65141 6.67918C8.60075 6.53138 8.43042 6.48291 8.43042 6.48291C8.43042 6.48291 8.50788 6.59554 8.52038 6.64401C8.52689 6.66873 8.52556 6.72386 8.52314 6.76758C8.54747 6.74714 8.57618 6.72576 8.61063 6.7039Z" fill="#E42B23"/>
<path d="M8.50318 6.78473C8.44226 6.65831 8.29346 6.61649 8.29346 6.61649C8.29346 6.61649 8.37097 6.72911 8.38347 6.77711C8.39516 6.82226 8.38162 6.96342 8.38162 6.96342C8.38162 6.96342 8.38884 6.96579 8.39972 6.96912C8.39568 6.9406 8.40186 6.8755 8.50318 6.78473Z" fill="#E42B23"/>
<path d="M8.60754 9.74458C8.60754 9.74458 8.71305 9.85341 8.73562 9.90378C8.75672 9.95083 8.76808 10.1072 8.76808 10.1072C8.76808 10.1072 8.76861 10.1077 8.76884 10.1077C8.85272 10.0696 8.91066 10.053 8.92068 10.0502C8.90552 9.77642 8.60754 9.74458 8.60754 9.74458Z" fill="#E42B23"/>
<path d="M8.4115 9.86492C8.4115 9.86492 8.51306 9.9747 8.53416 10.0251C8.55208 10.0678 8.55987 10.1995 8.56111 10.2228C8.61419 10.1876 8.66481 10.1591 8.71062 10.1358C8.6773 9.89962 8.4115 9.86492 8.4115 9.86492Z" fill="#E42B23"/>
<path d="M8.52699 10.2455C8.46488 10.0298 8.211 10.0198 8.211 10.0198C8.211 10.0198 8.32135 10.1191 8.34673 10.1671C8.36683 10.2051 8.38518 10.3202 8.39026 10.3544C8.39525 10.3501 8.39967 10.3453 8.40485 10.3411C8.44587 10.3054 8.48688 10.2741 8.52699 10.2455Z" fill="#E42B23"/>
<path d="M8.34979 10.3924C8.26843 10.2113 8.04169 10.2142 8.04169 10.2142C8.04169 10.2142 8.15361 10.305 8.1806 10.3501C8.20161 10.3853 8.22466 10.4936 8.23169 10.5283C8.26344 10.4846 8.30189 10.439 8.34979 10.3924Z" fill="#E42B23"/>
<path d="M7.90802 10.4561C7.90802 10.4561 8.0217 10.5488 8.04912 10.5944C8.07469 10.6372 8.1033 10.7864 8.1033 10.7864C8.1033 10.7864 8.10387 10.7869 8.10487 10.7869C8.11727 10.737 8.14184 10.6676 8.19155 10.5873C8.09384 10.4542 7.90802 10.4561 7.90802 10.4561Z" fill="#E42B23"/>
<path d="M8.94617 16.5782C8.94617 16.5782 9.09744 16.5725 9.15 16.5891C9.18926 16.6019 9.27646 16.6661 9.30968 16.6913C9.34262 16.6219 9.37137 16.5748 9.38591 16.5525C9.17153 16.3757 8.94617 16.5782 8.94617 16.5782Z" fill="#E42B23"/>
<path d="M8.89935 16.804C8.89935 16.804 9.04868 16.7954 9.10091 16.8111C9.13137 16.8206 9.19144 16.86 9.23217 16.8885C9.25023 16.8329 9.26938 16.783 9.28801 16.7398C9.08846 16.6276 8.89935 16.804 8.89935 16.804Z" fill="#E42B23"/>
<path d="M9.20867 16.9661C8.99386 16.8553 8.8136 17.0578 8.8136 17.0578C8.8136 17.0578 8.96054 17.0355 9.01363 17.0464C9.05212 17.0545 9.13962 17.1048 9.17697 17.1267C9.18111 17.0892 9.1871 17.0511 9.19598 17.0146C9.20007 16.9979 9.20435 16.9818 9.20867 16.9661Z" fill="#E42B23"/>
<path d="M9.17393 17.1566C8.96919 17.0792 8.8136 17.2716 8.8136 17.2716C8.8136 17.2716 8.95503 17.2431 9.00703 17.2512C9.04538 17.2569 9.13496 17.303 9.17118 17.322C9.16904 17.2697 9.16923 17.2137 9.17393 17.1566Z" fill="#E42B23"/>
<path d="M8.81805 17.5049C8.81805 17.5049 8.96172 17.4759 9.01457 17.484C9.0639 17.4916 9.19725 17.5643 9.19725 17.5643C9.19725 17.5643 9.19768 17.5639 9.19844 17.5629C9.19379 17.5387 9.18186 17.4721 9.17497 17.3847C8.97151 17.3143 8.81805 17.5049 8.81805 17.5049Z" fill="#E42B23"/>
<path d="M13.5676 17.8817C13.5676 17.8817 13.7009 17.8099 13.7555 17.8023C13.7921 17.7971 13.8813 17.8118 13.9289 17.8209C13.9347 17.741 13.9475 17.694 13.9585 17.6669C13.683 17.5956 13.5676 17.8817 13.5676 17.8817Z" fill="#E42B23"/>
<path d="M13.9263 17.8828C13.7058 17.878 13.6166 18.1123 13.6166 18.1123C13.6166 18.1123 13.7468 18.0386 13.8007 18.0296C13.8277 18.0253 13.8842 18.0315 13.9307 18.0382C13.9267 17.9783 13.9255 17.9265 13.9263 17.8828Z" fill="#E42B23"/>
<path d="M13.9382 18.1238C13.7135 18.1162 13.6255 18.3547 13.6255 18.3547C13.6255 18.3547 13.7541 18.2801 13.8075 18.2706C13.8387 18.2654 13.91 18.2739 13.9589 18.2806C13.9555 18.263 13.9523 18.2445 13.9497 18.2255C13.945 18.1893 13.9413 18.1556 13.9382 18.1238Z" fill="#E42B23"/>
<path d="M13.709 18.5837C13.709 18.5837 13.833 18.5101 13.8847 18.5001C13.9155 18.4944 13.9866 18.502 14.0342 18.5082C14.0123 18.4649 13.9921 18.4145 13.9761 18.3566C13.783 18.3746 13.709 18.5837 13.709 18.5837Z" fill="#E42B23"/>
<path d="M14.0683 18.569C13.8955 18.6103 13.8349 18.8042 13.8349 18.8042C13.8349 18.8042 13.9582 18.7248 14.0103 18.7129C14.0513 18.7039 14.1645 18.7158 14.1992 18.7201C14.1747 18.7006 14.1209 18.6526 14.0683 18.569Z" fill="#E42B23"/>
<path d="M13.0879 6.85612C12.7687 6.84804 12.3114 6.84994 12.1127 6.74158C11.8389 6.59188 11.8876 6.50919 11.8899 6.40939C11.8905 6.38277 11.8716 6.32954 11.8192 6.32954C11.7748 6.32954 11.7676 6.40986 11.7676 6.40986C11.7676 6.75774 12.0225 6.93833 12.378 6.97445C12.378 6.97445 13.1041 6.98254 13.1767 6.99442C13.2542 7.00725 13.3447 7.04336 13.3982 7.06665C13.3931 7.01675 13.3848 6.96352 13.3723 6.91172C13.3212 6.88653 13.2336 6.85992 13.0879 6.85612Z" fill="#E42B23"/>
<path d="M12.2688 6.24307C12.2725 6.29724 12.2811 6.41938 12.2871 6.4498C12.3021 6.52726 12.3578 6.61138 12.4054 6.61328C12.4398 6.61423 12.5028 6.48592 12.527 6.4498C12.5433 6.42604 12.5449 6.38564 12.543 6.35332C12.4393 6.32338 12.3469 6.29248 12.2821 6.25209C12.2775 6.24924 12.2733 6.24592 12.2688 6.24307Z" fill="white"/>
<path d="M12.5927 6.49974C12.6055 6.5772 12.6634 6.63803 12.7111 6.63945C12.7455 6.64088 12.8179 6.6214 12.836 6.54678C12.8418 6.52349 12.8443 6.48073 12.8455 6.44081C12.7567 6.41182 12.6664 6.38757 12.5818 6.36381C12.5852 6.41894 12.5893 6.4793 12.5927 6.49974Z" fill="white"/>
<path d="M12.8627 6.55042C12.8755 6.62788 12.9335 6.68871 12.9811 6.69014C13.0138 6.69157 13.1427 6.65972 13.171 6.59271C13.0809 6.52761 12.9694 6.48103 12.8536 6.44301C12.8566 6.48911 12.8599 6.53378 12.8627 6.55042Z" fill="white"/>
<path d="M13.0051 7.25447C13.0055 7.25162 13.0069 7.24878 13.0076 7.24593C13.0059 7.23167 13.0035 7.21883 13.0002 7.2098C12.9789 7.15325 12.894 7.13852 12.8536 7.13947C12.7978 7.14042 12.7298 7.18699 12.7148 7.24544C12.7105 7.26208 12.705 7.31579 12.701 7.35999L12.9968 7.3481C12.9996 7.30723 13.0026 7.26968 13.0051 7.25447Z" fill="white"/>
<path d="M12.9962 7.3479L13.2975 7.33602C13.3001 7.29277 13.3014 7.24097 13.2946 7.21293C13.2765 7.13831 13.1916 7.11218 13.1572 7.11313C13.1114 7.11455 13.025 7.17253 13.0069 7.24572C13.0062 7.24857 13.0049 7.25142 13.0044 7.25427C13.0019 7.26948 12.9989 7.30703 12.9962 7.3479Z" fill="white"/>
<path d="M12.6797 7.23441C12.6554 7.19829 12.6109 7.11321 12.5765 7.11464C12.5288 7.11606 12.4907 7.19259 12.4757 7.26958C12.472 7.28859 12.4741 7.3304 12.4772 7.3689L12.6901 7.36035C12.6952 7.31948 12.6981 7.2615 12.6797 7.23441Z" fill="white"/>
<path d="M8.23125 10.5284C8.21652 10.5484 8.20288 10.5683 8.19109 10.5873C8.14138 10.6677 8.11681 10.737 8.10441 10.787C8.09172 10.8383 8.09186 10.8692 8.09186 10.8692C8.09186 10.8692 8.22683 11.1315 8.41037 11.3606C8.52367 11.5022 9.04212 12.0768 9.60334 12.226C10.272 12.4037 11.7026 12.1324 12.3146 11.8567L11.5202 10.3602C10.9811 10.5845 10.1211 11.1662 9.77371 11.1244C9.63275 11.1073 9.37631 10.6391 9.25008 10.4376C9.03969 10.1016 8.92226 10.0498 8.92226 10.0498C8.92226 10.0498 8.92116 10.0498 8.92012 10.0503C8.91009 10.0532 8.85216 10.0698 8.76828 10.1078C8.74998 10.1159 8.73049 10.1254 8.71001 10.1359C8.6642 10.1591 8.61358 10.1877 8.5605 10.2228C8.54943 10.2304 8.53826 10.238 8.52699 10.2456C8.48688 10.2742 8.44587 10.3055 8.40486 10.3412C8.39968 10.3454 8.39526 10.3502 8.39027 10.3545C8.3762 10.3673 8.36208 10.3797 8.34935 10.3925C8.30144 10.4391 8.26299 10.4847 8.23125 10.5284Z" fill="#100F0D"/>
<path d="M8.52324 6.76759C8.51621 6.77329 8.50988 6.779 8.50356 6.78471C8.40224 6.87548 8.39606 6.94058 8.4001 6.9691C8.40153 6.97908 8.40414 6.98431 8.40414 6.98431C8.40414 6.98431 8.56245 7.26802 8.66253 7.53987C8.76262 7.81171 8.82607 8.1577 8.91784 8.27223C8.96033 8.32546 9.04506 8.57211 9.43947 8.91619C10.1942 9.57441 11.4139 10.2445 11.4139 10.2445C11.4139 10.2445 11.4186 9.61147 11.4529 9.42565C11.549 8.90383 11.9515 8.57211 11.9515 8.57211C11.9515 8.57211 11.0719 8.35968 10.4199 8.13203C10.062 8.00657 9.85336 7.86113 9.76506 7.7062C9.66008 7.52228 9.65076 7.15682 9.52454 6.95531C9.31415 6.61931 9.19681 6.56751 9.19681 6.56751C9.19681 6.56751 9.19148 6.56656 9.18207 6.56561C9.15841 6.56323 9.10722 6.55944 9.0395 6.56372C9.02733 6.56467 9.01464 6.56561 9.00148 6.56704C8.95838 6.57179 8.91038 6.58034 8.85934 6.59412C8.84242 6.5984 8.82521 6.60363 8.80772 6.60934C8.76105 6.62502 8.71282 6.64498 8.66429 6.67159C8.66006 6.67397 8.65579 6.67682 8.65151 6.67919C8.63792 6.68727 8.62433 6.69488 8.61073 6.70391C8.57628 6.72577 8.54757 6.74715 8.52324 6.76759Z" fill="#100F0D"/>
<path d="M13.2041 6.08384C13.2041 6.08384 13.2041 5.82102 13.3452 5.69983C13.3952 5.65706 13.4915 5.64471 13.5633 5.68748C13.6762 5.75544 14.005 6.08098 13.9944 6.15702C13.9929 6.16747 13.8138 6.15417 13.8138 6.15417C13.8138 6.15417 13.5993 5.83813 13.4637 5.83813C13.3368 5.83813 13.3394 6.08146 13.3394 6.08146L13.2041 6.08384ZM15.1573 5.48835C15.1573 5.48835 15.2787 5.40042 15.334 5.46316C15.4003 5.53872 15.3449 5.58245 15.2645 5.65184C15.1507 5.75069 15.0049 5.87473 15.0049 5.87473L14.8637 5.72265L15.1573 5.48835ZM12.3224 11.8714L12.3325 12.0377L11.9803 12.1518C11.9803 12.1518 11.9925 12.4712 12.2524 12.9512C12.3824 13.1912 12.8502 13.5942 12.8502 13.5942L12.7323 13.6712L12.4288 13.3969C12.1251 13.4616 11.5472 13.8475 11.3825 13.991C10.6826 14.6007 10.6465 15.0095 10.5626 15.4106C10.4529 15.9367 10.5803 16.8886 10.5803 16.8886C10.5828 17.0312 10.397 17.0084 10.3245 16.9765C10.1178 16.8862 10.0377 16.7284 9.83613 16.6277C9.59689 16.5084 9.39615 16.5374 9.39615 16.5374C9.39615 16.5374 9.3923 16.5426 9.38588 16.5526C9.37134 16.5749 9.34258 16.622 9.30965 16.6914C9.30252 16.7066 9.29525 16.7227 9.28789 16.7398C9.26926 16.7831 9.2501 16.833 9.23204 16.8886C9.22401 16.9133 9.21626 16.939 9.20885 16.966C9.20453 16.9817 9.20025 16.9979 9.19616 17.0145C9.18727 17.0511 9.18129 17.0891 9.17715 17.1267C9.17601 17.1367 9.17492 17.1466 9.17411 17.1566C9.1694 17.2137 9.16922 17.2697 9.17135 17.322C9.17226 17.3434 9.1734 17.3648 9.17497 17.3847C9.18186 17.4722 9.19378 17.5387 9.19844 17.563C9.19968 17.5696 9.20053 17.5734 9.20053 17.5734C9.20053 17.5734 9.30005 17.6257 9.50541 17.6975C9.67659 17.7573 9.9308 17.8053 10.1377 17.8937C10.5818 18.0834 10.896 18.2929 11.2268 18.2445C11.674 18.1789 11.5537 17.6043 11.7952 17.0525C12.2665 15.9752 13.2231 15.6159 13.2231 15.6159C13.2231 15.6159 13.0979 15.1706 13.0738 15.0185C13.0427 14.8227 13.0185 14.2277 13.0185 14.2277L13.2121 14.2253C13.2121 14.2253 13.1374 15.2095 13.6355 16.1505C13.8755 16.6039 14.6232 17.2445 14.6232 17.2445C14.716 17.3914 14.6242 17.5568 14.4518 17.5777L13.9764 17.6347C13.9764 17.6347 13.9681 17.6428 13.9581 17.667C13.9472 17.6941 13.9343 17.7412 13.9286 17.821C13.9273 17.8396 13.9265 17.8605 13.926 17.8828C13.9252 17.9265 13.9263 17.9783 13.9304 18.0382C13.9321 18.0648 13.9345 18.0933 13.9375 18.1237C13.9407 18.1556 13.9444 18.1893 13.9491 18.2255C13.9516 18.2445 13.9548 18.263 13.9582 18.2806C13.9632 18.3072 13.9689 18.3324 13.9755 18.3566C13.9916 18.4146 14.0117 18.465 14.0336 18.5082C14.0447 18.5306 14.0563 18.5505 14.0679 18.5691C14.1205 18.6527 14.1743 18.7007 14.1988 18.7202C14.2072 18.7268 14.2125 18.7302 14.2125 18.7302C14.2125 18.7302 14.5897 18.8328 15.222 18.3386C15.4813 18.1361 16.0882 17.3738 16.0882 17.3738L16.091 17.0678C16.091 17.0678 15.9721 16.7855 15.951 16.6771C15.8493 16.1553 15.7975 14.5551 15.7975 14.5551L15.9851 14.5613L15.9719 14.1911C15.9719 14.1911 15.7618 13.8817 15.6075 13.368C15.554 13.1897 15.5025 12.8632 15.476 12.6575C15.3736 11.8633 15.142 11.2978 15.112 10.9014C15.0874 10.5768 15.4126 10.0754 15.5213 9.50609C15.6163 9.00851 15.4984 8.67631 15.4365 8.43298C15.3989 8.2847 15.4072 8.12835 15.4618 7.98577C15.5659 7.71346 15.7219 7.252 15.7219 6.93215C15.7219 6.7278 15.562 6.05199 15.562 6.05199C15.562 6.05199 15.9219 5.65231 15.6019 5.37239C15.3465 5.14855 15.002 5.37239 15.002 5.37239C15.002 5.37239 14.6421 5.13239 13.7622 5.21223C13.2444 5.25928 12.8748 5.57199 12.8748 5.57199H12.0225C12.0225 5.57199 11.9644 6.03821 12.2691 6.24305C12.2736 6.2459 12.2778 6.24922 12.2824 6.25207C12.3472 6.29246 12.4396 6.32336 12.5433 6.3533C12.5558 6.35663 12.5687 6.36042 12.5815 6.36375C12.6661 6.38751 12.7564 6.41176 12.8452 6.44075C12.8479 6.4417 12.8507 6.44265 12.8535 6.44312C12.9694 6.48114 13.0809 6.52772 13.171 6.59283C13.1964 6.61136 13.2207 6.63037 13.2423 6.65223C13.3078 6.71734 13.3474 6.81286 13.3713 6.91172C13.3838 6.96352 13.392 7.01674 13.3972 7.06664C13.4123 7.21159 13.4022 7.33184 13.4022 7.33184L13.2972 7.33612L12.9959 7.348L12.7001 7.35988L12.6893 7.36035L12.4764 7.3689L12.4024 7.37176C12.4024 7.37176 12.4001 7.56613 12.54 7.60225C12.8183 7.67449 13.2565 7.6436 13.2565 7.6436C13.2565 7.6436 13.2719 7.83417 12.881 8.07939C12.6363 8.23337 11.917 8.52804 11.6379 9.36542C11.5583 9.604 11.5802 10.1553 11.5802 10.1553L11.7909 10.0821L11.7878 10.2384L11.5202 10.3601L12.3145 11.8567L12.3224 11.8714Z" fill="#100F0D"/>
<path d="M15.2649 5.65174C15.3453 5.58235 15.4006 5.53863 15.3343 5.46306C15.279 5.40033 15.1576 5.48825 15.1576 5.48825L14.8641 5.72255L15.0052 5.87463C15.0052 5.87463 15.1511 5.75059 15.2649 5.65174Z" fill="white"/>
<path d="M13.4641 5.83799C13.5997 5.83799 13.8142 6.15403 13.8142 6.15403C13.8142 6.15403 13.9933 6.16734 13.9948 6.15688C14.0054 6.08084 13.6766 5.7553 13.5637 5.68734C13.4919 5.64457 13.3956 5.65692 13.3456 5.6997C13.2045 5.82088 13.2045 6.0837 13.2045 6.0837L13.3398 6.08132C13.3398 6.08132 13.3372 5.83799 13.4641 5.83799Z" fill="white"/>
</svg>
