<?xml version="1.0" encoding="utf-8"?>
<!-- Generator: Adobe Illustrator 25.2.3, SVG Export Plug-In . SVG Version: 6.00 Build 0)  -->
<svg version="1.1" id="Ebene_1" xmlns="http://www.w3.org/2000/svg" xmlns:xlink="http://www.w3.org/1999/xlink" x="0px" y="0px"
	 viewBox="0 0 73.9 14.4" style="enable-background:new 0 0 73.9 14.4;" xml:space="preserve">
<style type="text/css">
	.st0{fill-rule:evenodd;clip-rule:evenodd;}
</style>
<polygon class="st0" points="0.2,14.1 2.7,14.1 2.7,14.1 2.7,8 7.4,8 7.4,8 7.4,5.9 7.4,5.8 2.7,5.8 2.7,2.8 2.7,2.8 11.2,2.8 
	11.2,2.8 11.2,0.3 11.2,0.3 0.2,0.3 "/>
<polygon class="st0" points="21.5,0.3 21.5,14.1 18.9,14.1 18.9,0.3 "/>
<polygon class="st0" points="33.9,14.1 33.9,2.8 29.1,2.8 29.1,0.3 41,0.3 41,2.8 36.5,2.8 36.5,14.1 "/>
<polygon class="st0" points="54,12.5 52.2,14.3 45,7.2 52,0.1 53.8,1.9 48.6,7.2 "/>
<path class="st0" d="M66.9,0.3c-3.8,0-6.9,3.1-6.9,6.9c0,3.8,3.1,6.9,6.9,6.9c3.8,0,6.9-3.1,6.9-6.9C73.8,3.4,70.7,0.3,66.9,0.3z
	 M66.9,11.6c-2.4,0-4.4-2-4.4-4.4c0-2.4,2-4.4,4.4-4.4c2.4,0,4.4,2,4.4,4.4C71.3,9.6,69.3,11.6,66.9,11.6z"/>
</svg>
