<?xml version="1.0" encoding="UTF-8" standalone="no"?>
<!-- Created with Inkscape (http://www.inkscape.org/) -->

<svg
   width="114.64756mm"
   height="41.978886mm"
   viewBox="0 0 114.64756 41.978886"
   version="1.1"
   id="svg3382"
   inkscape:version="1.3 (0e150ed6c4, 2023-07-21)"
   sodipodi:docname="Alle_Logos.svg"
   xmlns:inkscape="http://www.inkscape.org/namespaces/inkscape"
   xmlns:sodipodi="http://sodipodi.sourceforge.net/DTD/sodipodi-0.dtd"
   xmlns="http://www.w3.org/2000/svg"
   xmlns:svg="http://www.w3.org/2000/svg">
  <sodipodi:namedview
     id="namedview3384"
     pagecolor="#ffffff"
     bordercolor="#000000"
     borderopacity="0.25"
     inkscape:showpageshadow="2"
     inkscape:pageopacity="0.0"
     inkscape:pagecheckerboard="0"
     inkscape:deskcolor="#d1d1d1"
     inkscape:document-units="mm"
     showgrid="false"
     inkscape:zoom="0.74564396"
     inkscape:cx="553.21309"
     inkscape:cy="417.7597"
     inkscape:window-width="1920"
     inkscape:window-height="1017"
     inkscape:window-x="1912"
     inkscape:window-y="-8"
     inkscape:window-maximized="1"
     inkscape:current-layer="layer1" />
  <defs
     id="defs3379" />
  <g
     inkscape:label="Ebene 1"
     inkscape:groupmode="layer"
     id="layer1"
     transform="translate(-24.897782,-156.70182)"
     style="display:inline">
    <g
       id="g12988-0-9"
       transform="matrix(0.99633296,0,0,0.99633296,-361.14128,-391.29077)"
       style="display:inline"
       inkscape:export-filename="XBD_Logo_DE.svg"
       inkscape:export-xdpi="96"
       inkscape:export-ydpi="96">
      <g
         id="g15627-5"
         transform="translate(272.86836,179.15159)">
        <g
           id="g18119"
           transform="translate(240.08778,173.22085)">
          <g
             id="g11986-9-1"
             transform="translate(-0.06272721)">
            <path
               style="fill:#0034ff;fill-opacity:1;stroke-width:0.264583"
               d="m -104.20828,219.01967 v 4.79864 l 11.729995,11.68076 h 4.70454 v -4.74941 l -11.697639,-11.72999 z"
               id="path7909-8-2"
               sodipodi:nodetypes="ccccccc" />
            <path
               style="fill:#0075ef;fill-opacity:1;stroke-width:0.264583"
               d="m -125.43352,197.63706 v 4.75076 l 11.67205,11.82093 h 4.59107 v -4.88958 l -11.58417,-11.68211 z"
               id="path7909-6-3-5"
               sodipodi:nodetypes="ccccccc" />
            <path
               style="fill:#009deb;fill-opacity:1;stroke-width:0.264583"
               d="m -104.20828,214.20875 h 4.814201 l 11.620334,-11.92298 v -4.64871 h -4.883246 l -11.551289,11.83475 z"
               id="path7909-0-3-5"
               sodipodi:nodetypes="ccccccc" />
            <path
               style="fill:#2f7cf9;fill-opacity:1;stroke-width:0.264583"
               d="m -125.43352,235.49907 h 4.82185 l 11.44127,-11.92298 v -4.55642 h -4.70422 l -11.5589,11.74246 z"
               id="path7909-0-2-5-3"
               sodipodi:nodetypes="ccccccc" />
          </g>
          <text
             xml:space="preserve"
             style="font-style:normal;font-variant:normal;font-weight:bold;font-stretch:normal;font-size:19.7556px;font-family:Arial;-inkscape-font-specification:'Arial, Bold';font-variant-ligatures:normal;font-variant-caps:normal;font-variant-numeric:normal;font-variant-east-asian:normal;fill:#0034ff;fill-opacity:1;stroke-width:0.264583"
             x="-82.677422"
             y="235.6129"
             id="text12930-2-2"><tspan
               id="tspan12928-0-8"
               style="font-style:normal;font-variant:normal;font-weight:bold;font-stretch:normal;font-size:19.7556px;font-family:Arial;-inkscape-font-specification:'Arial, Bold';font-variant-ligatures:normal;font-variant-caps:normal;font-variant-numeric:normal;font-variant-east-asian:normal;fill:#0034ff;fill-opacity:1;stroke-width:0.264583"
               x="-82.677422"
               y="235.6129"
               sodipodi:role="line">Bildung</tspan></text>
        </g>
      </g>
    </g>
  </g>
</svg>
