<?xml version="1.0" encoding="UTF-8"?>
<svg id="Ebene_1" data-name="Ebene 1" xmlns="http://www.w3.org/2000/svg" viewBox="0 0 645.45 260.79">
  <path d="m82,58.66c0-6.48,5.25-11.73,11.73-11.73s11.74,5.25,11.74,11.73-5.26,11.74-11.74,11.74-11.73-5.26-11.73-11.74"/>
  <path d="m222.81,58.66c0-6.48,5.26-11.73,11.73-11.73s11.74,5.25,11.74,11.73-5.25,11.74-11.74,11.74-11.73-5.26-11.73-11.74" fill="#bcbcbc"/>
  <path d="m363.63,58.66c0-6.48,5.26-11.73,11.74-11.73s11.73,5.25,11.73,11.73-5.26,11.74-11.73,11.74-11.74-5.26-11.74-11.74" fill="#bcbcbc"/>
  <path d="m504.45,58.66c0-6.48,5.26-11.73,11.73-11.73s11.74,5.25,11.74,11.73-5.26,11.74-11.74,11.74-11.73-5.26-11.73-11.74" fill="#bcbcbc"/>
  <path d="m117.2,58.66c0-6.48,5.26-11.73,11.74-11.73s11.74,5.25,11.74,11.73-5.26,11.74-11.74,11.74-11.74-5.26-11.74-11.74" fill="#e30613"/>
  <path d="m258.02,58.66c0-6.48,5.25-11.73,11.74-11.73s11.73,5.25,11.73,11.73-5.25,11.74-11.73,11.74-11.74-5.26-11.74-11.74" fill="#bcbcbc"/>
  <path d="m398.83,58.66c0-6.48,5.25-11.73,11.73-11.73s11.74,5.25,11.74,11.73-5.25,11.74-11.74,11.74-11.73-5.26-11.73-11.74" fill="#bcbcbc"/>
  <path d="m539.65,58.66c0-6.48,5.25-11.73,11.73-11.73s11.73,5.25,11.73,11.73-5.25,11.74-11.73,11.74-11.73-5.26-11.73-11.74" fill="#bcbcbc"/>
  <path d="m152.4,58.66c0-6.48,5.25-11.73,11.73-11.73s11.73,5.25,11.73,11.73-5.25,11.74-11.73,11.74-11.73-5.26-11.73-11.74" fill="#f8d200"/>
  <path d="m293.22,58.66c0-6.48,5.25-11.73,11.73-11.73s11.73,5.25,11.73,11.73-5.25,11.74-11.73,11.74-11.73-5.26-11.73-11.74" fill="#bcbcbc"/>
  <path d="m434.04,58.66c0-6.48,5.25-11.73,11.74-11.73s11.73,5.25,11.73,11.73-5.25,11.74-11.73,11.74-11.74-5.26-11.74-11.74" fill="#bcbcbc"/>
  <path d="m574.86,58.66c0-6.48,5.26-11.73,11.74-11.73s11.73,5.25,11.73,11.73-5.25,11.74-11.73,11.74-11.74-5.26-11.74-11.74" fill="#bcbcbc"/>
  <path d="m46.79,58.66c0-6.48,5.25-11.73,11.73-11.73s11.73,5.25,11.73,11.73-5.25,11.74-11.73,11.74-11.73-5.26-11.73-11.74" fill="#bcbcbc"/>
  <path d="m187.61,58.66c0-6.48,5.25-11.73,11.74-11.73s11.73,5.25,11.73,11.73-5.25,11.74-11.73,11.74-11.74-5.26-11.74-11.74" fill="#bcbcbc"/>
  <path d="m328.43,58.66c0-6.48,5.25-11.73,11.74-11.73s11.73,5.25,11.73,11.73-5.25,11.74-11.73,11.74-11.74-5.26-11.74-11.74" fill="#bcbcbc"/>
  <path d="m469.24,58.66c0-6.48,5.26-11.73,11.73-11.73s11.73,5.25,11.73,11.73-5.25,11.74-11.73,11.74-11.73-5.26-11.73-11.74" fill="#bcbcbc"/>
  <path d="m62.06,193.32h-6.05c-.72,0-.96.24-.96.96v1.1c0,.72.24.96.96.96h2.5c.91,0,.96.05.96.96v7.58c0,3.84-2.06,5.57-4.32,5.57-2.4,0-4.42-1.92-4.42-5.95v-18.05c0-4.03,1.97-5.95,4.42-5.95,2.21,0,3.74,1.68,4.13,4.03.1.53.34.67.86.67h2.06c.58,0,.62-.43.62-.86-.38-4.27-3.17-7.25-7.73-7.25-4.94,0-8.02,3.31-8.02,9.36v18.05c0,6.05,3.07,9.36,8.02,9.36s7.92-3.22,7.92-8.88v-10.7c0-.72-.24-.96-.96-.96h0Zm14.77-4.75c-3.46,0-7.06,2.21-7.06,8.4v8.5c0,6.24,3.6,8.4,7.06,8.4s6.1-1.97,6.48-5.23c.05-.43-.05-.86-.62-.86h-1.73c-.43,0-.67.14-.82.53-.43,1.3-1.49,2.45-3.26,2.45s-3.79-1.2-3.79-4.37v-4.56c0-.38.1-.48.48-.48h9.17c.72,0,.96-.29,1.01-1.01.1-.91.14-1.63.14-2.64v-.96c0-6.05-3.65-8.16-7.06-8.16h0Zm3.89,7.63v1.92c0,.38-.1.48-.48.48h-6.67c-.38,0-.48-.1-.48-.48v-1.92c0-3.41,2.11-4.56,3.79-4.56s3.84,1.15,3.84,4.56h0Zm27.78-7.58c-1.82.19-3.65,1.3-4.9,3.22-1.2-2.4-3.41-3.41-5.57-3.22-1.87.19-3.22,1.34-4.13,2.59l-.24-1.2c-.14-.72-.29-1.01-1.01-1.01h-.96c-.72,0-1.01.29-1.01,1.01v22.46c0,.72.29,1.01,1.01,1.01h1.34c.72,0,1.01-.29,1.01-1.01v-16.22c0-2.93,1.58-4.42,3.41-4.51,1.78-.1,3.7,1.15,3.7,4.51v16.22c0,.72.29,1.01,1.01,1.01h1.34c.72,0,1.01-.29,1.01-1.01v-16.03c0-3.17,1.63-4.61,3.41-4.7,1.78-.1,3.65,1.15,3.65,4.51v16.22c0,.72.29,1.01,1.01,1.01h1.39c.72,0,1.01-.29,1.01-1.01v-16.27c0-5.47-3.26-7.87-6.48-7.58h0Zm20.48-.05c-3.46,0-7.06,2.21-7.06,8.4v8.5c0,6.24,3.6,8.4,7.06,8.4s6.1-1.97,6.48-5.23c.05-.43-.05-.86-.62-.86h-1.73c-.43,0-.67.14-.82.53-.43,1.3-1.49,2.45-3.26,2.45s-3.79-1.2-3.79-4.37v-4.56c0-.38.1-.48.48-.48h9.17c.72,0,.96-.29,1.01-1.01.1-.91.14-1.63.14-2.64v-.96c0-6.05-3.65-8.16-7.06-8.16h0Zm3.89,7.63v1.92c0,.38-.1.48-.48.48h-6.67c-.38,0-.48-.1-.48-.48v-1.92c0-3.41,2.11-4.56,3.79-4.56s3.84,1.15,3.84,4.56h0Zm11.65-13.3c1.34,0,2.45-1.1,2.45-2.45s-1.1-2.45-2.45-2.45-2.45,1.1-2.45,2.45,1.1,2.45,2.45,2.45h0Zm.67,6.1h-1.34c-.72,0-1.01.29-1.01,1.01v22.46c0,.72.29,1.01,1.01,1.01h1.34c.72,0,1.01-.29,1.01-1.01v-22.46c0-.72-.29-1.01-1.01-1.01h0Zm15.69-.38c-1.87.19-3.36,1.39-4.32,2.59l-.24-1.2c-.14-.72-.29-1.01-1.01-1.01h-.96c-.72,0-1.01.29-1.01,1.01v22.46c0,.72.29,1.01,1.01,1.01h1.34c.72,0,1.01-.29,1.01-1.01v-16.22c0-2.93,1.78-4.42,3.6-4.51,1.78-.1,3.89,1.15,3.89,4.51v16.22c0,.72.29,1.01,1.01,1.01h1.34c.72,0,1.01-.29,1.01-1.01v-16.27c0-5.47-3.46-7.87-6.67-7.58h0Zm19.87,25.25c3.5,0,6.82-2.21,6.82-6.29.05-7.06-9.74-8.98-9.74-13.15,0-1.39,1.1-2.78,2.93-2.78,1.73,0,2.59,1.39,2.93,2.54.1.38.38.53.82.53h1.63c.58,0,.67-.43.62-.86-.29-3.07-2.88-5.28-6.05-5.28-3.46,0-6.34,2.59-6.24,6.05.14,6.38,9.74,7.87,9.7,12.96,0,2.11-1.63,3.26-3.46,3.26s-2.93-1.2-3.36-2.54c-.14-.38-.38-.53-.82-.53h-1.82c-.58,0-.72.43-.62.86.62,3.12,3.17,5.23,6.67,5.23h0Zm19.78,0c1.68-.1,3.36-.96,4.42-2.45.24,1.82.43,2.06,1.2,2.06h1.34c.72,0,1.1-.24.96-.96-.19-.86-.43-2.02-.43-3.46v-12.53c0-5.76-3.55-7.97-7.01-7.97s-6.24,2.11-6.48,5.28c-.05.43.05.86.62.86h1.63c.43,0,.67-.14.82-.53.38-1.39,1.49-2.54,3.31-2.54s3.7,1.2,3.7,4.27v1.25c-6.58,1.1-10.8,2.54-10.8,9.12,0,5.52,3.55,7.82,6.72,7.58h0Zm.53-3.12c-1.82.1-3.84-1.15-3.84-4.46-.05-4.75,2.21-5.71,7.39-6.67v6.58c0,2.98-1.73,4.46-3.55,4.56h0Zm31.89-22.13c-1.82.19-3.65,1.3-4.9,3.22-1.2-2.4-3.41-3.41-5.57-3.22-1.87.19-3.22,1.34-4.13,2.59l-.24-1.2c-.14-.72-.29-1.01-1.01-1.01h-.96c-.72,0-1.01.29-1.01,1.01v22.46c0,.72.29,1.01,1.01,1.01h1.34c.72,0,1.01-.29,1.01-1.01v-16.22c0-2.93,1.58-4.42,3.41-4.51,1.78-.1,3.7,1.15,3.7,4.51v16.22c0,.72.29,1.01,1.01,1.01h1.34c.72,0,1.01-.29,1.01-1.01v-16.03c0-3.17,1.63-4.61,3.41-4.7,1.78-.1,3.65,1.15,3.65,4.51v16.22c0,.72.29,1.01,1.01,1.01h1.39c.72,0,1.01-.29,1.01-1.01v-16.27c0-5.47-3.26-7.87-6.48-7.58h0Zm48.81.38h-1.73c-.62,0-.96.34-1.1.96l-3.22,15.98c-.1.34-.53.43-.58,0l-3.6-15.98c-.19-.77-.48-.96-1.25-.96h-.77c-.77,0-1.1.19-1.25.96l-3.6,15.98c-.1.43-.53.34-.58,0l-3.22-15.98c-.14-.62-.48-.96-1.1-.96h-1.73c-.53,0-.77.34-.62.96l5.04,22.56c.19.77.48.96,1.25.96h1.06c.77,0,1.1-.19,1.25-.96l3.6-15.89c.1-.34.48-.34.58,0l3.6,15.89c.14.77.48.96,1.25.96h1.06c.77,0,1.06-.19,1.25-.96l5.04-22.56c.14-.62-.1-.96-.62-.96h0Zm8.27-6.1c1.34,0,2.45-1.1,2.45-2.45s-1.1-2.45-2.45-2.45-2.45,1.1-2.45,2.45,1.1,2.45,2.45,2.45h0Zm.67,6.1h-1.34c-.72,0-1.01.29-1.01,1.01v22.46c0,.72.29,1.01,1.01,1.01h1.34c.72,0,1.01-.29,1.01-1.01v-22.46c0-.72-.29-1.01-1.01-1.01h0Zm15.54-.1c-1.34,0-3.02.67-4.17,2.16l-.24-1.06c-.15-.72-.29-1.01-1.01-1.01h-.96c-.72,0-1.01.29-1.01,1.01v22.46c0,.72.29,1.01,1.01,1.01h1.34c.72,0,1.01-.29,1.01-1.01v-15.98c0-2.69,1.78-3.94,4.03-3.94.72,0,1.01-.29,1.01-1.01v-1.63c0-.72-.29-1.01-1.01-1.01h0Zm20.91,23.71l-6.19-11.9c-.24-.43-.24-.67,0-1.06l5.62-9.84c.24-.38.14-.82-.38-.82h-1.82c-.58,0-.96.1-1.2.58l-6.14,10.46c-.19.38-.58.24-.58-.1v-21.46c0-.72-.29-1.01-1.01-1.01h-1.34c-.72,0-1.01.29-1.01,1.01v33.98c0,.72.29,1.01,1.01,1.01h1.34c.72,0,1.01-.29,1.01-1.01v-5.42c0-.67.1-.91.43-1.54l1.2-2.02c.19-.29.53-.24.67,0l4.99,9.36c.19.43.62.62,1.2.62h1.82c.53,0,.58-.48.38-.86h0Zm11.48,1.25c3.5,0,6.82-2.21,6.82-6.29.05-7.06-9.74-8.98-9.74-13.15,0-1.39,1.1-2.78,2.93-2.78,1.73,0,2.59,1.39,2.93,2.54.1.38.38.53.82.53h1.63c.58,0,.67-.43.62-.86-.29-3.07-2.88-5.28-6.05-5.28-3.46,0-6.34,2.59-6.24,6.05.14,6.38,9.74,7.87,9.7,12.96,0,2.11-1.63,3.26-3.46,3.26s-2.93-1.2-3.36-2.54c-.14-.38-.38-.53-.82-.53h-1.82c-.58,0-.72.43-.62.86.62,3.12,3.17,5.23,6.67,5.23h0Zm19.78,0c1.68-.1,3.36-.96,4.42-2.45.24,1.82.43,2.06,1.2,2.06h1.34c.72,0,1.1-.24.96-.96-.19-.86-.43-2.02-.43-3.46v-12.53c0-5.76-3.55-7.97-7.01-7.97s-6.24,2.11-6.48,5.28c-.05.43.05.86.62.86h1.63c.43,0,.67-.14.82-.53.38-1.39,1.49-2.54,3.31-2.54s3.7,1.2,3.7,4.27v1.25c-6.58,1.1-10.8,2.54-10.8,9.12,0,5.52,3.55,7.82,6.72,7.58h0Zm.53-3.12c-1.82.1-3.84-1.15-3.84-4.46-.05-4.75,2.21-5.71,7.39-6.67v6.58c0,2.98-1.73,4.46-3.55,4.56h0Zm31.89-22.13c-1.82.19-3.65,1.3-4.9,3.22-1.2-2.4-3.41-3.41-5.57-3.22-1.87.19-3.22,1.34-4.13,2.59l-.24-1.2c-.14-.72-.29-1.01-1.01-1.01h-.96c-.72,0-1.01.29-1.01,1.01v22.46c0,.72.29,1.01,1.01,1.01h1.34c.72,0,1.01-.29,1.01-1.01v-16.22c0-2.93,1.58-4.42,3.41-4.51,1.78-.1,3.7,1.15,3.7,4.51v16.22c0,.72.29,1.01,1.01,1.01h1.34c.72,0,1.01-.29,1.01-1.01v-16.03c0-3.17,1.63-4.61,3.41-4.7,1.78-.1,3.65,1.15,3.65,4.51v16.22c0,.72.29,1.01,1.01,1.01h1.39c.72,0,1.01-.29,1.01-1.01v-16.27c0-5.47-3.26-7.87-6.48-7.58h0Zm16.5,25.25c1.49,0,2.74-1.2,2.74-2.78,0-1.49-1.25-2.74-2.74-2.74-1.58,0-2.78,1.25-2.78,2.74,0,1.58,1.2,2.78,2.78,2.78h0Z"/>
  <path d="m47.03,151.82c0,1.19.48,1.66,1.66,1.66h8.08c1.19,0,1.66-.48,1.66-1.66v-56.07c0-1.19-.48-1.66-1.66-1.66h-8.08c-1.19,0-1.66.48-1.66,1.66v56.07h0Zm51-57.74h-28.51c-1.19,0-1.66.48-1.66,1.66v6.81c0,1.19.48,1.66,1.66,1.66h7.05c1.19,0,1.5.32,1.5,1.5v46.09c0,1.19.48,1.66,1.66,1.66h8.08c1.19,0,1.66-.48,1.66-1.66v-46.09c0-1.19.32-1.5,1.5-1.5h7.05c1.19,0,1.66-.48,1.66-1.66v-6.81c0-1.19-.48-1.66-1.66-1.66h0Zm24.86,32.47h-18.06c-1.19,0-1.66.48-1.66,1.66v4.75c0,1.19.47,1.66,1.66,1.66h18.06c1.19,0,1.66-.48,1.66-1.66v-4.75c0-1.19-.47-1.66-1.66-1.66h0Zm13.2,26.93h8.08c1.19,0,1.66-.48,1.66-1.66v-16.79c0-1.19.32-1.5,1.5-1.5h3.72c9.27,0,16.24-7.05,16.24-17.9v-3.56c0-10.85-6.97-17.98-16.24-17.98h-14.97c-1.19,0-1.66.48-1.66,1.66v56.07c0,1.19.48,1.66,1.66,1.66h0Zm11.25-30.65c-1.19,0-1.5-.32-1.5-1.51v-15.6c0-1.19.32-1.5,1.5-1.5h2.54c3.17,0,6.02,2.45,6.02,7.76v3.09c0,5.31-2.85,7.76-6.02,7.76h-2.54Zm52.52,20.51h-10.14c-1.19,0-1.51-.32-1.51-1.51v-46.09c0-1.19-.48-1.66-1.66-1.66h-8.08c-1.19,0-1.66.48-1.66,1.66v56.07c0,1.19.48,1.66,1.66,1.66h21.38c1.19,0,1.66-.48,1.66-1.66v-6.81c0-1.19-.48-1.66-1.66-1.66h0Zm9.92,8.55c-.32,1.19.32,1.58,1.19,1.58h8.32c1.03,0,1.58-.32,1.9-1.58l1.5-6.81c.24-.95.55-1.11,1.58-1.11h8.47c1.03,0,1.35.16,1.58,1.11l1.5,6.81c.32,1.27.87,1.58,1.9,1.58h8.32c.87,0,1.5-.4,1.19-1.58l-13.38-56.23c-.32-1.35-.87-1.58-2.14-1.58h-6.41c-1.27,0-1.82.24-2.14,1.58l-13.38,56.23h0Zm15.05-18.93l3.25-16.32c.08-.55.79-.55.95,0l3.25,16.32c.08.55-.24.87-.63.87h-6.18c-.47,0-.79-.32-.63-.87h0Zm65.71-38.89h-8.16c-1.19,0-1.66.48-1.66,1.66v29.3c0,.55-.63.63-.87.08l-13.23-29.38c-.48-1.19-1.03-1.66-2.3-1.66h-6.1c-1.19,0-1.66.48-1.66,1.66v56.07c0,1.19.48,1.66,1.66,1.66h8.08c1.19,0,1.66-.48,1.66-1.66v-29.3c0-.55.63-.63.87-.08l13.23,29.38c.56,1.19,1.03,1.66,2.38,1.66h6.1c1.19,0,1.66-.48,1.66-1.66v-56.07c0-1.19-.47-1.66-1.66-1.66h0Zm45.33,0h-8.16c-1.19,0-1.66.48-1.66,1.66v38.1c0,5.54-1.43,9.82-5.86,9.82s-5.94-4.28-5.94-9.82v-38.1c0-1.19-.47-1.66-1.66-1.66h-8.08c-1.19,0-1.66.48-1.66,1.66v38.1c0,12.28,5.54,20.35,17.34,20.35s17.35-8.08,17.35-20.35v-38.1c0-1.19-.47-1.66-1.66-1.66h0Zm46.28,0h-8.16c-1.19,0-1.66.48-1.66,1.66v29.3c0,.55-.63.63-.87.08l-13.23-29.38c-.47-1.19-1.03-1.66-2.3-1.66h-6.1c-1.19,0-1.66.48-1.66,1.66v56.07c0,1.19.47,1.66,1.66,1.66h8.08c1.19,0,1.66-.48,1.66-1.66v-29.3c0-.55.63-.63.87-.08l13.23,29.38c.56,1.19,1.03,1.66,2.38,1.66h6.1c1.19,0,1.66-.48,1.66-1.66v-56.07c0-1.19-.47-1.66-1.66-1.66h0Zm44.7,24.71h-14.26c-1.19,0-1.58.4-1.58,1.58v5.86c0,1.19.4,1.58,1.58,1.58h3.48c1.27,0,1.58.32,1.58,1.58v7.05c0,4.28-2.22,7.21-5.86,7.21-4.36,0-6.1-4.28-6.1-9.82v-20.12c0-5.54,1.51-9.82,5.94-9.82,3.64,0,5.15,2.93,5.54,5.78.16.87.55,1.19,1.43,1.19h8.71c.95,0,1.03-.63,1.03-1.43-.24-8.71-5.7-16.08-16.71-16.08-11.8,0-17.34,8.08-17.34,20.35v20.12c0,12.28,5.54,20.35,17.34,20.35,11.17,0,16.79-7.52,16.79-17.03v-16.79c0-1.19-.4-1.58-1.58-1.58h0Zm45.84,19.72c0-15.84-20.83-22.33-21.94-30.33-.32-2.69,1.42-5.07,4.43-5.07,3.25,0,4.44,3.33,4.91,6.02.08.87.48,1.19,1.35,1.19h8.08c.95,0,1.11-.63,1.03-1.43-.16-8.63-5.39-15.52-15.68-15.52-9.66,0-15.68,6.34-15.68,14.73,0,16.08,23.05,20.83,21.94,31.13-.16,3.17-2.38,5.31-5.62,5.31-4.52,0-6.34-4.12-6.65-7.13-.08-.87-.56-1.19-1.43-1.19h-8.08c-.95,0-1.03.63-1.03,1.43.08,10.14,7.52,16.55,17.11,16.55,7.68,0,17.27-4.83,17.27-15.68h0Zm45.16,13.39l-8.87-21.94c4.12-3.09,6.65-8.32,6.65-14.89v-3.01c0-10.85-6.97-17.98-16.24-17.98h-14.97c-1.19,0-1.66.48-1.66,1.66v56.07c0,1.19.48,1.66,1.66,1.66h8.08c1.19,0,1.66-.48,1.66-1.66v-17.27c0-1.19.32-1.51,1.51-1.51h3.09l7.52,19.32c.32.79.87,1.11,1.9,1.11h8.87c.87,0,1.19-.63.79-1.58h0Zm-23.68-31.05v-15.13c0-1.19.32-1.5,1.51-1.5h2.53c3.17,0,6.02,2.45,6.02,7.76v2.61c0,5.31-2.85,7.76-6.02,7.76h-2.53c-1.19,0-1.51-.32-1.51-1.5h0Zm31.85,31.05c-.32,1.19.32,1.58,1.19,1.58h8.32c1.03,0,1.58-.32,1.9-1.58l1.51-6.81c.24-.95.56-1.11,1.58-1.11h8.47c1.03,0,1.35.16,1.58,1.11l1.5,6.81c.32,1.27.87,1.58,1.9,1.58h8.32c.87,0,1.51-.4,1.19-1.58l-13.38-56.23c-.32-1.35-.87-1.58-2.14-1.58h-6.42c-1.27,0-1.82.24-2.14,1.58l-13.38,56.23h0Zm15.05-18.93l3.25-16.32c.08-.55.79-.55.95,0l3.25,16.32c.08.55-.24.87-.63.87h-6.18c-.48,0-.79-.32-.63-.87h0Zm55.65-38.89h-28.51c-1.19,0-1.66.48-1.66,1.66v6.81c0,1.19.48,1.66,1.66,1.66h7.05c1.19,0,1.51.32,1.51,1.5v46.09c0,1.19.47,1.66,1.66,1.66h8.08c1.19,0,1.66-.48,1.66-1.66v-46.09c0-1.19.32-1.5,1.5-1.5h7.05c1.19,0,1.66-.48,1.66-1.66v-6.81c0-1.19-.47-1.66-1.66-1.66h0Z"/>
</svg>