<?xml version="1.0" encoding="UTF-8" standalone="no"?>
<!-- Created with Inkscape (http://www.inkscape.org/) -->

<svg
   width="9.0755501mm"
   height="9.9854879mm"
   viewBox="0 0 9.07555 9.9854879"
   version="1.1"
   id="svg2211"
   sodipodi:docname="financing.svg"
   inkscape:version="1.3 (0e150ed6c4, 2023-07-21)"
   xmlns:inkscape="http://www.inkscape.org/namespaces/inkscape"
   xmlns:sodipodi="http://sodipodi.sourceforge.net/DTD/sodipodi-0.dtd"
   xmlns="http://www.w3.org/2000/svg"
   xmlns:svg="http://www.w3.org/2000/svg">
  <sodipodi:namedview
     id="namedview1"
     pagecolor="#ffffff"
     bordercolor="#000000"
     borderopacity="0.25"
     inkscape:showpageshadow="2"
     inkscape:pageopacity="0.0"
     inkscape:pagecheckerboard="0"
     inkscape:deskcolor="#d1d1d1"
     inkscape:document-units="mm"
     showgrid="false"
     inkscape:zoom="12.150333"
     inkscape:cx="37.653289"
     inkscape:cy="43.743658"
     inkscape:window-width="3840"
     inkscape:window-height="1511"
     inkscape:window-x="-9"
     inkscape:window-y="-9"
     inkscape:window-maximized="1"
     inkscape:current-layer="svg2211" />
  <defs
     id="defs2208">
    <clipPath
       clipPathUnits="userSpaceOnUse"
       id="clipPath2755">
      <rect
         x="721"
         y="329.00009"
         width="148"
         height="164"
         id="rect2757"
         style="stroke-width:0.999999" />
    </clipPath>
    <clipPath
       clipPathUnits="userSpaceOnUse"
       id="clipPath2759">
      <rect
         x="721"
         y="329.00009"
         width="148"
         height="164"
         id="rect2761"
         style="stroke-width:0.999999" />
    </clipPath>
    <clipPath
       clipPathUnits="userSpaceOnUse"
       id="clipPath2763">
      <rect
         x="721"
         y="329.00009"
         width="148"
         height="164"
         id="rect2765"
         style="stroke-width:0.999999" />
    </clipPath>
    <clipPath
       clipPathUnits="userSpaceOnUse"
       id="clipPath2767">
      <rect
         x="721"
         y="329.00009"
         width="148"
         height="164"
         id="rect2769"
         style="stroke-width:0.999999" />
    </clipPath>
    <clipPath
       clipPathUnits="userSpaceOnUse"
       id="clipPath2771">
      <rect
         x="721"
         y="329.00009"
         width="148"
         height="164"
         id="rect2773"
         style="stroke-width:0.999999" />
    </clipPath>
    <clipPath
       clipPathUnits="userSpaceOnUse"
       id="clipPath2775">
      <rect
         x="721"
         y="329.00009"
         width="148"
         height="164"
         id="rect2777"
         style="stroke-width:0.999999" />
    </clipPath>
    <clipPath
       clipPathUnits="userSpaceOnUse"
       id="clipPath2779">
      <rect
         x="721"
         y="329.00009"
         width="148"
         height="164"
         id="rect2781"
         style="stroke-width:0.999999" />
    </clipPath>
  </defs>
  <g
     id="g2">
    <path
       d="m 796.084,364.195 v 0 c 6.59,4.305 14.066,3.165 21.416,2.912 V 339.25 c -1.267,0 -2.281,-0.127 -3.168,0 -7.983,0 -15.587,-1.013 -22.556,-5.825 -5.956,-3.925 -13.306,-2.912 -20.276,-3.672 v 28.111 c 1.141,0.126 1.774,0.253 2.408,0.253 7.983,-0.253 15.333,1.646 22.176,6.078 z"
       stroke="#000000"
       stroke-width="0"
       stroke-linejoin="round"
       stroke-miterlimit="10"
       fill="#1d1e1c"
       fill-rule="evenodd"
       id="path22588-1-2"
       style="fill:#030303;fill-opacity:1;stroke:#000000;stroke-opacity:1"
       transform="matrix(0.06093269,0,0,0.06103992,-44.055524,-20.128095)"
       clip-path="url(#clipPath2779)" />
    <g
       id="g1">
      <rect
         style="fill:none;fill-opacity:1;stroke:#000000;stroke-width:0.556441;stroke-linecap:round;stroke-linejoin:round;stroke-dasharray:none;stroke-opacity:1"
         id="rect22728-2-7"
         width="8.5191097"
         height="6.3696232"
         x="0.27822137"
         y="3.3376465"
         rx="0.68678159"
         ry="0.73749948" />
      <text
         xml:space="preserve"
         style="font-weight:bold;font-size:5.82083px;line-height:1.15;font-family:System-ui;-inkscape-font-specification:'System-ui Bold';letter-spacing:0px;opacity:0.99;fill:#000000;stroke-width:1;stroke-linecap:round"
         x="2.8281918"
         y="8.5560541"
         id="text1"><tspan
           sodipodi:role="line"
           id="tspan1"
           style="fill:#000000;stroke-width:1"
           x="2.8281918"
           y="8.5560541">€</tspan></text>
    </g>
  </g>
</svg>
