<?xml version="1.0" encoding="UTF-8" standalone="no"?>
<!-- Created with Inkscape (http://www.inkscape.org/) -->

<svg
   viewBox="0 0 831.49679 102.04734"
   version="1.1"
   id="svg26984"
   sodipodi:docname="bedarfsmeldung.svg"
   inkscape:version="1.3 (0e150ed6c4, 2023-07-21)"
   inkscape:export-filename="Lebenszyklus - Regelbetrieb - NoText.png"
   inkscape:export-xdpi="600"
   inkscape:export-ydpi="600"
   width="220mm"
   height="27mm"
   xml:space="preserve"
   xmlns:inkscape="http://www.inkscape.org/namespaces/inkscape"
   xmlns:sodipodi="http://sodipodi.sourceforge.net/DTD/sodipodi-0.dtd"
   xmlns="http://www.w3.org/2000/svg"
   xmlns:svg="http://www.w3.org/2000/svg"><sodipodi:namedview
     id="namedview79"
     pagecolor="#ffffff"
     bordercolor="#000000"
     borderopacity="0.25"
     inkscape:showpageshadow="2"
     inkscape:pageopacity="0.0"
     inkscape:pagecheckerboard="0"
     inkscape:deskcolor="#d1d1d1"
     showgrid="false"
     inkscape:zoom="1.0240399"
     inkscape:cx="104.48812"
     inkscape:cy="-118.64772"
     inkscape:window-width="2445"
     inkscape:window-height="1333"
     inkscape:window-x="1258"
     inkscape:window-y="98"
     inkscape:window-maximized="0"
     inkscape:current-layer="layer2"
     inkscape:document-units="mm" /><defs
     id="defs26981"><rect
       x="537.90503"
       y="-46.263973"
       width="149.14954"
       height="180.5676"
       id="rect447" /><rect
       x="-18.64369"
       y="-31.072819"
       width="1093.9233"
       height="332.13391"
       id="rect3064" /></defs><g
     inkscape:groupmode="layer"
     id="layer1"
     inkscape:label="Hintergrund"
     sodipodi:insensitive="true"><g
       id="g1"
       transform="translate(62.204893,-4.3280032e-4)"><path
         style="fill:#ececec;stroke:#f2f2f2;stroke-width:6;stroke-linecap:round;stroke-linejoin:round;stroke-dasharray:none;stroke-opacity:1"
         d="M 50.449994,27.537112 H 656.73785 v 0"
         id="path911" /><path
         style="fill:#e6e6e6;stroke-width:0.72024;stroke-linecap:round;stroke-linejoin:round"
         id="path650"
         sodipodi:type="arc"
         sodipodi:cx="41.220154"
         sodipodi:cy="27.824852"
         sodipodi:rx="13.257176"
         sodipodi:ry="13.194417"
         sodipodi:start="0"
         sodipodi:end="6.2629329"
         sodipodi:open="true"
         sodipodi:arc-type="arc"
         d="M 54.47733,27.824852 A 13.257176,13.194417 0 0 1 41.287276,41.0191 13.257176,13.194417 0 0 1 27.963657,27.958459 13.257176,13.194417 0 0 1 41.018794,14.631957 13.257176,13.194417 0 0 1 54.474612,27.557652" /><path
         style="fill:#e6e6e6;stroke-width:0.728752;stroke-linecap:round;stroke-linejoin:round"
         id="path650-4"
         sodipodi:type="arc"
         sodipodi:cx="166.3007"
         sodipodi:cy="27.537094"
         sodipodi:rx="13.105959"
         sodipodi:ry="13.663995"
         sodipodi:start="0"
         sodipodi:end="6.2629329"
         sodipodi:open="true"
         sodipodi:arc-type="arc"
         d="m 179.40666,27.537094 a 13.105959,13.663995 0 0 1 -13.0396,13.66382 13.105959,13.663995 0 0 1 -13.17164,-13.525458 13.105959,13.663995 0 0 1 12.90622,-13.80078 13.105959,13.663995 0 0 1 13.30234,13.385708" /><path
         style="fill:#e6e6e6;stroke-width:0.728752;stroke-linecap:round;stroke-linejoin:round"
         id="path650-3"
         sodipodi:type="arc"
         sodipodi:cx="291.23001"
         sodipodi:cy="27.537094"
         sodipodi:rx="13.105959"
         sodipodi:ry="13.663995"
         sodipodi:start="0"
         sodipodi:end="6.2629329"
         sodipodi:open="true"
         sodipodi:arc-type="arc"
         d="m 304.33597,27.537094 a 13.105959,13.663995 0 0 1 -13.0396,13.66382 13.105959,13.663995 0 0 1 -13.17165,-13.525458 13.105959,13.663995 0 0 1 12.90623,-13.80078 13.105959,13.663995 0 0 1 13.30233,13.385708" /><path
         style="fill:#e6e6e6;stroke-width:0.728752;stroke-linecap:round;stroke-linejoin:round"
         id="path650-2"
         sodipodi:type="arc"
         sodipodi:cx="416.15936"
         sodipodi:cy="27.537094"
         sodipodi:rx="13.105959"
         sodipodi:ry="13.663995"
         sodipodi:start="0"
         sodipodi:end="6.2629329"
         sodipodi:open="true"
         sodipodi:arc-type="arc"
         d="m 429.26532,27.537094 a 13.105959,13.663995 0 0 1 -13.0396,13.66382 13.105959,13.663995 0 0 1 -13.17164,-13.525458 13.105959,13.663995 0 0 1 12.90622,-13.80078 13.105959,13.663995 0 0 1 13.30233,13.385708" /><path
         style="fill:#e6e6e6;stroke-width:0.728752;stroke-linecap:round;stroke-linejoin:round"
         id="path650-4-3"
         sodipodi:type="arc"
         sodipodi:cx="541.08868"
         sodipodi:cy="27.537094"
         sodipodi:rx="13.105959"
         sodipodi:ry="13.663995"
         sodipodi:start="0"
         sodipodi:end="6.2629329"
         sodipodi:open="true"
         sodipodi:arc-type="arc"
         d="m 554.19464,27.537094 a 13.105959,13.663995 0 0 1 -13.0396,13.66382 13.105959,13.663995 0 0 1 -13.17164,-13.525458 13.105959,13.663995 0 0 1 12.90622,-13.80078 13.105959,13.663995 0 0 1 13.30234,13.385708" /><path
         style="fill:#e6e6e6;stroke-width:0.728752;stroke-linecap:round;stroke-linejoin:round"
         id="path650-3-4"
         sodipodi:type="arc"
         sodipodi:cx="666.01801"
         sodipodi:cy="27.537094"
         sodipodi:rx="13.105959"
         sodipodi:ry="13.663995"
         sodipodi:start="0"
         sodipodi:end="6.2629329"
         sodipodi:open="true"
         sodipodi:arc-type="arc"
         d="m 679.12396,27.537094 a 13.105959,13.663995 0 0 1 -13.0396,13.66382 13.105959,13.663995 0 0 1 -13.17164,-13.525458 13.105959,13.663995 0 0 1 12.90622,-13.80078 13.105959,13.663995 0 0 1 13.30234,13.385708" /></g></g><g
     inkscape:groupmode="layer"
     id="layer2"
     inkscape:label="Aktive LZP"
     transform="translate(50.303259,-4.3280072e-4)"><text
       xml:space="preserve"
       style="font-style:normal;font-variant:normal;font-weight:bold;font-stretch:normal;font-size:16px;line-height:1.4;font-family:Arial;-inkscape-font-specification:'Arial Bold';text-align:center;letter-spacing:0.5px;text-anchor:middle;fill:#000000;stroke-linecap:round;stroke-linejoin:round"
       x="54.634266"
       y="68.341835"
       id="text487"><tspan
         sodipodi:role="line"
         id="tspan485"
         x="54.634266"
         y="68.341835"
         style="line-height:1.4;letter-spacing:0.5px">Identifizierung und </tspan><tspan
         sodipodi:role="line"
         x="54.884266"
         y="90.741837"
         id="tspan1"
         style="line-height:1.4;letter-spacing:0.5px">Bedarfsmeldung</tspan></text><g
       id="g2036"
       transform="matrix(0.76036047,0,0,0.76059998,-338.42768,-361.283)"
       style="stroke-width:1.31495"><path
         style="fill:#477d39;fill-opacity:1;stroke-width:1.15254;stroke-linecap:round;stroke-linejoin:round"
         id="path650-3-4-6"
         sodipodi:type="arc"
         sodipodi:cx="514.40887"
         sodipodi:cy="511.20181"
         sodipodi:rx="17.975359"
         sodipodi:ry="18.82987"
         sodipodi:start="0"
         sodipodi:end="6.2629329"
         sodipodi:open="true"
         sodipodi:arc-type="arc"
         d="m 532.38423,511.20181 a 17.975359,18.82987 0 0 1 -17.88434,18.82963 17.975359,18.82987 0 0 1 -18.06545,-18.63896 17.975359,18.82987 0 0 1 17.70141,-19.01837 17.975359,18.82987 0 0 1 18.2447,18.44638" /><path
         style="fill:none;fill-opacity:1;stroke:#477d39;stroke-width:3.72745;stroke-linecap:round;stroke-linejoin:round;stroke-dasharray:none;stroke-opacity:1"
         id="path2010-7"
         sodipodi:type="arc"
         sodipodi:cx="514.40887"
         sodipodi:cy="511.20184"
         sodipodi:rx="26.717842"
         sodipodi:ry="26.71784"
         sodipodi:start="0"
         sodipodi:end="6.2629329"
         sodipodi:open="true"
         sodipodi:arc-type="arc"
         d="m 541.12672,511.20184 a 26.717842,26.71784 0 0 1 -26.58257,26.7175 26.717842,26.71784 0 0 1 -26.85175,-26.44695 26.717842,26.71784 0 0 1 26.31066,-26.9853 26.717842,26.71784 0 0 1 27.11818,26.17369" /></g></g></svg>
