{
  "$schema": "https://docs.renovatebot.com/renovate-schema.json",
  "extends": [
    "config:base",
    "local>fit-connect/renovate/renovate-config"
  ],
  "schedule": ["every weekend"],
  "packageRules": [
    {
      "updateTypes": ["minor", "patch", "pin", "digest"],
      "groupName": "all dependencies",
      "groupSlug": "all"
    }
  ],
  "prHourlyLimit": 0,
  "prConcurrentLimit": 0
}