<?xml version="1.0" encoding="utf-8"?>
<!-- Generator: Adobe Illustrator 25.3.0, SVG Export Plug-In . SVG Version: 6.00 Build 0)  -->
<svg version="1.1" id="Ebene_1" xmlns="http://www.w3.org/2000/svg" xmlns:xlink="http://www.w3.org/1999/xlink" x="0px" y="0px"
	 viewBox="0 0 128 102" style="enable-background:new 0 0 128 102;" xml:space="preserve">
<style type="text/css">
	.st0{fill-rule:evenodd;clip-rule:evenodd;}
	.st1{fill-rule:evenodd;clip-rule:evenodd;fill:#BF2026;}
	.st2{fill-rule:evenodd;clip-rule:evenodd;fill:#F8D200;}
</style>
<path id="Fill-1" class="st0" d="M40.7,57.2c2.2,0,3.9,1.8,3.9,3.9c0,2.2-1.8,3.9-3.9,3.9c-2.2,0-3.9-1.8-3.9-3.9
	C36.8,58.9,38.5,57.2,40.7,57.2 M40.7,67.3c3.4,0,6.2-2.8,6.2-6.2c0-3.4-2.8-6.2-6.2-6.2c-3.4,0-6.2,2.8-6.2,6.2
	C34.5,64.5,37.3,67.3,40.7,67.3"/>
<path id="Fill-3" class="st0" d="M45.1,69.6h-8.4c-2.5,0-4.5,2-4.5,4.5v8c0,2.2,1.4,4.4,4,4.4c0,0,0.4,0,0.5,0v14.8H39l0-17h-2.2
	c-1.2,0-2.3-1-2.3-2.2v-8c0-1.3,1-2.3,2.3-2.3h7.9c1.3,0,2.3,1,2.3,2.3V82c0,1.2-1,2.2-2.3,2.2h-2.2l0,17h2.2V86.5
	c2.6-0.1,4.5-2.2,4.5-4.4v-8C49.2,71.6,47.6,69.6,45.1,69.6"/>
<path id="Fill-5" class="st1" d="M44.9,40.9c0,2.2-1.8,3.9-3.9,3.9c-2.2,0-3.9-1.8-3.9-3.9c0-2.2,1.8-3.9,3.9-3.9
	C43.1,37,44.9,38.7,44.9,40.9 M34.8,40.9c0,3.4,2.8,6.2,6.2,6.2c3.4,0,6.2-2.8,6.2-6.2c0-3.4-2.8-6.2-6.2-6.2
	C37.6,34.7,34.8,37.5,34.8,40.9"/>
<path id="Fill-7" class="st1" d="M32.5,45.3V37c0-2.5-2-4.5-4.5-4.5h-8c-2.2,0-4.4,1.4-4.4,4c0,0,0,0.4,0,0.5H0.8v2.2l17,0V37
	c0-1.2,1-2.3,2.2-2.3h8c1.3,0,2.3,1,2.3,2.3v7.9c0,1.3-1,2.3-2.3,2.3h-7.9c-1.2,0-2.2-1-2.2-2.3v-2.2l-17,0V45h14.8
	c0.1,2.6,2.2,4.5,4.4,4.5h8C30.5,49.4,32.5,47.8,32.5,45.3"/>
<path id="Fill-9" class="st2" d="M59.5,44.7c-2.2,0-3.9-1.8-3.9-3.9c0-2.2,1.8-3.9,3.9-3.9c2.2,0,3.9,1.8,3.9,3.9
	C63.4,43,61.6,44.7,59.5,44.7 M59.5,34.6c-3.4,0-6.2,2.8-6.2,6.2c0,3.4,2.8,6.2,6.2,6.2c3.4,0,6.2-2.8,6.2-6.2
	C65.6,37.4,62.9,34.6,59.5,34.6"/>
<path id="Fill-11" class="st2" d="M55,32.3h8.4c2.5,0,4.5-2,4.5-4.5v-8c0-2.2-1.4-4.4-4-4.4c0,0-0.4,0-0.5,0V0.6h-2.2l0,17h2.2
	c1.2,0,2.3,1,2.3,2.2v8c0,1.3-1,2.3-2.3,2.3h-7.9c-1.3,0-2.3-1-2.3-2.3v-7.9c0-1.2,1-2.2,2.3-2.2h2.2l0-17h-2.2v14.8
	c-2.6,0.1-4.5,2.2-4.5,4.4v8C50.9,30.3,52.5,32.3,55,32.3"/>
<path id="Fill-13" class="st0" d="M59.4,67.5h2.3c0,0,0,0,0,0v-5.6H66l0,0V60c0,0,0,0,0,0h-4.2v-2.8v0h7.7h0V55h0h-10V67.5z"/>
<polygon id="Fill-16" class="st0" points="78.8,55 78.8,67.5 76.4,67.5 76.4,55 "/>
<polygon id="Fill-17" class="st0" points="90.1,67.5 90.1,57.3 85.7,57.3 85.7,55 96.5,55 96.5,57.3 92.4,57.3 92.4,67.5 "/>
<polygon id="Fill-18" class="st0" points="108.4,66.1 106.8,67.7 100.2,61.2 106.5,54.8 108.2,56.4 103.5,61.2 "/>
<path id="Fill-19" class="st0" d="M120.1,57.3c2.2,0,4,1.8,4,4c0,2.2-1.8,4-4,4c-2.2,0-4-1.8-4-4C116.1,59,117.9,57.3,120.1,57.3
	 M120.1,67.5c3.5,0,6.3-2.8,6.3-6.3c0-3.5-2.8-6.3-6.3-6.3c-3.5,0-6.3,2.8-6.3,6.3C113.8,64.7,116.6,67.5,120.1,67.5"/>
</svg>
