<?xml version="1.0" encoding="UTF-8" standalone="no"?>
<!-- Created with Inkscape (http://www.inkscape.org/) -->

<svg
   width="20.902mm"
   height="20.902mm"
   viewBox="0 0 20.902 20.902001"
   version="1.1"
   id="svg1"
   inkscape:version="1.3 (0e150ed6c4, 2023-07-21)"
   sodipodi:docname="contact.svg"
   xmlns:inkscape="http://www.inkscape.org/namespaces/inkscape"
   xmlns:sodipodi="http://sodipodi.sourceforge.net/DTD/sodipodi-0.dtd"
   xmlns="http://www.w3.org/2000/svg"
   xmlns:svg="http://www.w3.org/2000/svg">
  <sodipodi:namedview
     id="namedview1"
     pagecolor="#ffffff"
     bordercolor="#000000"
     borderopacity="0.25"
     inkscape:showpageshadow="2"
     inkscape:pageopacity="0.0"
     inkscape:pagecheckerboard="0"
     inkscape:deskcolor="#d1d1d1"
     inkscape:document-units="mm"
     inkscape:zoom="6.5361347"
     inkscape:cx="125.45641"
     inkscape:cy="63.416685"
     inkscape:window-width="3840"
     inkscape:window-height="1511"
     inkscape:window-x="-9"
     inkscape:window-y="-9"
     inkscape:window-maximized="1"
     inkscape:current-layer="g3" />
  <defs
     id="defs1" />
  <g
     inkscape:label="Ebene 1"
     inkscape:groupmode="layer"
     id="layer1"
     transform="translate(-37.158875,-62.754448)">
    <g
       transform="matrix(0.26458333,0,0,0.26458333,-46.302084,27.516667)"
       id="g3">
      <path
         d="m 315.443,208.475 v 0 h 79 v -5 h -79 z"
         stroke="#000000"
         stroke-width="0"
         stroke-linejoin="round"
         stroke-miterlimit="10"
         fill-rule="evenodd"
         id="path1"
         sodipodi:nodetypes="cccccc" />
      <path
         d="m 334.121,199.476 h -2 v -9.537 c 0,-4.4 3.16,-8.37888 7.62,-8.37888 h 31.3 c 4.459,0 7.721,3.97888 7.721,8.37888 v 9.537 h 6.68 v -9.537 c 0,-8.6 -3.675,-14.463 -12.493,-14.463 h -33.595 c -8.716,0 -13.912,5.863 -13.912,14.463 v 9.537 z"
         stroke="#000000"
         stroke-width="0"
         stroke-linejoin="round"
         stroke-miterlimit="10"
         fill-rule="evenodd"
         id="path2"
         sodipodi:nodetypes="ccssssccsssscc" />
      <path
         d="m 368.79192,153.61377 c 0,7.83889 -6.17378,14.19355 -13.78801,14.19355 -7.61505,0 -13.78883,-6.35466 -13.78883,-14.19355 0,-7.83808 6.17378,-14.19355 13.78883,-14.19355 7.61423,0 13.78801,6.35547 13.78801,14.19355 z"
         stroke="#000000"
         stroke-width="9.64567"
         stroke-linecap="round"
         stroke-linejoin="round"
         stroke-miterlimit="10"
         fill="none"
         fill-rule="evenodd"
         id="path3"
         style="stroke-width:4.45099;stroke-dasharray:none" />
    </g>
  </g>
</svg>
