<?xml version="1.0" encoding="UTF-8" standalone="no"?>
<!-- Created with Inkscape (http://www.inkscape.org/) -->

<svg
   width="350mm"
   height="144.19792mm"
   viewBox="0 0 350 144.19792"
   version="1.1"
   id="svg1"
   inkscape:version="1.3 (0e150ed6c4, 2023-07-21)"
   sodipodi:docname="Besprechungen-Timeline_dark-mode.svg"
   xmlns:inkscape="http://www.inkscape.org/namespaces/inkscape"
   xmlns:sodipodi="http://sodipodi.sourceforge.net/DTD/sodipodi-0.dtd"
   xmlns:xlink="http://www.w3.org/1999/xlink"
   xmlns="http://www.w3.org/2000/svg"
   xmlns:svg="http://www.w3.org/2000/svg">
  <sodipodi:namedview
     id="namedview1"
     pagecolor="#ffffff"
     bordercolor="#000000"
     borderopacity="0.25"
     inkscape:showpageshadow="2"
     inkscape:pageopacity="0.0"
     inkscape:pagecheckerboard="0"
     inkscape:deskcolor="#d1d1d1"
     inkscape:document-units="mm"
     inkscape:zoom="1.1861323"
     inkscape:cx="765.93479"
     inkscape:cy="126.46144"
     inkscape:window-width="2632"
     inkscape:window-height="1250"
     inkscape:window-x="243"
     inkscape:window-y="243"
     inkscape:window-maximized="0"
     inkscape:current-layer="layer1"
     showgrid="false" />
  <defs
     id="defs1">
    <linearGradient
       x1="131"
       y1="187"
       x2="1265"
       y2="187"
       gradientUnits="userSpaceOnUse"
       spreadMethod="reflect"
       id="fill0"
       gradientTransform="matrix(0.27336861,0,0,0.26458333,-120.21337,-18.520834)">
      <stop
         offset="0"
         stop-color="#75829F"
         id="stop1" />
      <stop
         offset="0.02"
         stop-color="#74819E"
         id="stop2" />
      <stop
         offset="0.04"
         stop-color="#74819E"
         id="stop3" />
      <stop
         offset="0.06"
         stop-color="#74819E"
         id="stop4" />
      <stop
         offset="0.08"
         stop-color="#74819E"
         id="stop5" />
      <stop
         offset="0.1"
         stop-color="#74819E"
         id="stop6" />
      <stop
         offset="0.12"
         stop-color="#74819E"
         id="stop7" />
      <stop
         offset="0.14"
         stop-color="#74809D"
         id="stop8" />
      <stop
         offset="0.16"
         stop-color="#73809D"
         id="stop9" />
      <stop
         offset="0.18"
         stop-color="#73809C"
         id="stop10" />
      <stop
         offset="0.2"
         stop-color="#737F9C"
         id="stop11" />
      <stop
         offset="0.22"
         stop-color="#727F9C"
         id="stop12" />
      <stop
         offset="0.24"
         stop-color="#727F9B"
         id="stop13" />
      <stop
         offset="0.26"
         stop-color="#717E9A"
         id="stop14" />
      <stop
         offset="0.28"
         stop-color="#717E9A"
         id="stop15" />
      <stop
         offset="0.3"
         stop-color="#717D99"
         id="stop16" />
      <stop
         offset="0.32"
         stop-color="#707D98"
         id="stop17" />
      <stop
         offset="0.34"
         stop-color="#6F7C98"
         id="stop18" />
      <stop
         offset="0.36"
         stop-color="#6F7B97"
         id="stop19" />
      <stop
         offset="0.38"
         stop-color="#6E7B96"
         id="stop20" />
      <stop
         offset="0.4"
         stop-color="#6E7A95"
         id="stop21" />
      <stop
         offset="0.42"
         stop-color="#6D7994"
         id="stop22" />
      <stop
         offset="0.44"
         stop-color="#6C7894"
         id="stop23" />
      <stop
         offset="0.46"
         stop-color="#6C7893"
         id="stop24" />
      <stop
         offset="0.48"
         stop-color="#6B7792"
         id="stop25" />
      <stop
         offset="0.5"
         stop-color="#6A7691"
         id="stop26" />
      <stop
         offset="0.52"
         stop-color="#697590"
         id="stop27" />
      <stop
         offset="0.54"
         stop-color="#69748E"
         id="stop28" />
      <stop
         offset="0.56"
         stop-color="#68738D"
         id="stop29" />
      <stop
         offset="0.58"
         stop-color="#67728C"
         id="stop30" />
      <stop
         offset="0.6"
         stop-color="#66718B"
         id="stop31" />
      <stop
         offset="0.62"
         stop-color="#65708A"
         id="stop32" />
      <stop
         offset="0.64"
         stop-color="#646F88"
         id="stop33" />
      <stop
         offset="0.66"
         stop-color="#636E87"
         id="stop34" />
      <stop
         offset="0.68"
         stop-color="#626D86"
         id="stop35" />
      <stop
         offset="0.7"
         stop-color="#616C84"
         id="stop36" />
      <stop
         offset="0.72"
         stop-color="#606B83"
         id="stop37" />
      <stop
         offset="0.74"
         stop-color="#5F6A82"
         id="stop38" />
      <stop
         offset="0.76"
         stop-color="#5E6880"
         id="stop39" />
      <stop
         offset="0.78"
         stop-color="#5D677E"
         id="stop40" />
      <stop
         offset="0.8"
         stop-color="#5B667D"
         id="stop41" />
      <stop
         offset="0.82"
         stop-color="#5A657B"
         id="stop42" />
      <stop
         offset="0.84"
         stop-color="#59637A"
         id="stop43" />
      <stop
         offset="0.86"
         stop-color="#586278"
         id="stop44" />
      <stop
         offset="0.88"
         stop-color="#576076"
         id="stop45" />
      <stop
         offset="0.9"
         stop-color="#555F75"
         id="stop46" />
      <stop
         offset="0.92"
         stop-color="#545E73"
         id="stop47" />
      <stop
         offset="0.94"
         stop-color="#535C71"
         id="stop48" />
      <stop
         offset="0.96"
         stop-color="#515B6F"
         id="stop49" />
      <stop
         offset="0.98"
         stop-color="#50596D"
         id="stop50" />
      <stop
         offset="1"
         stop-color="#4F586C"
         id="stop51" />
    </linearGradient>
  </defs>
  <g
     inkscape:groupmode="layer"
     id="layer2"
     inkscape:label="Hintergrund"
     sodipodi:insensitive="true">
    <rect
       x="-120.65"
       y="15.345832"
       width="350"
       height="144.19792"
       fill="#313847"
       id="rect51"
       style="display:inline;stroke-width:0.264583"
       transform="translate(120.65,-15.345832)" />
  </g>
  <g
     inkscape:label="Ebene 1"
     inkscape:groupmode="layer"
     id="layer1"
     transform="translate(120.65,-15.345832)"
     style="display:inline">
    <path
       d="M -84.402084,24.129999 H 213.84307 v -4.550833 l 11.75486,11.377083 -11.75486,11.377083 V 37.782499 H -84.402084 Z"
       fill="url(#fill0)"
       fill-rule="evenodd"
       id="path51"
       style="fill:#00446b;stroke-width:0.5;fill-opacity:1;stroke:none;stroke-opacity:1;stroke-dasharray:none" />
    <text
       fill="#f2f2f2"
       font-family="Aptos, Aptos_MSFontService, sans-serif"
       font-weight="700"
       font-size="4.23333px"
       id="text51"
       x="191.9314"
       y="23.018749"
       style="stroke-width:0.264583;fill:#d6d6d6">Zeit</text>
    <text
       fill="#f2f2f2"
       font-family="Aptos, Aptos_MSFontService, sans-serif"
       font-style="italic"
       font-weight="700"
       font-size="4.23333px"
       id="text52"
       x="200.70233"
       y="23.018749"
       style="stroke-width:0.264583;fill:#d6d6d6">t</text>
    <path
       d="m -115.09375,23.30979 c 0,-1.621895 1.39857,-2.936874 3.12382,-2.936874 h 47.223191 c 1.725137,0 3.123822,1.314979 3.123822,2.936874 v 23.495 c 0,1.621896 -1.398685,2.936875 -3.123822,2.936875 h -47.223191 c -1.72525,0 -3.12382,-1.314979 -3.12382,-2.936875 z"
       stroke="#4e5567"
       stroke-width="0.529167"
       stroke-miterlimit="8"
       fill="#374b93"
       fill-rule="evenodd"
       id="path52"
       style="fill:#003b5c;fill-opacity:1" />
    <text
       fill="#f2f2f2"
       font-family="Aptos, Aptos_MSFontService, sans-serif"
       font-weight="700"
       font-size="6.35px"
       id="text53"
       x="-111.42094"
       y="29.104166"
       style="stroke-width:0.264583;fill:#d6d6d6">Themen</text>
    <text
       fill="#f2f2f2"
       font-family="Aptos, Aptos_MSFontService, sans-serif"
       font-weight="700"
       font-size="6.35px"
       id="text55"
       x="-111.42094"
       y="35.983334"
       style="stroke-width:0.264583;fill:#d6d6d6">sammlung</text>
    <path
       d="m -107.95,45.640078 c 0,-3.141421 2.77186,-5.687993 6.19114,-5.687993 h 49.529659 c 3.419335,0 6.1912,2.546572 6.1912,5.687993 V 150.4161 c 0,3.14142 -2.771865,5.68799 -6.1912,5.68799 h -49.529659 c -3.41928,0 -6.19114,-2.54657 -6.19114,-5.68799 z"
       fill="#3e4555"
       fill-rule="evenodd"
       fill-opacity="0.898039"
       id="path55"
       style="stroke-width:0.264583" />
    <a
       id="a14"
       xlink:href="submit">
      <g
         id="g1"
         transform="matrix(0.26458333,0,0,0.26458333,-120.65,-18.520834)">
        <text
           fill="#f2f2f2"
           font-family="Aptos, Aptos_MSFontService, sans-serif"
           font-weight="400"
           font-size="16px"
           id="text56"
           x="58.077599"
           y="278"
           style="fill:#d6d6d6">•</text>
        <text
           fill="#f2f2f2"
           font-family="Aptos, Aptos_MSFontService, sans-serif"
           font-weight="700"
           font-size="16px"
           id="text57"
           x="70.077599"
           y="278"
           style="fill:#d6d6d6">Sitzungsthemen</text>
        <text
           fill="#f2f2f2"
           font-family="Aptos, Aptos_MSFontService, sans-serif"
           font-weight="700"
           font-size="16px"
           id="text58"
           x="70.077599"
           y="296"
           style="fill:#d6d6d6">einreichen</text>
        <text
           fill="#f2f2f2"
           font-family="Aptos, Aptos_MSFontService, sans-serif"
           font-weight="400"
           font-size="16px"
           id="text59"
           x="70.077599"
           y="313"
           style="fill:#d6d6d6">(Mitglieder)</text>
      </g>
    </a>
    <a
       id="a15"
       xlink:href="#sitzungsthemen-sammeln">
      <g
         id="g2"
         transform="matrix(0.26458333,0,0,0.26458333,-120.65,-18.520834)">
        <text
           fill="#f2f2f2"
           font-family="Aptos, Aptos_MSFontService, sans-serif"
           font-weight="400"
           font-size="16px"
           id="text60"
           x="58.077599"
           y="354"
           style="fill:#d6d6d6">•</text>
        <text
           fill="#f2f2f2"
           font-family="Aptos, Aptos_MSFontService, sans-serif"
           font-weight="700"
           font-size="16px"
           id="text61"
           x="70.077599"
           y="354"
           style="fill:#d6d6d6">Sitzungsthemen</text>
        <text
           fill="#f2f2f2"
           font-family="Aptos, Aptos_MSFontService, sans-serif"
           font-weight="700"
           font-size="16px"
           id="text62"
           x="70.077599"
           y="372"
           style="fill:#d6d6d6">sammeln</text>
        <text
           fill="#f2f2f2"
           font-family="Aptos, Aptos_MSFontService, sans-serif"
           font-weight="400"
           font-size="16px"
           id="text63"
           x="70.077599"
           y="389"
           style="fill:#d6d6d6">(Geschäftsstelle)</text>
      </g>
    </a>
    <path
       d="m -56.356251,27.410832 h 11.377083 v -2.54 l 6.35,6.35 -6.35,6.35 v -2.54 h -11.377083 z"
       fill="#aab6c1"
       fill-rule="evenodd"
       id="path63"
       style="stroke-width:0.264583;fill:#bcbcbc" />
    <path
       d="m -31.220834,23.30979 c 0,-1.621895 1.398682,-2.936874 3.123821,-2.936874 h 47.223187 c 1.725139,0 3.123822,1.314979 3.123822,2.936874 v 23.495 c 0,1.621896 -1.398683,2.936875 -3.123822,2.936875 h -47.223187 c -1.725139,0 -3.123821,-1.314979 -3.123821,-2.936875 z"
       stroke="#4e5567"
       stroke-width="0.529167"
       stroke-miterlimit="8"
       fill="#374b93"
       fill-rule="evenodd"
       id="path64"
       style="fill:#003b5c;fill-opacity:1" />
    <text
       fill="#f2f2f2"
       font-family="Aptos, Aptos_MSFontService, sans-serif"
       font-weight="700"
       font-size="6.35px"
       id="text64"
       x="-27.566938"
       y="29.104166"
       style="stroke-width:0.264583;fill:#d6d6d6">Vorbereitung</text>
    <path
       d="m -23.283335,45.480601 c 0,-3.053443 2.771757,-5.528516 6.1912,-5.528516 h 49.529603 c 3.419448,0 6.191202,2.475073 6.191202,5.528516 V 150.57557 c 0,3.05345 -2.771754,5.52852 -6.191202,5.52852 h -49.529603 c -3.419443,0 -6.1912,-2.47507 -6.1912,-5.52852 z"
       fill="#3e4555"
       fill-rule="evenodd"
       fill-opacity="0.898039"
       id="path65"
       style="stroke-width:0.264583" />
    <a
       id="a16"
       xlink:href="#tagesordnungsentwurf-abstimmen">
      <g
         id="g3">
        <text
           fill="#f2f2f2"
           font-family="Aptos, Aptos_MSFontService, sans-serif"
           font-weight="400"
           font-size="4.23333px"
           id="text65"
           x="-19.804857"
           y="56.356247"
           style="stroke-width:0.264583;fill:#d6d6d6">•</text>
        <text
           fill="#f2f2f2"
           font-family="Aptos, Aptos_MSFontService, sans-serif"
           font-weight="700"
           font-size="4.23333px"
           id="text66"
           x="-16.629856"
           y="56.356247"
           style="stroke-width:0.264583;fill:#d6d6d6">Tagesordnungsentwurf</text>
        <text
           fill="#f2f2f2"
           font-family="Aptos, Aptos_MSFontService, sans-serif"
           font-weight="700"
           font-size="4.23333px"
           id="text67"
           x="-16.629856"
           y="61.118748"
           style="stroke-width:0.264583;fill:#d6d6d6">abstimmen</text>
        <text
           fill="#f2f2f2"
           font-family="Aptos, Aptos_MSFontService, sans-serif"
           font-weight="400"
           font-size="4.23333px"
           id="text68"
           x="-16.629856"
           y="65.616669"
           style="stroke-width:0.264583;fill:#d6d6d6">(Vorsitz)</text>
      </g>
    </a>
    <a
       id="a17"
       xlink:href="#tagesordnungsentwurf-verteilen">
      <g
         id="g4">
        <text
           fill="#f2f2f2"
           font-family="Aptos, Aptos_MSFontService, sans-serif"
           font-weight="400"
           font-size="4.23333px"
           id="text69"
           x="-19.804857"
           y="76.464584"
           style="stroke-width:0.264583;fill:#d6d6d6">•</text>
        <text
           fill="#f2f2f2"
           font-family="Aptos, Aptos_MSFontService, sans-serif"
           font-weight="700"
           font-size="4.23333px"
           id="text70"
           x="-16.629856"
           y="76.464584"
           style="stroke-width:0.264583;fill:#d6d6d6">Tagesordnungsentwurf</text>
        <text
           fill="#f2f2f2"
           font-family="Aptos, Aptos_MSFontService, sans-serif"
           font-weight="700"
           font-size="4.23333px"
           id="text71"
           x="-16.629856"
           y="81.227081"
           style="stroke-width:0.264583;fill:#d6d6d6">verteilen</text>
        <text
           fill="#f2f2f2"
           font-family="Aptos, Aptos_MSFontService, sans-serif"
           font-weight="400"
           font-size="4.23333px"
           id="text72"
           x="-16.629856"
           y="85.724998"
           style="stroke-width:0.264583;fill:#d6d6d6">(Geschäftsstelle)</text>
      </g>
    </a>
    <a
       id="a18"
       xlink:href="#g%C3%A4ste-einladen-lassen">
      <g
         id="g5">
        <text
           fill="#f2f2f2"
           font-family="Aptos, Aptos_MSFontService, sans-serif"
           font-weight="400"
           font-size="4.23333px"
           id="text73"
           x="-19.804857"
           y="96.572914"
           style="stroke-width:0.264583;fill:#d6d6d6">•</text>
        <text
           fill="#f2f2f2"
           font-family="Aptos, Aptos_MSFontService, sans-serif"
           font-weight="700"
           font-size="4.23333px"
           id="text74"
           x="-16.629856"
           y="96.572914"
           style="stroke-width:0.264583;fill:#d6d6d6">Gäste einladen lassen</text>
        <text
           fill="#f2f2f2"
           font-family="Aptos, Aptos_MSFontService, sans-serif"
           font-weight="400"
           font-size="4.23333px"
           id="text75"
           x="-16.629856"
           y="101.33541"
           style="stroke-width:0.264583;fill:#d6d6d6">(Mitglieder u. Vertreter)</text>
      </g>
    </a>
    <a
       id="a19"
       xlink:href="#sitzungsunterlagen-bereitstellen">
      <g
         id="g6">
        <text
           fill="#f2f2f2"
           font-family="Aptos, Aptos_MSFontService, sans-serif"
           font-weight="400"
           font-size="4.23333px"
           id="text76"
           x="-19.804857"
           y="112.18333"
           style="stroke-width:0.264583;fill:#d6d6d6">•</text>
        <text
           fill="#f2f2f2"
           font-family="Aptos, Aptos_MSFontService, sans-serif"
           font-weight="700"
           font-size="4.23333px"
           id="text77"
           x="-16.629856"
           y="112.18333"
           style="stroke-width:0.264583;fill:#d6d6d6">Sitzungsunterlagen</text>
        <text
           fill="#f2f2f2"
           font-family="Aptos, Aptos_MSFontService, sans-serif"
           font-weight="700"
           font-size="4.23333px"
           id="text78"
           x="-16.629856"
           y="116.94583"
           style="stroke-width:0.264583;fill:#d6d6d6">bereitstellen</text>
        <text
           fill="#f2f2f2"
           font-family="Aptos, Aptos_MSFontService, sans-serif"
           font-weight="400"
           font-size="4.23333px"
           id="text79"
           x="-16.629856"
           y="121.44375"
           style="stroke-width:0.264583;fill:#d6d6d6">(Referenten)</text>
      </g>
    </a>
    <a
       id="a20"
       xlink:href="#finale-tagesordnung-verteilen">
      <g
         id="g7">
        <text
           fill="#f2f2f2"
           font-family="Aptos, Aptos_MSFontService, sans-serif"
           font-weight="400"
           font-size="4.23333px"
           id="text80"
           x="-19.804857"
           y="132.29166"
           style="stroke-width:0.264583;fill:#d6d6d6">•</text>
        <text
           fill="#f2f2f2"
           font-family="Aptos, Aptos_MSFontService, sans-serif"
           font-weight="700"
           font-size="4.23333px"
           id="text81"
           x="-16.629856"
           y="132.29166"
           style="stroke-width:0.264583;fill:#d6d6d6">Finale Tagesordnung</text>
        <text
           fill="#f2f2f2"
           font-family="Aptos, Aptos_MSFontService, sans-serif"
           font-weight="700"
           font-size="4.23333px"
           id="text82"
           x="-16.629856"
           y="137.05417"
           style="stroke-width:0.264583;fill:#d6d6d6">verteilen</text>
        <text
           fill="#f2f2f2"
           font-family="Aptos, Aptos_MSFontService, sans-serif"
           font-weight="400"
           font-size="4.23333px"
           id="text83"
           x="-16.629856"
           y="141.55208"
           style="stroke-width:0.264583;fill:#d6d6d6">(Geschäftsstelle)</text>
      </g>
    </a>
    <path
       d="m 27.252081,27.410832 h 11.1125 v -2.54 l 6.35,6.35 -6.35,6.35 v -2.54 h -11.1125 z"
       fill="#aab6c1"
       fill-rule="evenodd"
       id="path83"
       style="stroke-width:0.264583;fill:#bcbcbc" />
    <path
       d="m 51.858329,23.30979 c 0,-1.621895 1.398685,-2.936874 3.123821,-2.936874 h 47.22319 c 1.72514,0 3.12382,1.314979 3.12382,2.936874 v 23.495 c 0,1.621896 -1.39868,2.936875 -3.12382,2.936875 H 54.98215 c -1.725136,0 -3.123821,-1.314979 -3.123821,-2.936875 z"
       stroke="#4e5567"
       stroke-width="0.529167"
       stroke-miterlimit="8"
       fill="#374b93"
       fill-rule="evenodd"
       id="path84"
       style="fill:#003b5c;fill-opacity:1" />
    <text
       fill="#f2f2f2"
       font-family="Aptos, Aptos_MSFontService, sans-serif"
       font-weight="700"
       font-size="6.35px"
       id="text84"
       x="55.387348"
       y="29.104166"
       style="stroke-width:0.264583;fill:#d6d6d6">Durchführung</text>
    <path
       d="m 58.208326,45.772976 c 0,-3.21478 2.771904,-5.820891 6.191199,-5.820891 h 49.529595 c 3.4193,0 6.1912,2.606111 6.1912,5.820891 V 150.2832 c 0,3.21478 -2.7719,5.82089 -6.1912,5.82089 H 64.399525 c -3.419295,0 -6.191199,-2.60611 -6.191199,-5.82089 z"
       fill="#3e4555"
       fill-rule="evenodd"
       fill-opacity="0.898039"
       id="path85"
       style="stroke-width:0.264583" />
    <text
       fill="#f2f2f2"
       font-family="Aptos, Aptos_MSFontService, sans-serif"
       font-weight="400"
       font-size="4.23333px"
       id="text85"
       x="60.897022"
       y="56.356247"
       style="stroke-width:0.264583;fill:#d6d6d6">•</text>
    <a
       id="a21"
       xlink:href="#sitzung-leiten">
      <g
         id="g8">
        <text
           fill="#f2f2f2"
           font-family="Aptos, Aptos_MSFontService, sans-serif"
           font-weight="700"
           font-size="4.23333px"
           id="text86"
           x="64.072021"
           y="56.356247"
           style="stroke-width:0.264583;fill:#d6d6d6">Sitzung leiten</text>
        <text
           fill="#f2f2f2"
           font-family="Aptos, Aptos_MSFontService, sans-serif"
           font-weight="400"
           font-size="4.23333px"
           id="text87"
           x="64.072021"
           y="61.118748"
           style="stroke-width:0.264583;fill:#d6d6d6">(Vorsitz)</text>
      </g>
    </a>
    <a
       id="a22"
       xlink:href="#sitzungsthemen-besprechen">
      <g
         id="g9">
        <text
           fill="#f2f2f2"
           font-family="Aptos, Aptos_MSFontService, sans-serif"
           font-weight="400"
           font-size="4.23333px"
           id="text88"
           x="60.897022"
           y="71.966667"
           style="stroke-width:0.264583;fill:#d6d6d6">•</text>
        <text
           fill="#f2f2f2"
           font-family="Aptos, Aptos_MSFontService, sans-serif"
           font-weight="700"
           font-size="4.23333px"
           id="text89"
           x="64.072021"
           y="71.966667"
           style="stroke-width:0.264583;fill:#d6d6d6">Sitzungsthemen</text>
        <text
           fill="#f2f2f2"
           font-family="Aptos, Aptos_MSFontService, sans-serif"
           font-weight="700"
           font-size="4.23333px"
           id="text90"
           x="64.072021"
           y="76.464584"
           style="stroke-width:0.264583;fill:#d6d6d6">besprechen</text>
        <text
           fill="#f2f2f2"
           font-family="Aptos, Aptos_MSFontService, sans-serif"
           font-weight="400"
           font-size="4.23333px"
           id="text91"
           x="64.072021"
           y="81.227081"
           style="stroke-width:0.264583;fill:#d6d6d6">(Alle Teilnehmer)</text>
      </g>
    </a>
    <a
       id="a23"
       xlink:href="#protokoll-f%C3%BChren">
      <g
         id="g10">
        <text
           fill="#f2f2f2"
           font-family="Aptos, Aptos_MSFontService, sans-serif"
           font-weight="400"
           font-size="4.23333px"
           id="text92"
           x="60.897022"
           y="92.074997"
           style="stroke-width:0.264583;fill:#d6d6d6">•</text>
        <text
           fill="#f2f2f2"
           font-family="Aptos, Aptos_MSFontService, sans-serif"
           font-weight="700"
           font-size="4.23333px"
           id="text93"
           x="64.072021"
           y="92.074997"
           style="stroke-width:0.264583;fill:#d6d6d6">Protokoll führen</text>
        <text
           fill="#f2f2f2"
           font-family="Aptos, Aptos_MSFontService, sans-serif"
           font-weight="400"
           font-size="4.23333px"
           id="text94"
           x="64.072021"
           y="96.572914"
           style="stroke-width:0.264583;fill:#d6d6d6">(Geschäftsstelle)</text>
      </g>
    </a>
    <path
       d="m 110.59583,27.410832 h 11.90625 v -2.54 l 6.35,6.35 -6.35,6.35 v -2.54 h -11.90625 z"
       fill="#aab6c1"
       fill-rule="evenodd"
       id="path94"
       style="stroke-width:0.264583;fill:#bcbcbc" />
    <path
       d="m 136.26041,23.30979 c 0,-1.621895 1.39868,-2.936874 3.12382,-2.936874 h 47.22319 c 1.72514,0 3.12383,1.314979 3.12383,2.936874 v 23.495 c 0,1.621896 -1.39869,2.936875 -3.12383,2.936875 h -47.22319 c -1.72514,0 -3.12382,-1.314979 -3.12382,-2.936875 z"
       stroke="#4e5567"
       stroke-width="0.529167"
       stroke-miterlimit="8"
       fill="#374b93"
       fill-rule="evenodd"
       id="path95"
       style="fill:#003b5c;fill-opacity:1" />
    <text
       fill="#f2f2f2"
       font-family="Aptos, Aptos_MSFontService, sans-serif"
       font-weight="700"
       font-size="6.35px"
       id="text95"
       x="139.90796"
       y="29.104166"
       style="stroke-width:0.264583;fill:#d6d6d6">Nachbereitung</text>
    <path
       d="m 143.13958,45.693236 c 0,-3.170656 2.77172,-5.741151 6.1912,-5.741151 h 49.5296 c 3.4195,0 6.1912,2.570495 6.1912,5.741151 V 150.36294 c 0,3.17066 -2.7717,5.74115 -6.1912,5.74115 h -49.5296 c -3.41948,0 -6.1912,-2.57049 -6.1912,-5.74115 z"
       fill="#3e4555"
       fill-rule="evenodd"
       fill-opacity="0.898039"
       id="path96"
       style="stroke-width:0.264583" />
    <a
       id="a24"
       xlink:href="#aufgaben-anlegen">
      <g
         id="g11">
        <text
           fill="#f2f2f2"
           font-family="Aptos, Aptos_MSFontService, sans-serif"
           font-weight="400"
           font-size="4.23333px"
           id="text96"
           x="145.72722"
           y="56.356247"
           style="stroke-width:0.264583;fill:#d6d6d6">•</text>
        <text
           fill="#f2f2f2"
           font-family="Aptos, Aptos_MSFontService, sans-serif"
           font-weight="700"
           font-size="4.23333px"
           id="text97"
           x="148.90221"
           y="56.356247"
           style="stroke-width:0.264583;fill:#d6d6d6">Aufgaben anlegen</text>
        <text
           fill="#f2f2f2"
           font-family="Aptos, Aptos_MSFontService, sans-serif"
           font-weight="400"
           font-size="4.23333px"
           id="text98"
           x="148.90221"
           y="61.118748"
           style="stroke-width:0.264583;fill:#d6d6d6">(Geschäftsstelle)</text>
      </g>
    </a>
    <a
       id="a25"
       xlink:href="#protokollentwurf-verteilen">
      <g
         id="g12">
        <text
           fill="#f2f2f2"
           font-family="Aptos, Aptos_MSFontService, sans-serif"
           font-weight="400"
           font-size="4.23333px"
           id="text99"
           x="145.72722"
           y="71.966667"
           style="stroke-width:0.264583;fill:#d6d6d6">•</text>
        <text
           fill="#f2f2f2"
           font-family="Aptos, Aptos_MSFontService, sans-serif"
           font-weight="700"
           font-size="4.23333px"
           id="text100"
           x="148.90221"
           y="71.966667"
           style="stroke-width:0.264583;fill:#d6d6d6">Protokollentwurf</text>
        <text
           fill="#f2f2f2"
           font-family="Aptos, Aptos_MSFontService, sans-serif"
           font-weight="700"
           font-size="4.23333px"
           id="text101"
           x="148.90221"
           y="76.464584"
           style="stroke-width:0.264583;fill:#d6d6d6">verteilen</text>
        <text
           fill="#f2f2f2"
           font-family="Aptos, Aptos_MSFontService, sans-serif"
           font-weight="400"
           font-size="4.23333px"
           id="text102"
           x="148.90221"
           y="81.227081"
           style="stroke-width:0.264583;fill:#d6d6d6">(Geschäftsstelle)</text>
      </g>
    </a>
    <a
       id="a27"
       xlink:href="#protokoll-einsehen-und-ggf-einw%C3%A4nde-erheben">
      <g
         id="g13">
        <text
           fill="#f2f2f2"
           font-family="Aptos, Aptos_MSFontService, sans-serif"
           font-weight="400"
           font-size="4.23333px"
           id="text103"
           x="145.72722"
           y="92.074997"
           style="stroke-width:0.264583;fill:#d6d6d6">•</text>
        <text
           fill="#f2f2f2"
           font-family="Aptos, Aptos_MSFontService, sans-serif"
           font-weight="700"
           font-size="4.23333px"
           id="text104"
           x="148.90221"
           y="92.074997"
           style="stroke-width:0.264583;fill:#d6d6d6">Protokoll einsehen und</text>
        <text
           fill="#f2f2f2"
           font-family="Aptos, Aptos_MSFontService, sans-serif"
           font-weight="400"
           font-size="4.23333px"
           id="text108"
           x="148.90221"
           y="101.33541"
           style="stroke-width:0.264583;fill:#d6d6d6">(Alle Teilnehmer)</text>
        <text
           fill="#f2f2f2"
           font-family="Aptos, Aptos_MSFontService, sans-serif"
           font-weight="700"
           font-size="4.23333px"
           id="text105"
           x="148.90221"
           y="96.572914"
           style="stroke-width:0.264583;fill:#d6d6d6">ggf. Einwände erheben</text>
      </g>
    </a>
    <a
       id="a28"
       xlink:href="#finales-protokoll-verteilen">
      <g
         id="g14">
        <text
           fill="#f2f2f2"
           font-family="Aptos, Aptos_MSFontService, sans-serif"
           font-weight="400"
           font-size="4.23333px"
           id="text109"
           x="145.72722"
           y="112.18333"
           style="stroke-width:0.264583;fill:#d6d6d6">•</text>
        <text
           fill="#f2f2f2"
           font-family="Aptos, Aptos_MSFontService, sans-serif"
           font-weight="700"
           font-size="4.23333px"
           id="text110"
           x="148.90221"
           y="112.18333"
           style="stroke-width:0.264583;fill:#d6d6d6">Finales Protokoll</text>
        <text
           fill="#f2f2f2"
           font-family="Aptos, Aptos_MSFontService, sans-serif"
           font-weight="700"
           font-size="4.23333px"
           id="text111"
           x="148.90221"
           y="116.94583"
           style="stroke-width:0.264583;fill:#d6d6d6">verteilen</text>
        <text
           fill="#f2f2f2"
           font-family="Aptos, Aptos_MSFontService, sans-serif"
           font-weight="400"
           font-size="4.23333px"
           id="text112"
           x="148.90221"
           y="121.44375"
           style="stroke-width:0.264583;fill:#d6d6d6">(Geschäftsstelle)</text>
      </g>
    </a>
  </g>
</svg>
