{
    "handelndePerson": {
      "beziehungZumAntragsteller": "5",
      "familienname": "Mohammad",
      "vornamen": "Ali",
      "anschrift": {
        "staat": "Vereinigtes Königreich",
        "anschriftKomplett": "1 St. Stephen's Green, Dublin 2, D02 AF30"
      },
      "kommunikation": {
        "email": "ali.mohammad@example.com",
        "telefon": "+441234567890"
      }
    },
    "antragstellendePerson": {
      "familienname": "Musterfrau",
      "vornamen": "Melanie",
      "geburtsdatum": "2000-02-29",
      "anschrift": {
        "staat": "Deutschland",
        "strasseHausnummer": "Beispielweg 5",
        "plz": "67890",
        "ort": "Beispielstadt"
      }
    },
    "dokument": {
      "typ": "vorlaufigerPersonalausweis",
      "status": "gestohlen",
      "seriennummer": "B 87654321",
      "tagDerAusstellung": "2024-03-15",
      "letzterTagDerGueltigkeit": "2024-09-15",
      "ausstellendeBehoerde": "Stadt Beispielstadt"
    },
    "meldung": {
      "anfang": "2024-06-05",
      "ort": "Beispielstadt",
      "umstaende": "Der vorläufige Personalausweis wurde während eines Einkaufs verloren.",
      "anzeige": {
        "datumDerAnzeige": "2024-06-06",
        "dienststelle": "Polizeikommissariat 14"
      }
    },
    "zustimmungOptionaleAngaben": true
  }
  