{
 "display_name":"Finanzbehörde"
,"name":"Finanzbehörde"
,"gemeindeschluessel":"02100108"
,"grundrissaktualitaet":"2020-12-09"
,"country":"Germany"
,"locality":"Hamburg"
,"postal_code":"20354"
,"street":"Neue ABC-Straße"
,"housenumber":"13"
}
