{
 "display_name":"Hauptbahnhof"
,"name":"Hauptbahnhof"
,"gemeindeschluessel":"02100114"
,"grundrissaktualitaet":"2020-12-09"
,"country":"Germany"
,"locality":"Hamburg"
,"postal_code":"20099"
,"street":"Hachmannplatz"
,"housenumber":"10"
}
