{
 "display_name":"Hochbahnhaus"
,"name":"Hochbahnhaus"
,"gemeindeschluessel":"02100101"
,"grundrissaktualitaet":"2020-12-09"
,"country":"Germany"
,"locality":"Hamburg"
,"postal_code":"20095"
,"street":"Ida-Ehre-Platz"
,"housenumber":"4"
}
