{
    "date": "Dezember 2022",
    "bugfixes": [
        {
            "name": "Überlappende Kategorien in der Raumliste",
            "description": "Unterbereiche in der Raum- und Personenliste überlagern sich nicht mehr."
        }
    ],
    "improvements": [
        {
            "name": "Onboarding Slider Anpassungen",
            "description": "Das Onboarding bei der ersten Nutzung des BundesMessengers wurde verbessert."
        },
        {
            "name": "Teilen von gelöschten Nachrichten",
            "description": "Gelöschte Nachrichten können nun nicht mehr geteilt werden."
        }
    ]
}
