<svg width="16" height="16" viewBox="0 0 16 16" fill="none" xmlns="http://www.w3.org/2000/svg">
<path d="M2.98073 14.0004H13.0207C14.0474 14.0004 14.6874 12.8871 14.1741 12.0004L9.15407 3.32711C8.64073 2.44044 7.36073 2.44044 6.8474 3.32711L1.8274 12.0004C1.31407 12.8871 1.95407 14.0004 2.98073 14.0004V14.0004ZM8.00073 9.33378C7.63407 9.33378 7.33407 9.03378 7.33407 8.66711V7.33378C7.33407 6.96711 7.63407 6.66711 8.00073 6.66711C8.3674 6.66711 8.6674 6.96711 8.6674 7.33378V8.66711C8.6674 9.03378 8.3674 9.33378 8.00073 9.33378ZM8.6674 12.0004H7.33407V10.6671H8.6674V12.0004Z" fill="#BE7A00"/>
</svg>
