{
    "date": "Oktober 2023",
    "features": [
        {
            "name": "Nachrichten wiederherstellen",
            "description": "Bei Problemen mit nicht entschlüsselbaren Nachrichten kannst du nun in den Einstellungen unter Sicherheit deine Nachrichten wiederherstellen. Dadurch können einige Nachrichten wieder entschlüsselt werden."
        }
    ],
    "bugfixes": [
        {
            "name": "Drei-Punkte-Menu bei Sprachnachrichten",
            "description": "Ein Bug, bei dem das Drei-Punkte-Menü von Sprachnachricht immer wieder geöffnet wurde, ist behoben"
        }
    ]
}
