{
    "date": "März 2023",
    "features": [
        {
            "name": "QR Codes für Personen, Räume und Nachrichten",
            "description": "Du kannst nun deine Links für Personen, Räume und Nachrichten auch als QR Code anzeigen und versenden."
        }
    ],
    "improvements": [
        {
            "name": "Wartungsfensteranzeige angepasst",
            "description": "Wir haben die Anzeige der geplanten Wartungsfenster weiter vereinheitlicht für alle Plattformen. "
        }
    ],
    "bugfixes": [
        {
            "name": "Rolle über Benutzerprofil einstellen",
            "description": "Es ist nun wieder möglich die Rolle eines Nutzers im Raum anzupassen, sofern man die benötigten Rechte dazu hat."
        },
        {
            "name": "Willkommensbildschirm",
            "description": "Neue Nutzer sehen nun direkt den Willkommensbildschirm nach der Erstanmeldung."
        }
    ]
}
