<svg width="34" height="34" viewBox="0 0 34 34" fill="none" xmlns="http://www.w3.org/2000/svg">
<rect width="34" height="34" rx="17" fill="white"/>
<path d="M23.93 13C24.5429 14.0627 24.9032 15.2522 24.9831 16.4764C25.0629 17.7006 24.8601 18.9268 24.3903 20.0601C23.9205 21.1934 23.1964 22.2035 22.274 23.0123C21.3515 23.8211 20.2553 24.4069 19.0703 24.7244C17.8853 25.0418 16.6431 25.0825 15.4399 24.8433C14.2366 24.604 13.1045 24.0913 12.131 23.3446C11.1576 22.5979 10.3689 21.6374 9.82602 20.5372C9.2831 19.4371 9.00048 18.2268 9 17C9 16.7348 8.89464 16.4804 8.70711 16.2929C8.51957 16.1054 8.26522 16 8 16C7.73478 16 7.48043 16.1054 7.29289 16.2929C7.10536 16.4804 7 16.7348 7 17C7 22.523 11.477 27 17 27C22.523 27 27 22.523 27 17C27.0019 15.6235 26.7186 14.2616 26.168 13C25.3893 11.2164 24.1071 9.6987 22.4787 8.63295C20.8502 7.5672 18.9462 6.9997 17 7C15.4474 6.99872 13.9159 7.35951 12.5272 8.0537C11.1385 8.74789 9.93077 9.75636 9 10.999V9C9 8.73479 8.89464 8.48043 8.70711 8.2929C8.51957 8.10536 8.26522 8 8 8C7.73478 8 7.48043 8.10536 7.29289 8.2929C7.10536 8.48043 7 8.73479 7 9V13C7 13.2652 7.10536 13.5196 7.29289 13.7071C7.48043 13.8946 7.73478 14 8 14H12C12.2652 14 12.5196 13.8946 12.7071 13.7071C12.8946 13.5196 13 13.2652 13 13C13 12.7348 12.8946 12.4804 12.7071 12.2929C12.5196 12.1054 12.2652 12 12 12H10.755C11.5038 11.063 12.454 10.3068 13.5352 9.78742C14.6163 9.26805 15.8006 8.99892 17 9C18.4047 8.99938 19.7847 9.36876 21.0013 10.0709C22.2178 10.7731 23.2279 11.7834 23.93 13Z" fill="#656D77"/>
</svg>
