{
    "date": "Oktober 2023",
    "features": [
        {
            "name": "Neuer Nachrichteneditor",
            "description": "Der neue Editor erlaubt es Dir Nachrichten umfangreicher zu formatieren"
        }
    ],
    "improvements": [
        {
            "name": "Meine Notizen",
            "description": "Der Notizenraum erscheint nun in Deinen Favoriten. Du kannst ihn jederzeit mit einem Rechtsklick ausblenden und über die Einstellungen wieder einblenden"
        }
    ]
}
