<?xml version="1.0" encoding="utf-8"?>
<!-- Generator: Adobe Illustrator 26.4.1, SVG Export Plug-In . SVG Version: 6.00 Build 0)  -->
<svg version="1.1" id="图层_1" xmlns="http://www.w3.org/2000/svg" xmlns:xlink="http://www.w3.org/1999/xlink" x="0px" y="0px"
	 viewBox="0 0 850.39 255.118" style="enable-background:new 0 0 850.39 255.118;" xml:space="preserve">
<g>
	<g>
		<g>
			<g>
				<path style="fill:#C0C1C1;" d="M790.397,0H60.027c-2.309,0-4.59,0-6.892,0.012c-1.927,0.012-3.84,0.049-5.786,0.08
					c-4.19,0.105-8.432,0.363-12.616,1.113c-4.215,0.738-8.131,1.998-11.968,3.947c-3.769,1.931-7.212,4.439-10.191,7.421
					c-3.013,2.982-5.509,6.437-7.418,10.206c-1.958,3.83-3.2,7.765-3.935,11.983c-0.759,4.169-1.021,8.386-1.128,12.604
					c-0.058,1.931-0.065,3.867-0.095,5.798c0,2.281,0,4.568,0,6.874v135.049c0,2.324,0,4.599,0,6.886
					c0.031,1.955,0.037,3.849,0.095,5.804c0.108,4.218,0.369,8.435,1.128,12.604c0.735,4.218,1.977,8.171,3.935,11.989
					c1.909,3.75,4.405,7.206,7.418,10.163c2.979,3.006,6.422,5.509,10.191,7.421c3.837,1.967,7.753,3.21,11.968,3.971
					c4.184,0.75,8.426,0.997,12.616,1.113c1.946,0.043,3.858,0.067,5.786,0.067c2.303,0.013,4.584,0.013,6.892,0.013h730.37
					c2.263,0,4.562,0,6.825-0.013c1.918,0,3.886-0.025,5.804-0.067c4.218-0.116,8.448-0.363,12.592-1.113
					c4.218-0.762,8.14-2.004,12.014-3.971c3.762-1.912,7.206-4.415,10.182-7.421c3-2.957,5.496-6.413,7.439-10.163
					c1.93-3.818,3.185-7.772,3.898-11.989c0.775-4.168,1.021-8.386,1.169-12.604c0.025-1.955,0.025-3.849,0.025-5.804
					c0.049-2.287,0.049-4.562,0.049-6.886V60.038c0-2.306,0-4.593-0.049-6.874c0-1.931,0-3.867-0.025-5.798
					c-0.148-4.218-0.393-8.435-1.169-12.604c-0.713-4.218-1.967-8.153-3.898-11.983c-1.943-3.769-4.439-7.224-7.439-10.206
					c-2.976-2.982-6.419-5.49-10.182-7.421c-3.874-1.949-7.796-3.209-12.014-3.947c-4.144-0.75-8.374-1.008-12.592-1.113
					c-1.918-0.031-3.886-0.068-5.804-0.08C794.959,0,792.66,0,790.397,0L790.397,0z"/>
				<path d="M53.165,249.609c-1.918,0-3.79-0.025-5.693-0.067c-3.52-0.099-7.695-0.295-11.768-1.027
					c-3.843-0.695-7.258-1.826-10.431-3.449c-3.283-1.666-6.234-3.818-8.795-6.4c-2.607-2.557-4.75-5.496-6.425-8.792
					c-1.632-3.178-2.748-6.59-3.418-10.433c-0.768-4.236-0.965-8.534-1.048-11.805c-0.04-1.328-0.092-5.749-0.092-5.749V53.164
					c0,0,0.055-4.353,0.092-5.632c0.083-3.299,0.28-7.593,1.042-11.786c0.673-3.864,1.789-7.273,3.422-10.464
					c1.672-3.302,3.818-6.256,6.391-8.801c2.604-2.607,5.567-4.765,8.829-6.437c3.234-1.642,6.643-2.764,10.409-3.425
					c4.239-0.759,8.537-0.95,11.808-1.033l5.681-0.077h744.023l5.749,0.08c3.228,0.08,7.525,0.271,11.7,1.024
					c3.793,0.664,7.224,1.792,10.52,3.449c3.228,1.654,6.185,3.812,8.761,6.394c2.576,2.558,4.734,5.527,6.443,8.841
					c1.623,3.219,2.73,6.628,3.37,10.381c0.732,3.972,0.959,8.051,1.094,11.882c0.018,1.783,0.018,3.698,0.018,5.604
					c0.05,2.361,0.05,4.608,0.05,6.874v135.049c0,2.287,0,4.519-0.05,6.769c0,2.047,0,3.923-0.025,5.853
					c-0.129,3.708-0.356,7.784-1.076,11.669c-0.652,3.861-1.758,7.274-3.4,10.514c-1.697,3.271-3.855,6.228-6.394,8.724
					c-2.601,2.632-5.552,4.777-8.81,6.437c-3.265,1.66-6.597,2.76-10.501,3.461c-4.033,0.732-8.208,0.928-11.768,1.027
					c-1.844,0.043-3.775,0.067-5.65,0.067l-6.825,0.013L53.165,249.609z"/>
			</g>
		</g>
	</g>
	<g>
		<g>
			<path style="fill:#FFFFFF;" d="M315.394,172.424h-29.51l-7.224,19.742h-12.974l28.899-73.728h12.263l29.561,73.728h-13.636
				L315.394,172.424z M289.6,162.4h22.031l-7.889-21.117c-1.084-2.917-2.151-6.138-3.206-9.666c-0.95,3.12-1.984,6.309-3.101,9.565
				L289.6,162.4z"/>
			<path style="fill:#FFFFFF;" d="M342.264,150.698c0-4.072-0.138-8.548-0.406-13.435h11.802c0.439,2.275,0.745,4.598,0.917,6.973
				c4.884-5.326,10.48-7.99,16.791-7.99c3.662,0,7.056,0.925,10.174,2.773c3.122,1.85,5.642,4.767,7.559,8.751
				c1.917,3.986,2.875,9.051,2.875,15.188c0,6.412-1.097,11.89-3.285,16.436c-2.185,4.545-5.248,7.988-9.182,10.329
				c-3.934,2.34-8.479,3.511-13.636,3.511c-3.733,0-7.412-0.63-11.041-1.883v22.693l-12.568,1.069V150.698z M375.31,178.758
				c2.561-3.442,3.842-8.471,3.842-15.086c0-6.14-1.059-10.591-3.181-13.357c-2.122-2.764-4.943-4.146-8.471-4.146
				c-2.444,0-4.7,0.575-6.768,1.729c-2.068,1.153-4.039,2.697-5.901,4.631v29.41c1.251,0.611,2.712,1.094,4.374,1.45
				c1.662,0.356,3.306,0.534,4.939,0.534C369.028,183.923,372.749,182.201,375.31,178.758z"/>
			<path style="fill:#FFFFFF;" d="M400.02,150.698c0-4.072-0.138-8.548-0.406-13.435h11.802c0.439,2.275,0.745,4.598,0.917,6.973
				c4.884-5.326,10.48-7.99,16.791-7.99c3.662,0,7.056,0.925,10.174,2.773c3.122,1.85,5.642,4.767,7.559,8.751
				c1.917,3.986,2.875,9.051,2.875,15.188c0,6.412-1.097,11.89-3.285,16.436c-2.185,4.545-5.248,7.988-9.182,10.329
				c-3.934,2.34-8.479,3.511-13.636,3.511c-3.733,0-7.412-0.63-11.041-1.883v22.693l-12.568,1.069V150.698z M433.067,178.758
				c2.561-3.442,3.842-8.471,3.842-15.086c0-6.14-1.059-10.591-3.181-13.357c-2.122-2.764-4.943-4.146-8.471-4.146
				c-2.444,0-4.7,0.575-6.768,1.729c-2.068,1.153-4.039,2.697-5.901,4.631v29.41c1.251,0.611,2.712,1.094,4.374,1.45
				s3.306,0.534,4.939,0.534C426.785,183.923,430.506,182.201,433.067,178.758z"/>
			<path style="fill:#FFFFFF;" d="M473.442,188.679c-5.428-3.001-9.601-7.301-12.518-12.897c-2.917-5.598-4.374-12.213-4.374-19.844
				c0-8.276,1.678-15.308,5.035-21.092c3.361-5.782,7.931-10.124,13.715-13.025c5.78-2.9,12.267-4.351,19.462-4.351
				c4.24,0,8.283,0.467,12.133,1.4c3.85,0.933,7.437,2.212,10.764,3.84l-3.206,9.668c-6.684-3.187-13.062-4.782-19.131-4.782
				c-5.123,0-9.609,1.092-13.46,3.281c-3.85,2.187-6.843,5.401-8.982,9.643c-2.134,4.24-3.206,9.36-3.206,15.366
				c0,5.257,0.824,9.921,2.469,13.991c1.645,4.07,4.24,7.295,7.785,9.668c3.545,2.375,8.015,3.562,13.405,3.562
				c2.444,0,4.888-0.203,7.328-0.611c2.444-0.406,4.734-1,6.868-1.781v-14.908h-17.042v-9.768h29.255v31.038
				c-4.206,1.967-8.626,3.476-13.255,4.528c-4.629,1.051-9.233,1.576-13.816,1.576C485.278,193.183,478.871,191.682,473.442,188.679
				z"/>
			<path style="fill:#FFFFFF;" d="M565.029,192.166c-0.439-2.137-0.728-4.562-0.862-7.276c-1.934,2.308-4.453,4.267-7.559,5.876
				c-3.101,1.611-6.604,2.417-10.505,2.417c-3.156,0-6.031-0.619-8.626-1.856c-2.595-1.239-4.654-3.103-6.182-5.598
				c-1.528-2.492-2.289-5.537-2.289-9.132c0-5.326,1.917-9.574,5.751-12.746c3.834-3.172,10.225-4.759,19.181-4.759
				c3.361,0,6.684,0.239,9.974,0.714v-1.069c0-4.851-1.034-8.268-3.105-10.252c-2.068-1.984-5.035-2.978-8.902-2.978
				c-2.679,0-5.546,0.391-8.601,1.172c-3.051,0.781-5.734,1.712-8.04,2.798l-1.984-9.159c2.239-1.017,5.19-1.95,8.856-2.798
				c3.662-0.848,7.529-1.272,11.602-1.272c4.746,0,8.785,0.722,12.108,2.164c3.323,1.442,5.918,3.917,7.785,7.427
				c1.867,3.511,2.8,8.237,2.8,14.171v21.828c0,2.273,0.134,5.717,0.406,10.329H565.029z M557.499,181.989
				c2.612-1.253,4.75-2.815,6.412-4.681v-10.176c-3.428-0.372-6.224-0.559-8.396-0.559c-5.19,0-8.777,0.839-10.76,2.517
				c-1.984,1.68-2.976,3.945-2.976,6.793c0,2.714,0.72,4.725,2.16,6.031c1.444,1.306,3.403,1.959,5.876,1.959
				C552.326,183.873,554.888,183.245,557.499,181.989z"/>
			<path style="fill:#FFFFFF;" d="M587.424,178.986v-64.874l12.514-1.017v63.654c0,2.34,0.398,3.993,1.197,4.96
				c0.795,0.967,2.059,1.45,3.792,1.45c0.778,0,1.883-0.186,3.306-0.559l1.477,9.007c-1.189,0.475-2.641,0.856-4.353,1.145
				c-1.712,0.287-3.331,0.431-4.859,0.431C591.781,193.183,587.424,188.451,587.424,178.986z"/>
			<path style="fill:#FFFFFF;" d="M618.717,178.986v-64.874l12.514-1.017v63.654c0,2.34,0.398,3.993,1.197,4.96
				c0.795,0.967,2.059,1.45,3.792,1.45c0.778,0,1.883-0.186,3.306-0.559l1.477,9.007c-1.189,0.475-2.641,0.856-4.353,1.145
				c-1.712,0.287-3.331,0.431-4.859,0.431C623.074,193.183,618.717,188.451,618.717,178.986z"/>
			<path style="fill:#FFFFFF;" d="M693.106,166.318h-35.922c0.578,11.499,6.056,17.25,16.436,17.25c2.578,0,5.215-0.314,7.914-0.942
				c2.695-0.628,5.282-1.467,7.76-2.52l2.746,8.601c-6.14,2.984-13.041,4.476-20.709,4.476c-5.834,0-10.752-1.101-14.757-3.306
				c-4.001-2.206-7.01-5.376-9.032-9.515c-2.017-4.137-3.026-9.124-3.026-14.96c0-6.071,1.067-11.294,3.206-15.67
				c2.139-4.378,5.114-7.718,8.931-10.024c3.813-2.308,8.216-3.461,13.2-3.461c5.19,0,9.526,1.214,13.004,3.639
				c3.474,2.425,6.052,5.656,7.734,9.693c1.678,4.037,2.515,8.496,2.515,13.38V166.318z M680.843,158.33
				c-0.234-4.376-1.339-7.659-3.306-9.846c-1.967-2.189-4.595-3.281-7.885-3.281c-3.189,0-5.843,1.101-7.965,3.306
				c-2.118,2.206-3.503,5.479-4.148,9.821H680.843z"/>
			<path style="fill:#FFFFFF;" d="M703.234,151.054c0-3.02-0.138-7.615-0.406-13.79h11.752c0.205,1.528,0.398,3.35,0.586,5.47
				c0.184,2.122,0.314,3.842,0.381,5.165c1.456-2.409,2.892-4.434,4.298-6.079s3.055-2.986,4.939-4.02
				c1.879-1.036,4.026-1.553,6.433-1.553c1.934,0,3.595,0.203,4.989,0.611l-1.578,10.888c-1.222-0.372-2.578-0.559-4.072-0.559
				c-2.951,0-5.529,0.755-7.734,2.264c-2.206,1.509-4.562,3.995-7.069,7.454v35.261h-12.518V151.054z"/>
			<path style="fill:#FFFFFF;" d="M743.744,214.63c-1.833-0.322-3.34-0.686-4.528-1.094l2.289-9.157
				c0.845,0.236,1.917,0.465,3.206,0.686c1.289,0.22,2.511,0.331,3.662,0.331c5.562,0,9.735-3.58,12.518-10.737l0.812-2.034
				l-20.248-55.361h13.481l10.179,30.938c1.662,5.292,2.729,9.346,3.206,12.16c0.95-3.97,2.068-7.937,3.357-11.907l10.329-31.191
				h12.669l-20.198,55.614c-1.9,5.259-3.951,9.498-6.156,12.721c-2.206,3.223-4.809,5.615-7.81,7.174
				c-3.005,1.561-6.625,2.342-10.865,2.342C747.54,215.114,745.577,214.952,743.744,214.63z"/>
		</g>
		<g>
			<path style="fill:#FFFFFF;" d="M265.623,46.721h22.663l-0.636,5.472h-15.385v10.601h14.506v5.129h-14.506v11.744h16.21
				l-0.561,5.527h-22.291V46.721z"/>
			<path style="fill:#FFFFFF;" d="M303.91,65.559l-11.957-18.838h7.546l8.103,13.843l8.53-13.843h7.337l-11.853,18.599
				l12.832,19.874h-7.651L307.63,70.05l-9.329,15.144h-7.333L303.91,65.559z"/>
			<path style="fill:#FFFFFF;" d="M329.339,46.721h10.363c4.872,0,8.597,0.992,11.183,2.976c2.586,1.984,3.88,4.853,3.88,8.609
				c0,2.551-0.578,4.777-1.737,6.682c-1.164,1.904-2.779,3.365-4.851,4.384s-4.457,1.528-7.148,1.528
				c-1.469,0-3.151-0.178-5.047-0.532v14.826h-6.642V46.721z M345.997,63.898c1.419-1.283,2.126-3.095,2.126-5.432
				c0-2.373-0.72-4.083-2.164-5.129c-1.444-1.044-3.566-1.567-6.366-1.567h-3.612v13.657c1.666,0.266,2.938,0.4,3.825,0.4
				C342.519,65.825,344.582,65.183,345.997,63.898z"/>
			<path style="fill:#FFFFFF;" d="M361.327,46.721h6.642v32.787h15.917l-0.561,5.686h-21.998V46.721z"/>
			<path style="fill:#FFFFFF;" d="M393.981,83.309c-2.817-1.613-4.968-3.876-6.454-6.791c-1.49-2.913-2.235-6.301-2.235-10.162
				c0-4.056,0.795-7.605,2.381-10.641c1.582-3.039,3.867-5.384,6.855-7.042c2.984-1.655,6.504-2.484,10.559-2.484
				c3.88,0,7.22,0.801,10.015,2.404c2.8,1.603,4.934,3.857,6.403,6.761c1.473,2.907,2.206,6.272,2.206,10.097
				c0,4.129-0.799,7.716-2.402,10.76c-1.603,3.047-3.888,5.395-6.855,7.042c-2.967,1.647-6.454,2.471-10.455,2.471
				C400.137,85.726,396.798,84.92,393.981,83.309z M411.199,78.592c1.862-1.249,3.252-2.967,4.173-5.154
				c0.921-2.189,1.381-4.69,1.381-7.506c0-2.764-0.406-5.225-1.222-7.387c-0.816-2.162-2.118-3.884-3.905-5.169
				c-1.791-1.283-4.093-1.925-6.91-1.925c-2.691,0-4.976,0.651-6.855,1.952c-1.875,1.302-3.285,3.047-4.223,5.234
				c-0.942,2.189-1.41,4.602-1.41,7.241c0,2.781,0.444,5.271,1.331,7.467c0.883,2.197,2.239,3.932,4.064,5.209
				c1.825,1.274,4.085,1.913,6.776,1.913C407.072,80.465,409.341,79.842,411.199,78.592z"/>
			<path style="fill:#FFFFFF;" d="M431.129,46.721h12.037c4.39,0,7.718,0.877,9.978,2.63c2.256,1.754,3.386,4.261,3.386,7.519
				c0,2.036-0.406,3.832-1.222,5.38c-0.816,1.551-1.825,2.813-3.03,3.786c-1.205,0.975-2.444,1.701-3.721,2.181l11.828,16.978
				h-7.709L442.66,69.943h-4.888v15.251h-6.642V46.721z M441.542,64.921c1.616,0,3.039-0.314,4.282-0.944
				c1.239-0.628,2.201-1.513,2.896-2.656c0.691-1.143,1.034-2.467,1.034-3.972c0-1.931-0.611-3.344-1.833-4.24
				c-1.222-0.894-3.001-1.341-5.34-1.341h-4.809v13.152H441.542z"/>
			<path style="fill:#FFFFFF;" d="M465.645,46.721h22.663l-0.636,5.472h-15.385v10.601h14.506v5.129h-14.506v11.744h16.21
				l-0.561,5.527h-22.291V46.721z"/>
			<path style="fill:#FFFFFF;" d="M512.964,46.721h6.642v38.473h-6.642V46.721z"/>
			<path style="fill:#FFFFFF;" d="M537.171,52.273h-11.932l0.586-5.552h29.946l-0.615,5.552h-11.342v32.921h-6.642V52.273z"/>
			<path style="fill:#FFFFFF;" d="M584.595,83.309c-2.817-1.613-4.968-3.876-6.454-6.791c-1.49-2.913-2.235-6.301-2.235-10.162
				c0-4.056,0.795-7.605,2.381-10.641c1.582-3.039,3.867-5.384,6.855-7.042c2.984-1.655,6.504-2.484,10.559-2.484
				c3.88,0,7.22,0.801,10.015,2.404c2.8,1.603,4.934,3.857,6.403,6.761c1.473,2.907,2.206,6.272,2.206,10.097
				c0,4.129-0.799,7.716-2.402,10.76c-1.603,3.047-3.888,5.395-6.855,7.042c-2.967,1.647-6.454,2.471-10.455,2.471
				C590.751,85.726,587.411,84.92,584.595,83.309z M601.813,78.592c1.862-1.249,3.252-2.967,4.173-5.154
				c0.921-2.189,1.381-4.69,1.381-7.506c0-2.764-0.406-5.225-1.222-7.387c-0.816-2.162-2.118-3.884-3.905-5.169
				c-1.791-1.283-4.093-1.925-6.91-1.925c-2.691,0-4.976,0.651-6.855,1.952c-1.875,1.302-3.285,3.047-4.223,5.234
				c-0.942,2.189-1.41,4.602-1.41,7.241c0,2.781,0.444,5.271,1.331,7.467c0.883,2.197,2.239,3.932,4.064,5.209
				c1.825,1.274,4.085,1.913,6.776,1.913C597.686,80.465,599.955,79.842,601.813,78.592z"/>
			<path style="fill:#FFFFFF;" d="M621.743,46.721h7.626l19.022,29.812c-0.159-2.833-0.239-5.447-0.239-7.839V46.721h6.165v38.473
				h-7.387l-19.315-30.291c0.193,3.438,0.293,6.483,0.293,9.141v21.15h-6.165V46.721z"/>
		</g>
		<g>
			<g id="形状_1_拷贝_25_32_">
				<g>
					<path style="fill-rule:evenodd;clip-rule:evenodd;fill:#C8102E;" d="M172.35,46.412h-70.972
						c-33.433,0-45.662,12.229-45.662,45.661v70.973c0,33.432,12.229,45.661,45.661,45.661h70.95
						c33.433,0,45.684-12.229,45.684-45.661l0-70.973C218.011,58.64,205.782,46.412,172.35,46.412z"/>
				</g>
			</g>
			<path style="fill:#FFFFFF;" d="M87.855,127.573h4.304v21.219h-4.304v-8.618h-9.721v8.618h-4.306v-21.219h4.306v8.559h9.721
				V127.573z M112.107,139.719c0,3.45-1.712,5.293-4.823,5.293c-3.127,0-4.85-1.895-4.85-5.44v-11.986h-4.306v12.134
				c0,5.968,3.317,9.391,9.098,9.391c5.837,0,9.185-3.487,9.185-9.567v-11.97h-4.304V139.719z M161.862,142.164l-4.817-14.592
				h-3.514l-4.817,14.592l-4.688-14.582h-4.582l7.396,21.209h3.564l4.825-13.931l4.823,13.931h3.595l7.377-21.209h-4.464
				L161.862,142.164z M178.742,139.66h7.83v-3.863h-7.83v-4.343h11.367v-3.867h-15.614v21.192h16.024v-3.865h-11.776V139.66z
				 M195.651,148.765h4.248v-21.192h-4.248V148.765z M124.919,144.362l-1.931,4.418h-4.395l9.347-21.206h3.799l9.31,21.206h-4.514
				l-1.906-4.418H124.919z M126.521,140.536h6.508l-3.265-7.593L126.521,140.536z"/>
			<path style="fill:#FFFFFF;" d="M136.863,100.557c-14.896,0-27.015-12.119-27.015-27.015h3.817
				c0,12.792,10.407,23.198,23.198,23.198c12.792,0,23.198-10.407,23.198-23.198h3.817
				C163.878,88.438,151.76,100.557,136.863,100.557z"/>
		</g>
	</g>
</g>
<g>
</g>
<g>
</g>
<g>
</g>
<g>
</g>
<g>
</g>
<g>
</g>
</svg>
