{
  "images" : [
    {
      "filename" : "App=BUM, platform=iOS, Theme=dark, Outline=background, Language=english.svg",
      "idiom" : "universal"
    }
  ],
  "info" : {
    "author" : "xcode",
    "version" : 1
  },
  "properties" : {
    "template-rendering-intent" : "original"
  }
}
