<svg width="610" height="785" viewBox="0 0 610 785" fill="none" xmlns="http://www.w3.org/2000/svg">
<rect x="36" y="246" width="545" height="47" rx="23.5" fill="black"/>
<rect y="409.648" width="544" height="47.6335" rx="23.8167" fill="#FFCC00"/>
<rect x="36" y="492" width="419" height="47" rx="23.5" fill="black"/>
<rect x="133" y="574" width="378" height="47" rx="23.5" fill="black"/>
<rect x="89" y="655.438" width="488" height="47.6335" rx="23.8167" fill="black"/>
<rect x="186" y="737.367" width="325" height="47.6335" rx="23.8167" fill="black"/>
<rect x="178" y="82" width="366" height="48" rx="24" fill="black"/>
<rect x="79" y="163.859" width="487" height="47.6335" rx="23.8167" fill="black"/>
<rect x="178" width="167" height="48" rx="24" fill="black"/>
<rect y="327.719" width="610" height="47.6335" rx="23.8167" fill="#FF0000"/>
</svg>
