<svg width="24" height="24" viewBox="0 0 24 24" fill="none" xmlns="http://www.w3.org/2000/svg">
<g clip-path="url(#clip0_101_2907)">
<circle cx="12" cy="12" r="12" fill="#425464"/>
<path d="M11.1111 18.6667C10.8593 18.6667 10.6481 18.5815 10.4778 18.4111C10.3074 18.2407 10.2222 18.0296 10.2222 17.7778C10.2222 17.5259 10.3074 17.3148 10.4778 17.1444C10.6481 16.9741 10.8593 16.8889 11.1111 16.8889H12.8889C13.1407 16.8889 13.3519 16.9741 13.5222 17.1444C13.6926 17.3148 13.7778 17.5259 13.7778 17.7778C13.7778 18.0296 13.6926 18.2407 13.5222 18.4111C13.3519 18.5815 13.1407 18.6667 12.8889 18.6667H11.1111ZM4.88889 9.77778C4.63704 9.77778 4.42593 9.69259 4.25556 9.52222C4.08519 9.35185 4 9.14074 4 8.88889C4 8.63704 4.08519 8.42593 4.25556 8.25556C4.42593 8.08519 4.63704 8 4.88889 8H19.1111C19.363 8 19.5741 8.08519 19.7444 8.25556C19.9148 8.42593 20 8.63704 20 8.88889C20 9.14074 19.9148 9.35185 19.7444 9.52222C19.5741 9.69259 19.363 9.77778 19.1111 9.77778H4.88889ZM7.55556 14.2222C7.3037 14.2222 7.09259 14.137 6.92222 13.9667C6.75185 13.7963 6.66667 13.5852 6.66667 13.3333C6.66667 13.0815 6.75185 12.8704 6.92222 12.7C7.09259 12.5296 7.3037 12.4444 7.55556 12.4444H16.4444C16.6963 12.4444 16.9074 12.5296 17.0778 12.7C17.2481 12.8704 17.3333 13.0815 17.3333 13.3333C17.3333 13.5852 17.2481 13.7963 17.0778 13.9667C16.9074 14.137 16.6963 14.2222 16.4444 14.2222H7.55556Z" fill="white"/>
</g>
<defs>
<clipPath id="clip0_101_2907">
<rect width="24" height="24" fill="white"/>
</clipPath>
</defs>
</svg>
