<svg
    xmlns="http://www.w3.org/2000/svg"
    viewBox="0 0 25 25"
    id="vector">
    <path
        id="path"
        d="M 17.5 17.5 L 6.5 12.5 L 17.5 7.5"
        fill="#00000000"
        stroke="#000000"
        stroke-width="2"
        stroke-linecap="round"
        stroke-linejoin="round"/>
    <path
        id="path_1"
        d="M 17.5 7.5 M 15.5 7.5 C 15.5 6.97 15.711 6.461 16.086 6.086 C 16.461 5.711 16.97 5.5 17.5 5.5 C 18.03 5.5 18.539 5.711 18.914 6.086 C 19.289 6.461 19.5 6.97 19.5 7.5 C 19.5 8.03 19.289 8.539 18.914 8.914 C 18.539 9.289 18.03 9.5 17.5 9.5 C 16.97 9.5 16.461 9.289 16.086 8.914 C 15.711 8.539 15.5 8.03 15.5 7.5"
        fill="#fcfcfc"
        stroke="#000000"
        stroke-width="2"
        stroke-linecap="round"/>
    <path
        id="path_2"
        d="M 17.5 17.5 M 15.5 17.5 C 15.5 16.97 15.711 16.461 16.086 16.086 C 16.461 15.711 16.97 15.5 17.5 15.5 C 18.03 15.5 18.539 15.711 18.914 16.086 C 19.289 16.461 19.5 16.97 19.5 17.5 C 19.5 18.03 19.289 18.539 18.914 18.914 C 18.539 19.289 18.03 19.5 17.5 19.5 C 16.97 19.5 16.461 19.289 16.086 18.914 C 15.711 18.539 15.5 18.03 15.5 17.5"
        fill="#fcfcfc"
        stroke="#000000"
        stroke-width="2"
        stroke-linecap="round"/>
    <path
        id="path_3"
        d="M 6.5 12.5 M 4.5 12.5 C 4.5 11.97 4.711 11.461 5.086 11.086 C 5.461 10.711 5.97 10.5 6.5 10.5 C 7.03 10.5 7.539 10.711 7.914 11.086 C 8.289 11.461 8.5 11.97 8.5 12.5 C 8.5 13.03 8.289 13.539 7.914 13.914 C 7.539 14.289 7.03 14.5 6.5 14.5 C 5.97 14.5 5.461 14.289 5.086 13.914 C 4.711 13.539 4.5 13.03 4.5 12.5"
        fill="#fcfcfc"
        stroke="#000000"
        stroke-width="2"
        stroke-linecap="round"/>
</svg>
