<svg width="64" height="64" viewBox="0 0 64 64" fill="none" xmlns="http://www.w3.org/2000/svg">
<g filter="url(#filter0_d_790_1087)">
<circle cx="32" cy="28" r="28" fill="white"/>
</g>
<path d="M23.9447 38.5279C23.3789 38.5279 22.9 38.3319 22.508 37.9399C22.116 37.5479 21.92 37.069 21.92 36.5033V21.5126C21.92 20.9468 22.116 20.468 22.508 20.076C22.9 19.684 23.3789 19.488 23.9447 19.488H33.5099L31.8299 21.1679H23.9447C23.8585 21.1679 23.7795 21.2038 23.7077 21.2756C23.6359 21.3474 23.6 21.4264 23.6 21.5126V36.5033C23.6 36.5895 23.6359 36.6684 23.7077 36.7403C23.7795 36.812 23.8585 36.8479 23.9447 36.8479H38.9354C39.0215 36.8479 39.1005 36.812 39.1723 36.7403C39.2441 36.6684 39.28 36.5895 39.28 36.5033V28.6008L40.96 26.9209V36.5033C40.96 37.069 40.764 37.5479 40.372 37.9399C39.98 38.3319 39.5011 38.5279 38.9354 38.5279H23.9447ZM36.5145 19.9597L37.7228 21.1399L30.32 28.5319V30.1279H31.888L39.3295 22.7079L40.5163 23.8774L32.6138 31.8079H28.64V27.8341L36.5145 19.9597ZM40.5163 23.8774L36.5145 19.9597L39.0776 17.3966C39.4753 16.9989 39.9581 16.8 40.526 16.8C41.0939 16.8 41.571 17.0025 41.9572 17.4074L43.0514 18.5079C43.4376 18.9014 43.6307 19.3756 43.6307 19.9306C43.6307 20.4855 43.434 20.9597 43.0406 21.3532L40.5163 23.8774Z" fill="#108194"/>
<defs>
<filter id="filter0_d_790_1087" x="0" y="0" width="64" height="64" filterUnits="userSpaceOnUse" color-interpolation-filters="sRGB">
<feFlood flood-opacity="0" result="BackgroundImageFix"/>
<feColorMatrix in="SourceAlpha" type="matrix" values="0 0 0 0 0 0 0 0 0 0 0 0 0 0 0 0 0 0 127 0" result="hardAlpha"/>
<feOffset dy="4"/>
<feGaussianBlur stdDeviation="2"/>
<feColorMatrix type="matrix" values="0 0 0 0 0 0 0 0 0 0 0 0 0 0 0 0 0 0 0.1 0"/>
<feBlend mode="normal" in2="BackgroundImageFix" result="effect1_dropShadow_790_1087"/>
<feBlend mode="normal" in="SourceGraphic" in2="effect1_dropShadow_790_1087" result="shape"/>
</filter>
</defs>
</svg>
