pod;threshold
matrix-neodatefix-bot-[a-z0-9]*-[a-z0-9]*;3
opendesk-synapse-0;5
ox-connector-0;10
ums-keycloak-extensions-handler-[a-z0-9]*-[a-z0-9]*;5
ums-ldap-notifier-0;5
ums-provisioning-listener-0;1
ums-provisioning-udm-transformer-[a-z0-9]*-[a-z0-9]*;4
opendesk-synapse-groupsync-0;6
