{
    "element-web-modules": {
        "source_url": "https://github.com/nordeck/element-web-modules",
        "target_group": "bmi/opendesk/component-code/realtimecommunication/nordeck"
    },
    "jitsi_keycloak_adapter": {
        "source_url": "https://github.com/nordeck/jitsi-keycloak-adapter.git",
        "target_group": "bmi/opendesk/component-code/realtimecommunication/nordeck"
    },
    "jitsi_meet": {
        "source_url": "https://github.com/jitsi/jitsi-meet.git",
        "target_group": "bmi/opendesk/component-code/realtimecommunication/nordeck"
    },
    "jitsi_videobridge": {
        "source_url": "https://github.com/jitsi/jitsi-videobridge.git",
        "target_group": "bmi/opendesk/component-code/realtimecommunication/nordeck"
    },
    "nordeck_feedback_application": {
        "source_url": "https://github.com/nordeck/feedback-application",
        "target_group": "bmi/opendesk/component-code/realtimecommunication/element"
    },
    "nordeck_matrix_meetings": {
        "source_url": "https://github.com/nordeck/matrix-meetings.git",
        "target_group": "bmi/opendesk/component-code/realtimecommunication/element"
    },
    "nordeck_matrix_neoboard": {
        "source_url": "https://github.com/nordeck/matrix-neoboard",
        "target_group": "bmi/opendesk/component-code/realtimecommunication/element"
    },
    "nordeck_matrix_poll": {
        "source_url": "https://github.com/nordeck/matrix-poll.git",
        "target_group": "bmi/opendesk/component-code/realtimecommunication/element"
    }
}