{
	"collabora": "mirror-definitions/vendor-collabora.json",
	"element": "mirror-definitions/vendor-element.json",
	"nextcloud": "mirror-definitions/vendor-nextcloud.json",
	"nordeck": "mirror-definitions/vendor-nordeck.json",
	"openxchange": "mirror-definitions/vendor-openxchange.json",
	"openproject": "mirror-definitions/vendor-openproject.json",
	"univention": "mirror-definitions/vendor-univention.json",
	"xwiki": "mirror-definitions/vendor-xwiki.json",
    "misc": "mirror-definitions/misc.json"
}