{
	"bmi/opendesk/component-code": {
		"name": "Component Code",
		"description": "Source code mirrors of the functional components. For contributions please use the upstream repositories."
	},
	"bmi/opendesk/component-code/project-management": {
		"name": "Project management",
		"description": ""
	},
	"bmi/opendesk/component-code/project-management/openproject": {
		"name": "OpenProject",
		"description": ""
	},
	"bmi/opendesk/component-code/office": {
		"name": "Office",
		"description": ""
	},
	"bmi/opendesk/component-code/office/collabora": {
		"name": "Collabora",
		"description": ""
	},
	"bmi/opendesk/component-code/office/cryptpad-by-xwiki": {
		"name": "CryptPad by XWiki",
		"description": ""
	},
	"bmi/opendesk/component-code/realtimecommunication": {
		"name": "Realtime communication",
		"description": ""
	},
	"bmi/opendesk/component-code/realtimecommunication/element": {
		"name": "Element",
		"description": ""
	},
	"bmi/opendesk/component-code/realtimecommunication/nordeck": {
		"name": "Nordeck",
		"description": "Matrix Widgets and stand-alone Jitsi"
	},
	"bmi/opendesk/component-code/file": {
		"name": "File sync and share",
		"description": ""
	},
	"bmi/opendesk/component-code/file/nextcloud": {
		"name": "Nextcloud",
		"description": ""
	},
	"bmi/opendesk/component-code/groupware": {
		"name": "Groupware",
		"description": ""
	},
    "bmi/opendesk/component-code/groupware/dovecot": {
		"name": "OX Dovecot",
		"description": ""
	},
	"bmi/opendesk/component-code/groupware/appsuite8": {
		"name": "OX AppSuite 8",
		"description": ""
	},
	"bmi/opendesk/component-code/crossfunctional": {
		"name": "Cross functional",
		"description": ""
	},
	"bmi/opendesk/component-code/crossfunctional/univention": {
		"name": "Univention",
		"description": ""
	},
	"bmi/opendesk/component-code/knowledge-management": {
		"name": "Knowledge management",
		"description": ""
	},
	"bmi/opendesk/component-code/knowledge-management/xwiki": {
		"name": "XWiki",
		"description": ""
	}
}