<svg width="111" height="111" viewBox="0 0 111 111" fill="none" xmlns="http://www.w3.org/2000/svg">
<rect x="0.5" y="0.5" width="110" height="110" rx="20" fill="white"/>
<path d="M24.0718 43.8214H78.6146C82.9134 43.8214 86.4096 47.3176 86.4096 51.6164V74.9903C86.4096 79.2891 82.9134 82.7852 78.6146 82.7852H31.8667C27.568 82.7852 24.0718 79.2891 24.0718 74.9903V43.8214Z" fill="#571EFA"/>
<path d="M50.5571 36.0266H24.0718V31.354C24.0718 27.0442 27.557 23.559 31.8667 23.559H44.3343L50.5681 36.0266H50.5571Z" fill="#341291"/>
</svg>
