<svg width="111" height="111" viewBox="0 0 111 111" fill="none" xmlns="http://www.w3.org/2000/svg">
<rect x="0.5" y="0.5" width="110" height="110" rx="20" fill="white"/>
<path d="M83.5479 78.9225H27.5952V86.7178H83.5479V78.9225Z" fill="#341291"/>
<path d="M66.5497 26.5211L72.0582 32.0295C75.1037 35.0751 75.1037 40.0008 72.0582 43.0463L66.2089 48.8956L43.9774 71.1271H27.4521V54.6019L49.6837 32.3704L55.5329 26.5211C58.5785 23.4755 63.5042 23.4755 66.5497 26.5211Z" fill="#571EFA"/>
</svg>
