{
  "SPDXID" : "SPDXRef-DOCUMENT",
  "spdxVersion" : "SPDX-2.3",
  "creationInfo" : {
    "comment" : "Disclaimer\n* Version 0.5.74 of openDesk and its corresponding SBOMs are only preliminary. The list of containers and their content is not final.\n* Current outputs are automated based on a container processing pipeline specialised on Open CoDE policies. Only selected artefacts have been curated to avoid false identifications.\n* The SBOMs are provided AS-IS without expressing or implying any warranties or conditions of any kind. \n* The SBOMs are not guaranteed to be correct or complete. The primary objective is to convey all identified licenses from an automated license scan.\n* Concluded licenses are primarily derived in an automated manner. The default rule is to prefer permissive licenses that reduce potential conflicts due to license incompatibilities.\n* The SBOMs do not convey any opinion or legal advice. \n* The SBOMs are not sufficient to fulfill the license obligations associated with the identified licenses when using or distributing the software.",
    "created" : "2024-02-23T18:45:20Z",
    "creators" : [ "Organization: Dataport AöR", "Tool: Phoenix Container Pipeline/metaeffekt Plugins" ]
  },
  "name" : "registry.opencode.de/bmi/opendesk/components/supplier/open-xchange/images-mirror/core-guidedtours:8.6.0@sha256:6c20780f8c609636f2182c41709e2ee26586b4a23679fd13b15875a5f443445b",
  "dataLicense" : "CC0-1.0",
  "documentNamespace" : "https://org.spdx.examples/spdx/doc/31d15a8b-e18f-4a02-9143-9c11113526ca",
  "packages" : [ {
    "SPDXID" : "SPDXRef-gnrtd0",
    "annotations" : [ {
      "annotationDate" : "2024-02-23T18:45:20Z",
      "annotationType" : "OTHER",
      "annotator" : "Tool: Phoenix Container Pipeline/metaeffekt Plugins",
      "comment" : "{\n  \"Architecture\" : \"amd64\",\n  \"Os\" : \"linux\",\n  \"Size\" : \"35519318\",\n  \"Artifact Count (no component)\" : \"511\",\n  \"config_io.ox.commit-sha.core-guidedtours\" : \"e3473b6af91be2214de6d7a1194844287c7a07b0\",\n  \"Artifact Count\" : \"512\",\n  \"Created\" : \"2023-10-27T13:26:22\",\n  \"Name\" : \"core-guidedtours:6c20780f8c609636f2182c41709e2ee26586b4a23679fd13b15875a5f443445b\",\n  \"Type\" : \"Container\",\n  \"meta_LastTagTime\" : \"0001-01-01T00:00:00Z\",\n  \"Primary\" : \"x\",\n  \"Artifact Count (no version)\" : \"512\",\n  \"Tag\" : \"8.6.0\",\n  \"Image Id\" : \"sha256:4a1b6f1fb5e7fc62ce7a7bbe25d8da6e024b8e0aa22403b6d8d38a41c269e97a\"\n}"
    } ],
    "checksums" : [ {
      "algorithm" : "SHA256",
      "checksumValue" : "6c20780f8c609636f2182c41709e2ee26586b4a23679fd13b15875a5f443445b"
    } ],
    "copyrightText" : "NOASSERTION",
    "downloadLocation" : "NOASSERTION",
    "externalRefs" : [ {
      "referenceCategory" : "OTHER",
      "referenceLocator" : "registry.opencode.de/bmi/opendesk/components/supplier/open-xchange/images-mirror/core-guidedtours",
      "referenceType" : "url"
    } ],
    "filesAnalyzed" : false,
    "licenseConcluded" : "NOASSERTION",
    "licenseDeclared" : "NOASSERTION",
    "name" : "CID-core-guidedtours@6c20780f8c609636f2182c41709e2ee26586b4a23679fd13b15875a5f443445b",
    "supplier" : "Organization: Open-Xchange"
  }, {
    "SPDXID" : "SPDXRef-gnrtd1",
    "checksums" : [ {
      "algorithm" : "SHA1",
      "checksumValue" : "1d7e3d6bfe453994137ca2819c2fddf3b48f86dc"
    }, {
      "algorithm" : "MD5",
      "checksumValue" : "8d7ff14237eb5122c2ae6680aa117c40"
    } ],
    "copyrightText" : "NOASSERTION",
    "downloadLocation" : "NOASSERTION",
    "externalRefs" : [ {
      "referenceCategory" : "PACKAGE-MANAGER",
      "referenceLocator" : "pkg:generic/tzdata@unspecific",
      "referenceType" : "purl"
    } ],
    "filesAnalyzed" : false,
    "licenseConcluded" : "Apache-2.0",
    "licenseDeclared" : "Apache-2.0",
    "name" : "tzdata",
    "versionInfo" : "unspecific"
  } ],
  "relationships" : [ {
    "spdxElementId" : "SPDXRef-DOCUMENT",
    "relationshipType" : "DESCRIBES",
    "relatedSpdxElement" : "SPDXRef-gnrtd0"
  }, {
    "spdxElementId" : "SPDXRef-gnrtd0",
    "relationshipType" : "CONTAINS",
    "relatedSpdxElement" : "SPDXRef-gnrtd1"
  } ]
}
