{
  "SPDXID" : "SPDXRef-DOCUMENT",
  "spdxVersion" : "SPDX-2.3",
  "creationInfo" : {
    "comment" : "Disclaimer\n* Version 0.5.37 of openDesk and its corresponding SBOMs are only preliminary. The list of containers and their content is not final.\n* Current outputs are automated based on a container processing pipeline specialised on Open CoDE policies. Only selected artefacts have been curated to avoid false identifications.\n* The SBOMs are provided AS-IS without expressing or implying any warranties or conditions of any kind. \n* The SBOMs are not guaranteed to be correct or complete. The primary objective is to convey all identified licenses from an automated license scan.\n* Concluded licenses are primarily derived in an automated manner. The default rule is to prefer permissive licenses that reduce potential conflicts due to license incompatibilities.\n* The SBOMs do not convey any opinion or legal advice. \n* The SBOMs are not sufficient to fulfill the license obligations associated with the identified licenses when using or distributing the software.",
    "created" : "2023-12-20T12:26:58Z",
    "creators" : [ "Organization: Dataport AöR", "Tool: Phoenix Container Pipeline/metaeffekt Plugins" ]
  },
  "name" : "external-registry.souvap-univention.de/sovereign-workplace/souvap/tooling/images/univention/portal-frontend:0.3.5",
  "dataLicense" : "CC0-1.0",
  "documentNamespace" : "https://org.spdx.examples/spdx/doc/8261fbba-68e1-493f-b65b-bc5009615df9",
  "packages" : [ {
    "SPDXID" : "SPDXRef-gnrtd0",
    "annotations" : [ {
      "annotationDate" : "2023-12-20T12:26:58Z",
      "annotationType" : "OTHER",
      "annotator" : "Tool: Phoenix Container Pipeline/metaeffekt Plugins",
      "comment" : "{\n  \"Issue\" : \"Debian GNU/Linux 10 (10.13)\",\n  \"Architecture\" : \"amd64\",\n  \"Os\" : \"linux\",\n  \"Size\" : \"166638641\",\n  \"Artifact Count (no component)\" : \"41\",\n  \"Artifact Count\" : \"164\",\n  \"Created\" : \"2023-11-06T18:09:30\",\n  \"Name\" : \"portal-frontend:null\",\n  \"Type\" : \"Container\",\n  \"meta_LastTagTime\" : \"0001-01-01T00:00:00Z\",\n  \"Primary\" : \"x\",\n  \"Artifact Count (no version)\" : \"41\",\n  \"Tag\" : \"0.3.5\",\n  \"Image Id\" : \"sha256:4464c73fd6a412597b0e0d6cc4cbb55bb7dadb74cbd8942fd4d9677b6fc07fe3\"\n}"
    } ],
    "copyrightText" : "NOASSERTION",
    "downloadLocation" : "NOASSERTION",
    "externalRefs" : [ {
      "referenceCategory" : "OTHER",
      "referenceLocator" : "external-registry.souvap-univention.de/sovereign-workplace/souvap/tooling/images/univention/portal-frontend",
      "referenceType" : "url"
    } ],
    "filesAnalyzed" : false,
    "licenseConcluded" : "NOASSERTION",
    "licenseDeclared" : "NOASSERTION",
    "name" : "CID-portal-frontend@42c9b094fae435a742e2bedab07fda7bc87d54d0fba983a491818b3b48e3e209",
    "supplier" : "Organization: Univention"
  }, {
    "SPDXID" : "SPDXRef-gnrtd1",
    "checksums" : [ {
      "algorithm" : "SHA256",
      "checksumValue" : "1de1141d653f5bc8d3826dc6e08b4031a3694d5bf1e908ce83a916d583392109"
    }, {
      "algorithm" : "SHA1",
      "checksumValue" : "b15913713c1a028e47bdf6c4eb078a4e2d34870b"
    }, {
      "algorithm" : "MD5",
      "checksumValue" : "8f5a7f589621d959978364181290f95d"
    } ],
    "copyrightText" : "copyright 2010-2011, Google Corporation.Open SansItalic1.10 1ASC OpenSans-ItalicOpen Sans ItalicVersion",
    "downloadLocation" : "NOASSERTION",
    "externalRefs" : [ {
      "referenceCategory" : "PACKAGE-MANAGER",
      "referenceLocator" : "pkg:generic/OpenSans-Italic.ttf",
      "referenceType" : "purl"
    } ],
    "filesAnalyzed" : false,
    "licenseConcluded" : "NOASSERTION",
    "licenseDeclared" : "NOASSERTION",
    "name" : "OpenSans-Italic.ttf"
  }, {
    "SPDXID" : "SPDXRef-gnrtd2",
    "checksums" : [ {
      "algorithm" : "SHA1",
      "checksumValue" : "a75624f37b3572670245510eab912bf5cbdaa9ef"
    }, {
      "algorithm" : "MD5",
      "checksumValue" : "883e9763b74b94e2b8afa0bc8a429936"
    }, {
      "algorithm" : "SHA256",
      "checksumValue" : "b31b29a36863fed7e0d370f54e142ef7028b72915293aac0c441c0599f4cab13"
    } ],
    "copyrightText" : "copyright 2010-2011, Google Corporation.Open SansRegular1.10 1ASC OpenSans-RegularOpen Sans RegularVersion",
    "downloadLocation" : "NOASSERTION",
    "externalRefs" : [ {
      "referenceCategory" : "PACKAGE-MANAGER",
      "referenceLocator" : "pkg:generic/OpenSans-Regular.ttf",
      "referenceType" : "purl"
    } ],
    "filesAnalyzed" : false,
    "licenseConcluded" : "NOASSERTION",
    "licenseDeclared" : "NOASSERTION",
    "name" : "OpenSans-Regular.ttf"
  }, {
    "SPDXID" : "SPDXRef-gnrtd3",
    "checksums" : [ {
      "algorithm" : "MD5",
      "checksumValue" : "70d2fdc978bb3980b8a822112fec89a3"
    }, {
      "algorithm" : "SHA256",
      "checksumValue" : "b329c5c2cde5749cabd668aabd9a4dbbb0efb1087237793457311282dd7f7ade"
    }, {
      "algorithm" : "SHA1",
      "checksumValue" : "263c6b2e11f88273b708d25c07a34cb82156e812"
    } ],
    "copyrightText" : "copyright 2011, Google Corporation.Open",
    "downloadLocation" : "NOASSERTION",
    "externalRefs" : [ {
      "referenceCategory" : "PACKAGE-MANAGER",
      "referenceLocator" : "pkg:generic/OpenSans-SemiBold.ttf",
      "referenceType" : "purl"
    } ],
    "filesAnalyzed" : false,
    "licenseConcluded" : "NOASSERTION",
    "licenseDeclared" : "NOASSERTION",
    "name" : "OpenSans-SemiBold.ttf"
  }, {
    "SPDXID" : "SPDXRef-gnrtd4",
    "attributionTexts" : [ "Chen, Yi-Cyuan emn178@gmail.com" ],
    "checksums" : [ {
      "algorithm" : "SHA256",
      "checksumValue" : "f35eb8e3cab3b018905f350be93975669fe2b6976fa30186bcf50a931bdd4759"
    }, {
      "algorithm" : "SHA1",
      "checksumValue" : "c67e954c217da78aaa233cb43ae5282a57eae163"
    }, {
      "algorithm" : "MD5",
      "checksumValue" : "116d03035c3bb62b9264578150fdf4d4"
    } ],
    "copyrightText" : "(c) 2021 Denis Pushkarev\n(c) 2021 Eduardo San Martin Morote\n(c) 2021 Evan\n(c) Cure53 and other contributors\ncopyright Chen, Yi-Cyuan 2014-2017",
    "downloadLocation" : "NOASSERTION",
    "externalRefs" : [ {
      "referenceCategory" : "PACKAGE-MANAGER",
      "referenceLocator" : "pkg:generic/chunk-vendors.js",
      "referenceType" : "purl"
    } ],
    "filesAnalyzed" : false,
    "licenseConcluded" : "(MPL-2.0 AND Apache-2.0 AND MIT)",
    "licenseDeclared" : "(MPL-2.0 AND Apache-2.0 AND MIT)",
    "name" : "chunk-vendors.js"
  }, {
    "SPDXID" : "SPDXRef-gnrtd5",
    "copyrightText" : "NOASSERTION",
    "downloadLocation" : "NOASSERTION",
    "externalRefs" : [ {
      "referenceCategory" : "PACKAGE-MANAGER",
      "referenceLocator" : "pkg:generic/base-passwd-3.5.46A~5.0.2.202203011945@3.5.46A~5.0.2.202203011945",
      "referenceType" : "purl"
    } ],
    "filesAnalyzed" : false,
    "licenseConcluded" : "NOASSERTION",
    "licenseDeclared" : "NOASSERTION",
    "name" : "base-passwd-3.5.46A~5.0.2.202203011945",
    "versionInfo" : "3.5.46A~5.0.2.202203011945"
  }, {
    "SPDXID" : "SPDXRef-gnrtd6",
    "copyrightText" : "NOASSERTION",
    "downloadLocation" : "NOASSERTION",
    "externalRefs" : [ {
      "referenceCategory" : "PACKAGE-MANAGER",
      "referenceLocator" : "pkg:generic/libgmp10-2%3A6.1.2%2Bdfsg-4%2Bdeb10u1@2%3A6.1.2%2Bdfsg-4%2Bdeb10u1",
      "referenceType" : "purl"
    } ],
    "filesAnalyzed" : false,
    "homepage" : "http://gmplib.org/",
    "licenseConcluded" : "NOASSERTION",
    "licenseDeclared" : "NOASSERTION",
    "name" : "libgmp10-2:6.1.2+dfsg-4+deb10u1",
    "versionInfo" : "2:6.1.2+dfsg-4+deb10u1"
  }, {
    "SPDXID" : "SPDXRef-gnrtd7",
    "copyrightText" : "NOASSERTION",
    "downloadLocation" : "NOASSERTION",
    "externalRefs" : [ {
      "referenceCategory" : "PACKAGE-MANAGER",
      "referenceLocator" : "pkg:generic/libselinux1-2.8-1%2Bb1@2.8-1%2Bb1",
      "referenceType" : "purl"
    } ],
    "filesAnalyzed" : false,
    "homepage" : "http://userspace.selinuxproject.org/",
    "licenseConcluded" : "NOASSERTION",
    "licenseDeclared" : "NOASSERTION",
    "name" : "libselinux1-2.8-1+b1",
    "versionInfo" : "2.8-1+b1"
  }, {
    "SPDXID" : "SPDXRef-gnrtd8",
    "copyrightText" : "NOASSERTION",
    "downloadLocation" : "NOASSERTION",
    "externalRefs" : [ {
      "referenceCategory" : "PACKAGE-MANAGER",
      "referenceLocator" : "pkg:generic/adduser-3.118@3.118",
      "referenceType" : "purl"
    } ],
    "filesAnalyzed" : false,
    "licenseConcluded" : "NOASSERTION",
    "licenseDeclared" : "NOASSERTION",
    "name" : "adduser-3.118",
    "versionInfo" : "3.118"
  }, {
    "SPDXID" : "SPDXRef-gnrtd9",
    "copyrightText" : "NOASSERTION",
    "downloadLocation" : "NOASSERTION",
    "externalRefs" : [ {
      "referenceCategory" : "PACKAGE-MANAGER",
      "referenceLocator" : "pkg:generic/gcc-8-base-8.3.0-6@8.3.0-6",
      "referenceType" : "purl"
    } ],
    "filesAnalyzed" : false,
    "homepage" : "http://gcc.gnu.org/",
    "licenseConcluded" : "NOASSERTION",
    "licenseDeclared" : "NOASSERTION",
    "name" : "gcc-8-base-8.3.0-6",
    "versionInfo" : "8.3.0-6"
  }, {
    "SPDXID" : "SPDXRef-gnrtd10",
    "copyrightText" : "NOASSERTION",
    "downloadLocation" : "NOASSERTION",
    "externalRefs" : [ {
      "referenceCategory" : "PACKAGE-MANAGER",
      "referenceLocator" : "pkg:generic/libudev1-241-7~deb10u10A~5.0.4.202307030913@241-7~deb10u10A~5.0.4.202307030913",
      "referenceType" : "purl"
    } ],
    "filesAnalyzed" : false,
    "homepage" : "https://www.freedesktop.org/wiki/Software/systemd",
    "licenseConcluded" : "NOASSERTION",
    "licenseDeclared" : "NOASSERTION",
    "name" : "libudev1-241-7~deb10u10A~5.0.4.202307030913",
    "versionInfo" : "241-7~deb10u10A~5.0.4.202307030913"
  }, {
    "SPDXID" : "SPDXRef-gnrtd11",
    "copyrightText" : "NOASSERTION",
    "downloadLocation" : "NOASSERTION",
    "externalRefs" : [ {
      "referenceCategory" : "PACKAGE-MANAGER",
      "referenceLocator" : "pkg:generic/libnginx-mod-mail-1.14.2-2%2Bdeb10u5@1.14.2-2%2Bdeb10u5",
      "referenceType" : "purl"
    } ],
    "filesAnalyzed" : false,
    "homepage" : "https://nginx.net",
    "licenseConcluded" : "NOASSERTION",
    "licenseDeclared" : "NOASSERTION",
    "name" : "libnginx-mod-mail-1.14.2-2+deb10u5",
    "versionInfo" : "1.14.2-2+deb10u5"
  }, {
    "SPDXID" : "SPDXRef-gnrtd12",
    "copyrightText" : "NOASSERTION",
    "downloadLocation" : "NOASSERTION",
    "externalRefs" : [ {
      "referenceCategory" : "PACKAGE-MANAGER",
      "referenceLocator" : "pkg:generic/libfreetype6-2.9.1-3%2Bdeb10u3@2.9.1-3%2Bdeb10u3",
      "referenceType" : "purl"
    } ],
    "filesAnalyzed" : false,
    "homepage" : "https://www.freetype.org",
    "licenseConcluded" : "NOASSERTION",
    "licenseDeclared" : "NOASSERTION",
    "name" : "libfreetype6-2.9.1-3+deb10u3",
    "versionInfo" : "2.9.1-3+deb10u3"
  }, {
    "SPDXID" : "SPDXRef-gnrtd13",
    "copyrightText" : "NOASSERTION",
    "downloadLocation" : "NOASSERTION",
    "externalRefs" : [ {
      "referenceCategory" : "PACKAGE-MANAGER",
      "referenceLocator" : "pkg:generic/libfontconfig1-2.13.1-2@2.13.1-2",
      "referenceType" : "purl"
    } ],
    "filesAnalyzed" : false,
    "homepage" : "https://www.freedesktop.org/wiki/Software/fontconfig/",
    "licenseConcluded" : "NOASSERTION",
    "licenseDeclared" : "NOASSERTION",
    "name" : "libfontconfig1-2.13.1-2",
    "versionInfo" : "2.13.1-2"
  }, {
    "SPDXID" : "SPDXRef-gnrtd14",
    "copyrightText" : "NOASSERTION",
    "downloadLocation" : "NOASSERTION",
    "externalRefs" : [ {
      "referenceCategory" : "PACKAGE-MANAGER",
      "referenceLocator" : "pkg:generic/libgd3-2.2.5-5.2@2.2.5-5.2",
      "referenceType" : "purl"
    } ],
    "filesAnalyzed" : false,
    "homepage" : "http://www.libgd.org/",
    "licenseConcluded" : "NOASSERTION",
    "licenseDeclared" : "NOASSERTION",
    "name" : "libgd3-2.2.5-5.2",
    "versionInfo" : "2.2.5-5.2"
  }, {
    "SPDXID" : "SPDXRef-gnrtd15",
    "copyrightText" : "NOASSERTION",
    "downloadLocation" : "NOASSERTION",
    "externalRefs" : [ {
      "referenceCategory" : "PACKAGE-MANAGER",
      "referenceLocator" : "pkg:generic/libnginx-mod-http-auth-pam-1.14.2-2%2Bdeb10u5@1.14.2-2%2Bdeb10u5",
      "referenceType" : "purl"
    } ],
    "filesAnalyzed" : false,
    "homepage" : "https://nginx.net",
    "licenseConcluded" : "NOASSERTION",
    "licenseDeclared" : "NOASSERTION",
    "name" : "libnginx-mod-http-auth-pam-1.14.2-2+deb10u5",
    "versionInfo" : "1.14.2-2+deb10u5"
  }, {
    "SPDXID" : "SPDXRef-gnrtd16",
    "copyrightText" : "NOASSERTION",
    "downloadLocation" : "NOASSERTION",
    "externalRefs" : [ {
      "referenceCategory" : "PACKAGE-MANAGER",
      "referenceLocator" : "pkg:generic/hostname-3.21@3.21",
      "referenceType" : "purl"
    } ],
    "filesAnalyzed" : false,
    "licenseConcluded" : "NOASSERTION",
    "licenseDeclared" : "NOASSERTION",
    "name" : "hostname-3.21",
    "versionInfo" : "3.21"
  }, {
    "SPDXID" : "SPDXRef-gnrtd17",
    "copyrightText" : "NOASSERTION",
    "downloadLocation" : "NOASSERTION",
    "externalRefs" : [ {
      "referenceCategory" : "PACKAGE-MANAGER",
      "referenceLocator" : "pkg:generic/debconf-1.5.71%2Bdeb10u1@1.5.71%2Bdeb10u1",
      "referenceType" : "purl"
    } ],
    "filesAnalyzed" : false,
    "licenseConcluded" : "NOASSERTION",
    "licenseDeclared" : "NOASSERTION",
    "name" : "debconf-1.5.71+deb10u1",
    "versionInfo" : "1.5.71+deb10u1"
  }, {
    "SPDXID" : "SPDXRef-gnrtd18",
    "copyrightText" : "NOASSERTION",
    "downloadLocation" : "NOASSERTION",
    "externalRefs" : [ {
      "referenceCategory" : "PACKAGE-MANAGER",
      "referenceLocator" : "pkg:generic/libncursesw6-6.1%2B20181013-2%2Bdeb10u4@6.1%2B20181013-2%2Bdeb10u4",
      "referenceType" : "purl"
    } ],
    "filesAnalyzed" : false,
    "homepage" : "https://invisible-island.net/ncurses/",
    "licenseConcluded" : "NOASSERTION",
    "licenseDeclared" : "NOASSERTION",
    "name" : "libncursesw6-6.1+20181013-2+deb10u4",
    "versionInfo" : "6.1+20181013-2+deb10u4"
  }, {
    "SPDXID" : "SPDXRef-gnrtd19",
    "copyrightText" : "NOASSERTION",
    "downloadLocation" : "NOASSERTION",
    "externalRefs" : [ {
      "referenceCategory" : "PACKAGE-MANAGER",
      "referenceLocator" : "pkg:generic/fonts-dejavu-core-2.37-1@2.37-1",
      "referenceType" : "purl"
    } ],
    "filesAnalyzed" : false,
    "homepage" : "http://dejavu-fonts.org/",
    "licenseConcluded" : "NOASSERTION",
    "licenseDeclared" : "NOASSERTION",
    "name" : "fonts-dejavu-core-2.37-1",
    "versionInfo" : "2.37-1"
  }, {
    "SPDXID" : "SPDXRef-gnrtd20",
    "copyrightText" : "NOASSERTION",
    "downloadLocation" : "NOASSERTION",
    "externalRefs" : [ {
      "referenceCategory" : "PACKAGE-MANAGER",
      "referenceLocator" : "pkg:generic/ncurses-bin-6.1%2B20181013-2%2Bdeb10u4@6.1%2B20181013-2%2Bdeb10u4",
      "referenceType" : "purl"
    } ],
    "filesAnalyzed" : false,
    "homepage" : "https://invisible-island.net/ncurses/",
    "licenseConcluded" : "NOASSERTION",
    "licenseDeclared" : "NOASSERTION",
    "name" : "ncurses-bin-6.1+20181013-2+deb10u4",
    "versionInfo" : "6.1+20181013-2+deb10u4"
  }, {
    "SPDXID" : "SPDXRef-gnrtd21",
    "copyrightText" : "NOASSERTION",
    "downloadLocation" : "NOASSERTION",
    "externalRefs" : [ {
      "referenceCategory" : "PACKAGE-MANAGER",
      "referenceLocator" : "pkg:generic/apt-1.8.2.3A~5.0.1.202112091343@1.8.2.3A~5.0.1.202112091343",
      "referenceType" : "purl"
    } ],
    "filesAnalyzed" : false,
    "licenseConcluded" : "NOASSERTION",
    "licenseDeclared" : "NOASSERTION",
    "name" : "apt-1.8.2.3A~5.0.1.202112091343",
    "versionInfo" : "1.8.2.3A~5.0.1.202112091343"
  }, {
    "SPDXID" : "SPDXRef-gnrtd22",
    "copyrightText" : "NOASSERTION",
    "downloadLocation" : "NOASSERTION",
    "externalRefs" : [ {
      "referenceCategory" : "PACKAGE-MANAGER",
      "referenceLocator" : "pkg:generic/libsemanage1-2.8-2@2.8-2",
      "referenceType" : "purl"
    } ],
    "filesAnalyzed" : false,
    "homepage" : "http://userspace.selinuxproject.org/",
    "licenseConcluded" : "NOASSERTION",
    "licenseDeclared" : "NOASSERTION",
    "name" : "libsemanage1-2.8-2",
    "versionInfo" : "2.8-2"
  }, {
    "SPDXID" : "SPDXRef-gnrtd23",
    "copyrightText" : "NOASSERTION",
    "downloadLocation" : "NOASSERTION",
    "externalRefs" : [ {
      "referenceCategory" : "PACKAGE-MANAGER",
      "referenceLocator" : "pkg:generic/libgeoip1-1.6.12-1@1.6.12-1",
      "referenceType" : "purl"
    } ],
    "filesAnalyzed" : false,
    "homepage" : "https://www.maxmind.com/",
    "licenseConcluded" : "NOASSERTION",
    "licenseDeclared" : "NOASSERTION",
    "name" : "libgeoip1-1.6.12-1",
    "versionInfo" : "1.6.12-1"
  }, {
    "SPDXID" : "SPDXRef-gnrtd24",
    "copyrightText" : "NOASSERTION",
    "downloadLocation" : "NOASSERTION",
    "externalRefs" : [ {
      "referenceCategory" : "PACKAGE-MANAGER",
      "referenceLocator" : "pkg:generic/mount-2.33.1-0.1@2.33.1-0.1",
      "referenceType" : "purl"
    } ],
    "filesAnalyzed" : false,
    "licenseConcluded" : "NOASSERTION",
    "licenseDeclared" : "NOASSERTION",
    "name" : "mount-2.33.1-0.1",
    "versionInfo" : "2.33.1-0.1"
  }, {
    "SPDXID" : "SPDXRef-gnrtd25",
    "copyrightText" : "NOASSERTION",
    "downloadLocation" : "NOASSERTION",
    "externalRefs" : [ {
      "referenceCategory" : "PACKAGE-MANAGER",
      "referenceLocator" : "pkg:generic/nginx-full-1.14.2-2%2Bdeb10u5@1.14.2-2%2Bdeb10u5",
      "referenceType" : "purl"
    } ],
    "filesAnalyzed" : false,
    "homepage" : "https://nginx.net",
    "licenseConcluded" : "NOASSERTION",
    "licenseDeclared" : "NOASSERTION",
    "name" : "nginx-full-1.14.2-2+deb10u5",
    "versionInfo" : "1.14.2-2+deb10u5"
  }, {
    "SPDXID" : "SPDXRef-gnrtd26",
    "copyrightText" : "NOASSERTION",
    "downloadLocation" : "NOASSERTION",
    "externalRefs" : [ {
      "referenceCategory" : "PACKAGE-MANAGER",
      "referenceLocator" : "pkg:generic/libnginx-mod-http-dav-ext-1.14.2-2%2Bdeb10u5@1.14.2-2%2Bdeb10u5",
      "referenceType" : "purl"
    } ],
    "filesAnalyzed" : false,
    "homepage" : "https://nginx.net",
    "licenseConcluded" : "NOASSERTION",
    "licenseDeclared" : "NOASSERTION",
    "name" : "libnginx-mod-http-dav-ext-1.14.2-2+deb10u5",
    "versionInfo" : "1.14.2-2+deb10u5"
  }, {
    "SPDXID" : "SPDXRef-gnrtd27",
    "copyrightText" : "NOASSERTION",
    "downloadLocation" : "NOASSERTION",
    "externalRefs" : [ {
      "referenceCategory" : "PACKAGE-MANAGER",
      "referenceLocator" : "pkg:generic/util-linux-2.33.1-0.1@2.33.1-0.1",
      "referenceType" : "purl"
    } ],
    "filesAnalyzed" : false,
    "licenseConcluded" : "NOASSERTION",
    "licenseDeclared" : "NOASSERTION",
    "name" : "util-linux-2.33.1-0.1",
    "versionInfo" : "2.33.1-0.1"
  }, {
    "SPDXID" : "SPDXRef-gnrtd28",
    "copyrightText" : "NOASSERTION",
    "downloadLocation" : "NOASSERTION",
    "externalRefs" : [ {
      "referenceCategory" : "PACKAGE-MANAGER",
      "referenceLocator" : "pkg:generic/passwd-1%3A4.5-1.1@1%3A4.5-1.1",
      "referenceType" : "purl"
    } ],
    "filesAnalyzed" : false,
    "homepage" : "https://github.com/shadow-maint/shadow",
    "licenseConcluded" : "NOASSERTION",
    "licenseDeclared" : "NOASSERTION",
    "name" : "passwd-1:4.5-1.1",
    "versionInfo" : "1:4.5-1.1"
  }, {
    "SPDXID" : "SPDXRef-gnrtd29",
    "copyrightText" : "NOASSERTION",
    "downloadLocation" : "NOASSERTION",
    "externalRefs" : [ {
      "referenceCategory" : "PACKAGE-MANAGER",
      "referenceLocator" : "pkg:generic/libidn2-0-2.0.5-1%2Bdeb10u1@2.0.5-1%2Bdeb10u1",
      "referenceType" : "purl"
    } ],
    "filesAnalyzed" : false,
    "homepage" : "https://www.gnu.org/software/libidn/#libidn2",
    "licenseConcluded" : "NOASSERTION",
    "licenseDeclared" : "NOASSERTION",
    "name" : "libidn2-0-2.0.5-1+deb10u1",
    "versionInfo" : "2.0.5-1+deb10u1"
  }, {
    "SPDXID" : "SPDXRef-gnrtd30",
    "copyrightText" : "NOASSERTION",
    "downloadLocation" : "NOASSERTION",
    "externalRefs" : [ {
      "referenceCategory" : "PACKAGE-MANAGER",
      "referenceLocator" : "pkg:generic/findutils-4.6.0%2Bgit%2B20190209-2@4.6.0%2Bgit%2B20190209-2",
      "referenceType" : "purl"
    } ],
    "filesAnalyzed" : false,
    "homepage" : "https://savannah.gnu.org/projects/findutils/",
    "licenseConcluded" : "NOASSERTION",
    "licenseDeclared" : "NOASSERTION",
    "name" : "findutils-4.6.0+git+20190209-2",
    "versionInfo" : "4.6.0+git+20190209-2"
  }, {
    "SPDXID" : "SPDXRef-gnrtd31",
    "copyrightText" : "NOASSERTION",
    "downloadLocation" : "NOASSERTION",
    "externalRefs" : [ {
      "referenceCategory" : "PACKAGE-MANAGER",
      "referenceLocator" : "pkg:generic/libdb5.3-5.3.28%2Bdfsg1-0.5@5.3.28%2Bdfsg1-0.5",
      "referenceType" : "purl"
    } ],
    "filesAnalyzed" : false,
    "homepage" : "http://www.oracle.com/technetwork/database/database-technologies/berkeleydb/overview/index.html",
    "licenseConcluded" : "NOASSERTION",
    "licenseDeclared" : "NOASSERTION",
    "name" : "libdb5.3-5.3.28+dfsg1-0.5",
    "versionInfo" : "5.3.28+dfsg1-0.5"
  }, {
    "SPDXID" : "SPDXRef-gnrtd32",
    "copyrightText" : "NOASSERTION",
    "downloadLocation" : "NOASSERTION",
    "externalRefs" : [ {
      "referenceCategory" : "PACKAGE-MANAGER",
      "referenceLocator" : "pkg:generic/libgcc1-1%3A8.3.0-6@1%3A8.3.0-6",
      "referenceType" : "purl"
    } ],
    "filesAnalyzed" : false,
    "homepage" : "http://gcc.gnu.org/",
    "licenseConcluded" : "NOASSERTION",
    "licenseDeclared" : "NOASSERTION",
    "name" : "libgcc1-1:8.3.0-6",
    "versionInfo" : "1:8.3.0-6"
  }, {
    "SPDXID" : "SPDXRef-gnrtd33",
    "copyrightText" : "NOASSERTION",
    "downloadLocation" : "NOASSERTION",
    "externalRefs" : [ {
      "referenceCategory" : "PACKAGE-MANAGER",
      "referenceLocator" : "pkg:generic/nginx-1.14.2-2%2Bdeb10u5@1.14.2-2%2Bdeb10u5",
      "referenceType" : "purl"
    } ],
    "filesAnalyzed" : false,
    "homepage" : "https://nginx.net",
    "licenseConcluded" : "NOASSERTION",
    "licenseDeclared" : "NOASSERTION",
    "name" : "nginx-1.14.2-2+deb10u5",
    "versionInfo" : "1.14.2-2+deb10u5"
  }, {
    "SPDXID" : "SPDXRef-gnrtd34",
    "copyrightText" : "NOASSERTION",
    "downloadLocation" : "NOASSERTION",
    "externalRefs" : [ {
      "referenceCategory" : "PACKAGE-MANAGER",
      "referenceLocator" : "pkg:generic/libdebconfclient0-0.249@0.249",
      "referenceType" : "purl"
    } ],
    "filesAnalyzed" : false,
    "licenseConcluded" : "NOASSERTION",
    "licenseDeclared" : "NOASSERTION",
    "name" : "libdebconfclient0-0.249",
    "versionInfo" : "0.249"
  }, {
    "SPDXID" : "SPDXRef-gnrtd35",
    "copyrightText" : "NOASSERTION",
    "downloadLocation" : "NOASSERTION",
    "externalRefs" : [ {
      "referenceCategory" : "PACKAGE-MANAGER",
      "referenceLocator" : "pkg:generic/libtiff5-4.1.0%2Bgit191117-2~deb10u8@4.1.0%2Bgit191117-2~deb10u8",
      "referenceType" : "purl"
    } ],
    "filesAnalyzed" : false,
    "homepage" : "https://libtiff.gitlab.io/libtiff/",
    "licenseConcluded" : "NOASSERTION",
    "licenseDeclared" : "NOASSERTION",
    "name" : "libtiff5-4.1.0+git191117-2~deb10u8",
    "versionInfo" : "4.1.0+git191117-2~deb10u8"
  }, {
    "SPDXID" : "SPDXRef-gnrtd36",
    "copyrightText" : "NOASSERTION",
    "downloadLocation" : "NOASSERTION",
    "externalRefs" : [ {
      "referenceCategory" : "PACKAGE-MANAGER",
      "referenceLocator" : "pkg:generic/libicu63-63.1-6%2Bdeb10u3@63.1-6%2Bdeb10u3",
      "referenceType" : "purl"
    } ],
    "filesAnalyzed" : false,
    "homepage" : "http://www.icu-project.org",
    "licenseConcluded" : "NOASSERTION",
    "licenseDeclared" : "NOASSERTION",
    "name" : "libicu63-63.1-6+deb10u3",
    "versionInfo" : "63.1-6+deb10u3"
  }, {
    "SPDXID" : "SPDXRef-gnrtd37",
    "copyrightText" : "NOASSERTION",
    "downloadLocation" : "NOASSERTION",
    "externalRefs" : [ {
      "referenceCategory" : "PACKAGE-MANAGER",
      "referenceLocator" : "pkg:generic/libfdisk1-2.33.1-0.1@2.33.1-0.1",
      "referenceType" : "purl"
    } ],
    "filesAnalyzed" : false,
    "licenseConcluded" : "NOASSERTION",
    "licenseDeclared" : "NOASSERTION",
    "name" : "libfdisk1-2.33.1-0.1",
    "versionInfo" : "2.33.1-0.1"
  }, {
    "SPDXID" : "SPDXRef-gnrtd38",
    "copyrightText" : "NOASSERTION",
    "downloadLocation" : "NOASSERTION",
    "externalRefs" : [ {
      "referenceCategory" : "PACKAGE-MANAGER",
      "referenceLocator" : "pkg:generic/libffi6-3.2.1-9@3.2.1-9",
      "referenceType" : "purl"
    } ],
    "filesAnalyzed" : false,
    "homepage" : "https://sourceware.org/libffi/",
    "licenseConcluded" : "NOASSERTION",
    "licenseDeclared" : "NOASSERTION",
    "name" : "libffi6-3.2.1-9",
    "versionInfo" : "3.2.1-9"
  }, {
    "SPDXID" : "SPDXRef-gnrtd39",
    "copyrightText" : "NOASSERTION",
    "downloadLocation" : "NOASSERTION",
    "externalRefs" : [ {
      "referenceCategory" : "PACKAGE-MANAGER",
      "referenceLocator" : "pkg:generic/libtinfo6-6.1%2B20181013-2%2Bdeb10u4@6.1%2B20181013-2%2Bdeb10u4",
      "referenceType" : "purl"
    } ],
    "filesAnalyzed" : false,
    "homepage" : "https://invisible-island.net/ncurses/",
    "licenseConcluded" : "NOASSERTION",
    "licenseDeclared" : "NOASSERTION",
    "name" : "libtinfo6-6.1+20181013-2+deb10u4",
    "versionInfo" : "6.1+20181013-2+deb10u4"
  }, {
    "SPDXID" : "SPDXRef-gnrtd40",
    "copyrightText" : "NOASSERTION",
    "downloadLocation" : "NOASSERTION",
    "externalRefs" : [ {
      "referenceCategory" : "PACKAGE-MANAGER",
      "referenceLocator" : "pkg:generic/sed-4.7-1@4.7-1",
      "referenceType" : "purl"
    } ],
    "filesAnalyzed" : false,
    "homepage" : "https://www.gnu.org/software/sed/",
    "licenseConcluded" : "NOASSERTION",
    "licenseDeclared" : "NOASSERTION",
    "name" : "sed-4.7-1",
    "versionInfo" : "4.7-1"
  }, {
    "SPDXID" : "SPDXRef-gnrtd41",
    "copyrightText" : "NOASSERTION",
    "downloadLocation" : "NOASSERTION",
    "externalRefs" : [ {
      "referenceCategory" : "PACKAGE-MANAGER",
      "referenceLocator" : "pkg:generic/e2fsprogs-1.44.5-1%2Bdeb10u3A~5.0.0.202203012114@1.44.5-1%2Bdeb10u3A~5.0.0.202203012114",
      "referenceType" : "purl"
    } ],
    "filesAnalyzed" : false,
    "homepage" : "http://e2fsprogs.sourceforge.net",
    "licenseConcluded" : "NOASSERTION",
    "licenseDeclared" : "NOASSERTION",
    "name" : "e2fsprogs-1.44.5-1+deb10u3A~5.0.0.202203012114",
    "versionInfo" : "1.44.5-1+deb10u3A~5.0.0.202203012114"
  }, {
    "SPDXID" : "SPDXRef-gnrtd42",
    "copyrightText" : "NOASSERTION",
    "downloadLocation" : "NOASSERTION",
    "externalRefs" : [ {
      "referenceCategory" : "PACKAGE-MANAGER",
      "referenceLocator" : "pkg:generic/libext2fs2-1.44.5-1%2Bdeb10u3A~5.0.0.202203012114@1.44.5-1%2Bdeb10u3A~5.0.0.202203012114",
      "referenceType" : "purl"
    } ],
    "filesAnalyzed" : false,
    "homepage" : "http://e2fsprogs.sourceforge.net",
    "licenseConcluded" : "NOASSERTION",
    "licenseDeclared" : "NOASSERTION",
    "name" : "libext2fs2-1.44.5-1+deb10u3A~5.0.0.202203012114",
    "versionInfo" : "1.44.5-1+deb10u3A~5.0.0.202203012114"
  }, {
    "SPDXID" : "SPDXRef-gnrtd43",
    "copyrightText" : "NOASSERTION",
    "downloadLocation" : "NOASSERTION",
    "externalRefs" : [ {
      "referenceCategory" : "PACKAGE-MANAGER",
      "referenceLocator" : "pkg:generic/nginx-common-1.14.2-2%2Bdeb10u5@1.14.2-2%2Bdeb10u5",
      "referenceType" : "purl"
    } ],
    "filesAnalyzed" : false,
    "homepage" : "https://nginx.net",
    "licenseConcluded" : "NOASSERTION",
    "licenseDeclared" : "NOASSERTION",
    "name" : "nginx-common-1.14.2-2+deb10u5",
    "versionInfo" : "1.14.2-2+deb10u5"
  }, {
    "SPDXID" : "SPDXRef-gnrtd44",
    "copyrightText" : "NOASSERTION",
    "downloadLocation" : "NOASSERTION",
    "externalRefs" : [ {
      "referenceCategory" : "PACKAGE-MANAGER",
      "referenceLocator" : "pkg:generic/libstdc%2B%2B6-8.3.0-6@8.3.0-6",
      "referenceType" : "purl"
    } ],
    "filesAnalyzed" : false,
    "homepage" : "http://gcc.gnu.org/",
    "licenseConcluded" : "NOASSERTION",
    "licenseDeclared" : "NOASSERTION",
    "name" : "libstdc++6-8.3.0-6",
    "versionInfo" : "8.3.0-6"
  }, {
    "SPDXID" : "SPDXRef-gnrtd45",
    "copyrightText" : "NOASSERTION",
    "downloadLocation" : "NOASSERTION",
    "externalRefs" : [ {
      "referenceCategory" : "PACKAGE-MANAGER",
      "referenceLocator" : "pkg:generic/libnginx-mod-http-upstream-fair-1.14.2-2%2Bdeb10u5@1.14.2-2%2Bdeb10u5",
      "referenceType" : "purl"
    } ],
    "filesAnalyzed" : false,
    "homepage" : "https://nginx.net",
    "licenseConcluded" : "NOASSERTION",
    "licenseDeclared" : "NOASSERTION",
    "name" : "libnginx-mod-http-upstream-fair-1.14.2-2+deb10u5",
    "versionInfo" : "1.14.2-2+deb10u5"
  }, {
    "SPDXID" : "SPDXRef-gnrtd46",
    "copyrightText" : "NOASSERTION",
    "downloadLocation" : "NOASSERTION",
    "externalRefs" : [ {
      "referenceCategory" : "PACKAGE-MANAGER",
      "referenceLocator" : "pkg:generic/libexpat1-2.2.6-2%2Bdeb10u6@2.2.6-2%2Bdeb10u6",
      "referenceType" : "purl"
    } ],
    "filesAnalyzed" : false,
    "homepage" : "https://libexpat.github.io/",
    "licenseConcluded" : "NOASSERTION",
    "licenseDeclared" : "NOASSERTION",
    "name" : "libexpat1-2.2.6-2+deb10u6",
    "versionInfo" : "2.2.6-2+deb10u6"
  }, {
    "SPDXID" : "SPDXRef-gnrtd47",
    "copyrightText" : "NOASSERTION",
    "downloadLocation" : "NOASSERTION",
    "externalRefs" : [ {
      "referenceCategory" : "PACKAGE-MANAGER",
      "referenceLocator" : "pkg:generic/libsmartcols1-2.33.1-0.1@2.33.1-0.1",
      "referenceType" : "purl"
    } ],
    "filesAnalyzed" : false,
    "licenseConcluded" : "NOASSERTION",
    "licenseDeclared" : "NOASSERTION",
    "name" : "libsmartcols1-2.33.1-0.1",
    "versionInfo" : "2.33.1-0.1"
  }, {
    "SPDXID" : "SPDXRef-gnrtd48",
    "copyrightText" : "NOASSERTION",
    "downloadLocation" : "NOASSERTION",
    "externalRefs" : [ {
      "referenceCategory" : "PACKAGE-MANAGER",
      "referenceLocator" : "pkg:generic/debianutils-4.8.6.1@4.8.6.1",
      "referenceType" : "purl"
    } ],
    "filesAnalyzed" : false,
    "licenseConcluded" : "NOASSERTION",
    "licenseDeclared" : "NOASSERTION",
    "name" : "debianutils-4.8.6.1",
    "versionInfo" : "4.8.6.1"
  }, {
    "SPDXID" : "SPDXRef-gnrtd49",
    "copyrightText" : "NOASSERTION",
    "downloadLocation" : "NOASSERTION",
    "externalRefs" : [ {
      "referenceCategory" : "PACKAGE-MANAGER",
      "referenceLocator" : "pkg:generic/fontconfig-config-2.13.1-2@2.13.1-2",
      "referenceType" : "purl"
    } ],
    "filesAnalyzed" : false,
    "homepage" : "https://www.freedesktop.org/wiki/Software/fontconfig/",
    "licenseConcluded" : "NOASSERTION",
    "licenseDeclared" : "NOASSERTION",
    "name" : "fontconfig-config-2.13.1-2",
    "versionInfo" : "2.13.1-2"
  }, {
    "SPDXID" : "SPDXRef-gnrtd50",
    "copyrightText" : "NOASSERTION",
    "downloadLocation" : "NOASSERTION",
    "externalRefs" : [ {
      "referenceCategory" : "PACKAGE-MANAGER",
      "referenceLocator" : "pkg:generic/libbsd0-0.9.1-2%2Bdeb10u1@0.9.1-2%2Bdeb10u1",
      "referenceType" : "purl"
    } ],
    "filesAnalyzed" : false,
    "homepage" : "https://libbsd.freedesktop.org/",
    "licenseConcluded" : "NOASSERTION",
    "licenseDeclared" : "NOASSERTION",
    "name" : "libbsd0-0.9.1-2+deb10u1",
    "versionInfo" : "0.9.1-2+deb10u1"
  }, {
    "SPDXID" : "SPDXRef-gnrtd51",
    "copyrightText" : "NOASSERTION",
    "downloadLocation" : "NOASSERTION",
    "externalRefs" : [ {
      "referenceCategory" : "PACKAGE-MANAGER",
      "referenceLocator" : "pkg:generic/libgpg-error0-1.35-1@1.35-1",
      "referenceType" : "purl"
    } ],
    "filesAnalyzed" : false,
    "homepage" : "https://www.gnupg.org/related_software/libgpg-error/",
    "licenseConcluded" : "NOASSERTION",
    "licenseDeclared" : "NOASSERTION",
    "name" : "libgpg-error0-1.35-1",
    "versionInfo" : "1.35-1"
  }, {
    "SPDXID" : "SPDXRef-gnrtd52",
    "copyrightText" : "NOASSERTION",
    "downloadLocation" : "NOASSERTION",
    "externalRefs" : [ {
      "referenceCategory" : "PACKAGE-MANAGER",
      "referenceLocator" : "pkg:generic/libcom-err2-1.44.5-1%2Bdeb10u3A~5.0.0.202203012114@1.44.5-1%2Bdeb10u3A~5.0.0.202203012114",
      "referenceType" : "purl"
    } ],
    "filesAnalyzed" : false,
    "homepage" : "http://e2fsprogs.sourceforge.net",
    "licenseConcluded" : "NOASSERTION",
    "licenseDeclared" : "NOASSERTION",
    "name" : "libcom-err2-1.44.5-1+deb10u3A~5.0.0.202203012114",
    "versionInfo" : "1.44.5-1+deb10u3A~5.0.0.202203012114"
  }, {
    "SPDXID" : "SPDXRef-gnrtd53",
    "copyrightText" : "NOASSERTION",
    "downloadLocation" : "NOASSERTION",
    "externalRefs" : [ {
      "referenceCategory" : "PACKAGE-MANAGER",
      "referenceLocator" : "pkg:generic/libbz2-1.0-1.0.6-9.2~deb10u2@1.0.6-9.2~deb10u2",
      "referenceType" : "purl"
    } ],
    "filesAnalyzed" : false,
    "homepage" : "https://web.archive.org/web/20180801004107/http://www.bzip.org/",
    "licenseConcluded" : "NOASSERTION",
    "licenseDeclared" : "NOASSERTION",
    "name" : "libbz2-1.0-1.0.6-9.2~deb10u2",
    "versionInfo" : "1.0.6-9.2~deb10u2"
  }, {
    "SPDXID" : "SPDXRef-gnrtd54",
    "copyrightText" : "NOASSERTION",
    "downloadLocation" : "NOASSERTION",
    "externalRefs" : [ {
      "referenceCategory" : "PACKAGE-MANAGER",
      "referenceLocator" : "pkg:generic/dpkg-1.19.8@1.19.8",
      "referenceType" : "purl"
    } ],
    "filesAnalyzed" : false,
    "homepage" : "https://wiki.debian.org/Teams/Dpkg",
    "licenseConcluded" : "NOASSERTION",
    "licenseDeclared" : "NOASSERTION",
    "name" : "dpkg-1.19.8",
    "versionInfo" : "1.19.8"
  }, {
    "SPDXID" : "SPDXRef-gnrtd55",
    "copyrightText" : "NOASSERTION",
    "downloadLocation" : "NOASSERTION",
    "externalRefs" : [ {
      "referenceCategory" : "PACKAGE-MANAGER",
      "referenceLocator" : "pkg:generic/libgnutls30-3.6.7-4%2Bdeb10u10@3.6.7-4%2Bdeb10u10",
      "referenceType" : "purl"
    } ],
    "filesAnalyzed" : false,
    "homepage" : "https://www.gnutls.org/",
    "licenseConcluded" : "NOASSERTION",
    "licenseDeclared" : "NOASSERTION",
    "name" : "libgnutls30-3.6.7-4+deb10u10",
    "versionInfo" : "3.6.7-4+deb10u10"
  }, {
    "SPDXID" : "SPDXRef-gnrtd56",
    "copyrightText" : "NOASSERTION",
    "downloadLocation" : "NOASSERTION",
    "externalRefs" : [ {
      "referenceCategory" : "PACKAGE-MANAGER",
      "referenceLocator" : "pkg:generic/libapt-pkg5.0-1.8.2.3A~5.0.1.202112091343@1.8.2.3A~5.0.1.202112091343",
      "referenceType" : "purl"
    } ],
    "filesAnalyzed" : false,
    "licenseConcluded" : "NOASSERTION",
    "licenseDeclared" : "NOASSERTION",
    "name" : "libapt-pkg5.0-1.8.2.3A~5.0.1.202112091343",
    "versionInfo" : "1.8.2.3A~5.0.1.202112091343"
  }, {
    "SPDXID" : "SPDXRef-gnrtd57",
    "copyrightText" : "NOASSERTION",
    "downloadLocation" : "NOASSERTION",
    "externalRefs" : [ {
      "referenceCategory" : "PACKAGE-MANAGER",
      "referenceLocator" : "pkg:generic/libnginx-mod-http-image-filter-1.14.2-2%2Bdeb10u5@1.14.2-2%2Bdeb10u5",
      "referenceType" : "purl"
    } ],
    "filesAnalyzed" : false,
    "homepage" : "https://nginx.net",
    "licenseConcluded" : "NOASSERTION",
    "licenseDeclared" : "NOASSERTION",
    "name" : "libnginx-mod-http-image-filter-1.14.2-2+deb10u5",
    "versionInfo" : "1.14.2-2+deb10u5"
  }, {
    "SPDXID" : "SPDXRef-gnrtd58",
    "copyrightText" : "NOASSERTION",
    "downloadLocation" : "NOASSERTION",
    "externalRefs" : [ {
      "referenceCategory" : "PACKAGE-MANAGER",
      "referenceLocator" : "pkg:generic/bsdutils-1%3A2.33.1-0.1@1%3A2.33.1-0.1",
      "referenceType" : "purl"
    } ],
    "filesAnalyzed" : false,
    "licenseConcluded" : "NOASSERTION",
    "licenseDeclared" : "NOASSERTION",
    "name" : "bsdutils-1:2.33.1-0.1",
    "versionInfo" : "1:2.33.1-0.1"
  }, {
    "SPDXID" : "SPDXRef-gnrtd59",
    "copyrightText" : "NOASSERTION",
    "downloadLocation" : "NOASSERTION",
    "externalRefs" : [ {
      "referenceCategory" : "PACKAGE-MANAGER",
      "referenceLocator" : "pkg:generic/mawk-1.3.3-17%2Bb3@1.3.3-17%2Bb3",
      "referenceType" : "purl"
    } ],
    "filesAnalyzed" : false,
    "licenseConcluded" : "NOASSERTION",
    "licenseDeclared" : "NOASSERTION",
    "name" : "mawk-1.3.3-17+b3",
    "versionInfo" : "1.3.3-17+b3"
  }, {
    "SPDXID" : "SPDXRef-gnrtd60",
    "copyrightText" : "NOASSERTION",
    "downloadLocation" : "NOASSERTION",
    "externalRefs" : [ {
      "referenceCategory" : "PACKAGE-MANAGER",
      "referenceLocator" : "pkg:generic/libunistring2-0.9.10-1@0.9.10-1",
      "referenceType" : "purl"
    } ],
    "filesAnalyzed" : false,
    "homepage" : "https://www.gnu.org/software/libunistring/",
    "licenseConcluded" : "NOASSERTION",
    "licenseDeclared" : "NOASSERTION",
    "name" : "libunistring2-0.9.10-1",
    "versionInfo" : "0.9.10-1"
  }, {
    "SPDXID" : "SPDXRef-gnrtd61",
    "copyrightText" : "NOASSERTION",
    "downloadLocation" : "NOASSERTION",
    "externalRefs" : [ {
      "referenceCategory" : "PACKAGE-MANAGER",
      "referenceLocator" : "pkg:generic/univention-archive-key-10.0.0-2A~5.0.0.202009211852@10.0.0-2A~5.0.0.202009211852",
      "referenceType" : "purl"
    } ],
    "filesAnalyzed" : false,
    "licenseConcluded" : "NOASSERTION",
    "licenseDeclared" : "NOASSERTION",
    "name" : "univention-archive-key-10.0.0-2A~5.0.0.202009211852",
    "versionInfo" : "10.0.0-2A~5.0.0.202009211852"
  }, {
    "SPDXID" : "SPDXRef-gnrtd62",
    "copyrightText" : "NOASSERTION",
    "downloadLocation" : "NOASSERTION",
    "externalRefs" : [ {
      "referenceCategory" : "PACKAGE-MANAGER",
      "referenceLocator" : "pkg:generic/libjpeg62-turbo-1%3A1.5.2-2%2Bdeb10u1@1%3A1.5.2-2%2Bdeb10u1",
      "referenceType" : "purl"
    } ],
    "filesAnalyzed" : false,
    "homepage" : "http://www.libjpeg-turbo.org/",
    "licenseConcluded" : "NOASSERTION",
    "licenseDeclared" : "NOASSERTION",
    "name" : "libjpeg62-turbo-1:1.5.2-2+deb10u1",
    "versionInfo" : "1:1.5.2-2+deb10u1"
  }, {
    "SPDXID" : "SPDXRef-gnrtd63",
    "copyrightText" : "NOASSERTION",
    "downloadLocation" : "NOASSERTION",
    "externalRefs" : [ {
      "referenceCategory" : "PACKAGE-MANAGER",
      "referenceLocator" : "pkg:generic/dash-0.5.10.2-5@0.5.10.2-5",
      "referenceType" : "purl"
    } ],
    "filesAnalyzed" : false,
    "homepage" : "http://gondor.apana.org.au/~herbert/dash/",
    "licenseConcluded" : "NOASSERTION",
    "licenseDeclared" : "NOASSERTION",
    "name" : "dash-0.5.10.2-5",
    "versionInfo" : "0.5.10.2-5"
  }, {
    "SPDXID" : "SPDXRef-gnrtd64",
    "copyrightText" : "NOASSERTION",
    "downloadLocation" : "NOASSERTION",
    "externalRefs" : [ {
      "referenceCategory" : "PACKAGE-MANAGER",
      "referenceLocator" : "pkg:generic/libnginx-mod-http-geoip-1.14.2-2%2Bdeb10u5@1.14.2-2%2Bdeb10u5",
      "referenceType" : "purl"
    } ],
    "filesAnalyzed" : false,
    "homepage" : "https://nginx.net",
    "licenseConcluded" : "NOASSERTION",
    "licenseDeclared" : "NOASSERTION",
    "name" : "libnginx-mod-http-geoip-1.14.2-2+deb10u5",
    "versionInfo" : "1.14.2-2+deb10u5"
  }, {
    "SPDXID" : "SPDXRef-gnrtd65",
    "copyrightText" : "NOASSERTION",
    "downloadLocation" : "NOASSERTION",
    "externalRefs" : [ {
      "referenceCategory" : "PACKAGE-MANAGER",
      "referenceLocator" : "pkg:generic/libtasn1-6-4.13-3%2Bdeb10u1@4.13-3%2Bdeb10u1",
      "referenceType" : "purl"
    } ],
    "filesAnalyzed" : false,
    "homepage" : "http://www.gnu.org/software/libtasn1/",
    "licenseConcluded" : "NOASSERTION",
    "licenseDeclared" : "NOASSERTION",
    "name" : "libtasn1-6-4.13-3+deb10u1",
    "versionInfo" : "4.13-3+deb10u1"
  }, {
    "SPDXID" : "SPDXRef-gnrtd66",
    "copyrightText" : "NOASSERTION",
    "downloadLocation" : "NOASSERTION",
    "externalRefs" : [ {
      "referenceCategory" : "PACKAGE-MANAGER",
      "referenceLocator" : "pkg:generic/sensible-utils-0.0.12@0.0.12",
      "referenceType" : "purl"
    } ],
    "filesAnalyzed" : false,
    "licenseConcluded" : "NOASSERTION",
    "licenseDeclared" : "NOASSERTION",
    "name" : "sensible-utils-0.0.12",
    "versionInfo" : "0.0.12"
  }, {
    "SPDXID" : "SPDXRef-gnrtd67",
    "copyrightText" : "NOASSERTION",
    "downloadLocation" : "NOASSERTION",
    "externalRefs" : [ {
      "referenceCategory" : "PACKAGE-MANAGER",
      "referenceLocator" : "pkg:generic/libseccomp2-2.5.1-1~bpo10%2B1A~5.0.0.202303281914@2.5.1-1~bpo10%2B1A~5.0.0.202303281914",
      "referenceType" : "purl"
    } ],
    "filesAnalyzed" : false,
    "homepage" : "https://github.com/seccomp/libseccomp",
    "licenseConcluded" : "NOASSERTION",
    "licenseDeclared" : "NOASSERTION",
    "name" : "libseccomp2-2.5.1-1~bpo10+1A~5.0.0.202303281914",
    "versionInfo" : "2.5.1-1~bpo10+1A~5.0.0.202303281914"
  }, {
    "SPDXID" : "SPDXRef-gnrtd68",
    "copyrightText" : "NOASSERTION",
    "downloadLocation" : "NOASSERTION",
    "externalRefs" : [ {
      "referenceCategory" : "PACKAGE-MANAGER",
      "referenceLocator" : "pkg:generic/libblkid1-2.33.1-0.1@2.33.1-0.1",
      "referenceType" : "purl"
    } ],
    "filesAnalyzed" : false,
    "licenseConcluded" : "NOASSERTION",
    "licenseDeclared" : "NOASSERTION",
    "name" : "libblkid1-2.33.1-0.1",
    "versionInfo" : "2.33.1-0.1"
  }, {
    "SPDXID" : "SPDXRef-gnrtd69",
    "copyrightText" : "NOASSERTION",
    "downloadLocation" : "NOASSERTION",
    "externalRefs" : [ {
      "referenceCategory" : "PACKAGE-MANAGER",
      "referenceLocator" : "pkg:generic/libnettle6-3.4.1-1%2Bdeb10u1@3.4.1-1%2Bdeb10u1",
      "referenceType" : "purl"
    } ],
    "filesAnalyzed" : false,
    "homepage" : "http://www.lysator.liu.se/~nisse/nettle/",
    "licenseConcluded" : "NOASSERTION",
    "licenseDeclared" : "NOASSERTION",
    "name" : "libnettle6-3.4.1-1+deb10u1",
    "versionInfo" : "3.4.1-1+deb10u1"
  }, {
    "SPDXID" : "SPDXRef-gnrtd70",
    "copyrightText" : "NOASSERTION",
    "downloadLocation" : "NOASSERTION",
    "externalRefs" : [ {
      "referenceCategory" : "PACKAGE-MANAGER",
      "referenceLocator" : "pkg:generic/libnginx-mod-http-subs-filter-1.14.2-2%2Bdeb10u5@1.14.2-2%2Bdeb10u5",
      "referenceType" : "purl"
    } ],
    "filesAnalyzed" : false,
    "homepage" : "https://nginx.net",
    "licenseConcluded" : "NOASSERTION",
    "licenseDeclared" : "NOASSERTION",
    "name" : "libnginx-mod-http-subs-filter-1.14.2-2+deb10u5",
    "versionInfo" : "1.14.2-2+deb10u5"
  }, {
    "SPDXID" : "SPDXRef-gnrtd71",
    "copyrightText" : "NOASSERTION",
    "downloadLocation" : "NOASSERTION",
    "externalRefs" : [ {
      "referenceCategory" : "PACKAGE-MANAGER",
      "referenceLocator" : "pkg:generic/perl-base-5.28.1-6%2Bdeb10u1@5.28.1-6%2Bdeb10u1",
      "referenceType" : "purl"
    } ],
    "filesAnalyzed" : false,
    "homepage" : "http://dev.perl.org/perl5/",
    "licenseConcluded" : "NOASSERTION",
    "licenseDeclared" : "NOASSERTION",
    "name" : "perl-base-5.28.1-6+deb10u1",
    "versionInfo" : "5.28.1-6+deb10u1"
  }, {
    "SPDXID" : "SPDXRef-gnrtd72",
    "copyrightText" : "NOASSERTION",
    "downloadLocation" : "NOASSERTION",
    "externalRefs" : [ {
      "referenceCategory" : "PACKAGE-MANAGER",
      "referenceLocator" : "pkg:generic/libattr1-1%3A2.4.48-4@1%3A2.4.48-4",
      "referenceType" : "purl"
    } ],
    "filesAnalyzed" : false,
    "homepage" : "https://savannah.nongnu.org/projects/attr/",
    "licenseConcluded" : "NOASSERTION",
    "licenseDeclared" : "NOASSERTION",
    "name" : "libattr1-1:2.4.48-4",
    "versionInfo" : "1:2.4.48-4"
  }, {
    "SPDXID" : "SPDXRef-gnrtd73",
    "copyrightText" : "NOASSERTION",
    "downloadLocation" : "NOASSERTION",
    "externalRefs" : [ {
      "referenceCategory" : "PACKAGE-MANAGER",
      "referenceLocator" : "pkg:generic/fdisk-2.33.1-0.1@2.33.1-0.1",
      "referenceType" : "purl"
    } ],
    "filesAnalyzed" : false,
    "licenseConcluded" : "NOASSERTION",
    "licenseDeclared" : "NOASSERTION",
    "name" : "fdisk-2.33.1-0.1",
    "versionInfo" : "2.33.1-0.1"
  }, {
    "SPDXID" : "SPDXRef-gnrtd74",
    "copyrightText" : "NOASSERTION",
    "downloadLocation" : "NOASSERTION",
    "externalRefs" : [ {
      "referenceCategory" : "PACKAGE-MANAGER",
      "referenceLocator" : "pkg:generic/sysvinit-utils-2.93-8A~5.0.0.202203012133@2.93-8A~5.0.0.202203012133",
      "referenceType" : "purl"
    } ],
    "filesAnalyzed" : false,
    "homepage" : "http://savannah.nongnu.org/projects/sysvinit",
    "licenseConcluded" : "NOASSERTION",
    "licenseDeclared" : "NOASSERTION",
    "name" : "sysvinit-utils-2.93-8A~5.0.0.202203012133",
    "versionInfo" : "2.93-8A~5.0.0.202203012133"
  }, {
    "SPDXID" : "SPDXRef-gnrtd75",
    "copyrightText" : "NOASSERTION",
    "downloadLocation" : "NOASSERTION",
    "externalRefs" : [ {
      "referenceCategory" : "PACKAGE-MANAGER",
      "referenceLocator" : "pkg:generic/libss2-1.44.5-1%2Bdeb10u3A~5.0.0.202203012114@1.44.5-1%2Bdeb10u3A~5.0.0.202203012114",
      "referenceType" : "purl"
    } ],
    "filesAnalyzed" : false,
    "homepage" : "http://e2fsprogs.sourceforge.net",
    "licenseConcluded" : "NOASSERTION",
    "licenseDeclared" : "NOASSERTION",
    "name" : "libss2-1.44.5-1+deb10u3A~5.0.0.202203012114",
    "versionInfo" : "1.44.5-1+deb10u3A~5.0.0.202203012114"
  }, {
    "SPDXID" : "SPDXRef-gnrtd76",
    "copyrightText" : "NOASSERTION",
    "downloadLocation" : "NOASSERTION",
    "externalRefs" : [ {
      "referenceCategory" : "PACKAGE-MANAGER",
      "referenceLocator" : "pkg:generic/coreutils-8.30-3@8.30-3",
      "referenceType" : "purl"
    } ],
    "filesAnalyzed" : false,
    "homepage" : "http://gnu.org/software/coreutils",
    "licenseConcluded" : "NOASSERTION",
    "licenseDeclared" : "NOASSERTION",
    "name" : "coreutils-8.30-3",
    "versionInfo" : "8.30-3"
  }, {
    "SPDXID" : "SPDXRef-gnrtd77",
    "copyrightText" : "NOASSERTION",
    "downloadLocation" : "NOASSERTION",
    "externalRefs" : [ {
      "referenceCategory" : "PACKAGE-MANAGER",
      "referenceLocator" : "pkg:generic/libcap-ng0-0.7.9-2@0.7.9-2",
      "referenceType" : "purl"
    } ],
    "filesAnalyzed" : false,
    "homepage" : "http://people.redhat.com/sgrubb/libcap-ng",
    "licenseConcluded" : "NOASSERTION",
    "licenseDeclared" : "NOASSERTION",
    "name" : "libcap-ng0-0.7.9-2",
    "versionInfo" : "0.7.9-2"
  }, {
    "SPDXID" : "SPDXRef-gnrtd78",
    "copyrightText" : "NOASSERTION",
    "downloadLocation" : "NOASSERTION",
    "externalRefs" : [ {
      "referenceCategory" : "PACKAGE-MANAGER",
      "referenceLocator" : "pkg:generic/libsystemd0-241-7~deb10u10A~5.0.4.202307030913@241-7~deb10u10A~5.0.4.202307030913",
      "referenceType" : "purl"
    } ],
    "filesAnalyzed" : false,
    "homepage" : "https://www.freedesktop.org/wiki/Software/systemd",
    "licenseConcluded" : "NOASSERTION",
    "licenseDeclared" : "NOASSERTION",
    "name" : "libsystemd0-241-7~deb10u10A~5.0.4.202307030913",
    "versionInfo" : "241-7~deb10u10A~5.0.4.202307030913"
  }, {
    "SPDXID" : "SPDXRef-gnrtd79",
    "copyrightText" : "NOASSERTION",
    "downloadLocation" : "NOASSERTION",
    "externalRefs" : [ {
      "referenceCategory" : "PACKAGE-MANAGER",
      "referenceLocator" : "pkg:generic/libxdmcp6-1%3A1.1.2-3@1%3A1.1.2-3",
      "referenceType" : "purl"
    } ],
    "filesAnalyzed" : false,
    "licenseConcluded" : "NOASSERTION",
    "licenseDeclared" : "NOASSERTION",
    "name" : "libxdmcp6-1:1.1.2-3",
    "versionInfo" : "1:1.1.2-3"
  }, {
    "SPDXID" : "SPDXRef-gnrtd80",
    "copyrightText" : "NOASSERTION",
    "downloadLocation" : "NOASSERTION",
    "externalRefs" : [ {
      "referenceCategory" : "PACKAGE-MANAGER",
      "referenceLocator" : "pkg:generic/libaudit1-1%3A2.8.4-3@1%3A2.8.4-3",
      "referenceType" : "purl"
    } ],
    "filesAnalyzed" : false,
    "homepage" : "https://people.redhat.com/sgrubb/audit/",
    "licenseConcluded" : "NOASSERTION",
    "licenseDeclared" : "NOASSERTION",
    "name" : "libaudit1-1:2.8.4-3",
    "versionInfo" : "1:2.8.4-3"
  }, {
    "SPDXID" : "SPDXRef-gnrtd81",
    "copyrightText" : "NOASSERTION",
    "downloadLocation" : "NOASSERTION",
    "externalRefs" : [ {
      "referenceCategory" : "PACKAGE-MANAGER",
      "referenceLocator" : "pkg:generic/libpcre3-2%3A8.39-12@2%3A8.39-12",
      "referenceType" : "purl"
    } ],
    "filesAnalyzed" : false,
    "licenseConcluded" : "NOASSERTION",
    "licenseDeclared" : "NOASSERTION",
    "name" : "libpcre3-2:8.39-12",
    "versionInfo" : "2:8.39-12"
  }, {
    "SPDXID" : "SPDXRef-gnrtd82",
    "copyrightText" : "NOASSERTION",
    "downloadLocation" : "NOASSERTION",
    "externalRefs" : [ {
      "referenceCategory" : "PACKAGE-MANAGER",
      "referenceLocator" : "pkg:generic/libxau6-1%3A1.0.8-1%2Bb2@1%3A1.0.8-1%2Bb2",
      "referenceType" : "purl"
    } ],
    "filesAnalyzed" : false,
    "licenseConcluded" : "NOASSERTION",
    "licenseDeclared" : "NOASSERTION",
    "name" : "libxau6-1:1.0.8-1+b2",
    "versionInfo" : "1:1.0.8-1+b2"
  }, {
    "SPDXID" : "SPDXRef-gnrtd83",
    "copyrightText" : "NOASSERTION",
    "downloadLocation" : "NOASSERTION",
    "externalRefs" : [ {
      "referenceCategory" : "PACKAGE-MANAGER",
      "referenceLocator" : "pkg:generic/grep-3.3-1@3.3-1",
      "referenceType" : "purl"
    } ],
    "filesAnalyzed" : false,
    "homepage" : "http://www.gnu.org/software/grep/",
    "licenseConcluded" : "NOASSERTION",
    "licenseDeclared" : "NOASSERTION",
    "name" : "grep-3.3-1",
    "versionInfo" : "3.3-1"
  }, {
    "SPDXID" : "SPDXRef-gnrtd84",
    "copyrightText" : "NOASSERTION",
    "downloadLocation" : "NOASSERTION",
    "externalRefs" : [ {
      "referenceCategory" : "PACKAGE-MANAGER",
      "referenceLocator" : "pkg:generic/libxml2-2.9.4%2Bdfsg1-7%2Bdeb10u6@2.9.4%2Bdfsg1-7%2Bdeb10u6",
      "referenceType" : "purl"
    } ],
    "filesAnalyzed" : false,
    "homepage" : "http://xmlsoft.org",
    "licenseConcluded" : "NOASSERTION",
    "licenseDeclared" : "NOASSERTION",
    "name" : "libxml2-2.9.4+dfsg1-7+deb10u6",
    "versionInfo" : "2.9.4+dfsg1-7+deb10u6"
  }, {
    "SPDXID" : "SPDXRef-gnrtd85",
    "copyrightText" : "NOASSERTION",
    "downloadLocation" : "NOASSERTION",
    "externalRefs" : [ {
      "referenceCategory" : "PACKAGE-MANAGER",
      "referenceLocator" : "pkg:generic/tzdata-2021a-0%2Bdeb10u11@2021a-0%2Bdeb10u11",
      "referenceType" : "purl"
    } ],
    "filesAnalyzed" : false,
    "homepage" : "https://www.iana.org/time-zones",
    "licenseConcluded" : "NOASSERTION",
    "licenseDeclared" : "NOASSERTION",
    "name" : "tzdata-2021a-0+deb10u11",
    "versionInfo" : "2021a-0+deb10u11"
  }, {
    "SPDXID" : "SPDXRef-gnrtd86",
    "copyrightText" : "NOASSERTION",
    "downloadLocation" : "NOASSERTION",
    "externalRefs" : [ {
      "referenceCategory" : "PACKAGE-MANAGER",
      "referenceLocator" : "pkg:generic/ncurses-base-6.1%2B20181013-2%2Bdeb10u4@6.1%2B20181013-2%2Bdeb10u4",
      "referenceType" : "purl"
    } ],
    "filesAnalyzed" : false,
    "homepage" : "https://invisible-island.net/ncurses/",
    "licenseConcluded" : "NOASSERTION",
    "licenseDeclared" : "NOASSERTION",
    "name" : "ncurses-base-6.1+20181013-2+deb10u4",
    "versionInfo" : "6.1+20181013-2+deb10u4"
  }, {
    "SPDXID" : "SPDXRef-gnrtd87",
    "copyrightText" : "NOASSERTION",
    "downloadLocation" : "NOASSERTION",
    "externalRefs" : [ {
      "referenceCategory" : "PACKAGE-MANAGER",
      "referenceLocator" : "pkg:generic/bash-5.0-4@5.0-4",
      "referenceType" : "purl"
    } ],
    "filesAnalyzed" : false,
    "homepage" : "http://tiswww.case.edu/php/chet/bash/bashtop.html",
    "licenseConcluded" : "NOASSERTION",
    "licenseDeclared" : "NOASSERTION",
    "name" : "bash-5.0-4",
    "versionInfo" : "5.0-4"
  }, {
    "SPDXID" : "SPDXRef-gnrtd88",
    "copyrightText" : "NOASSERTION",
    "downloadLocation" : "NOASSERTION",
    "externalRefs" : [ {
      "referenceCategory" : "PACKAGE-MANAGER",
      "referenceLocator" : "pkg:generic/libhogweed4-3.4.1-1%2Bdeb10u1@3.4.1-1%2Bdeb10u1",
      "referenceType" : "purl"
    } ],
    "filesAnalyzed" : false,
    "homepage" : "http://www.lysator.liu.se/~nisse/nettle/",
    "licenseConcluded" : "NOASSERTION",
    "licenseDeclared" : "NOASSERTION",
    "name" : "libhogweed4-3.4.1-1+deb10u1",
    "versionInfo" : "3.4.1-1+deb10u1"
  }, {
    "SPDXID" : "SPDXRef-gnrtd89",
    "copyrightText" : "NOASSERTION",
    "downloadLocation" : "NOASSERTION",
    "externalRefs" : [ {
      "referenceCategory" : "PACKAGE-MANAGER",
      "referenceLocator" : "pkg:generic/libpng16-16-1.6.36-6@1.6.36-6",
      "referenceType" : "purl"
    } ],
    "filesAnalyzed" : false,
    "homepage" : "http://libpng.org/pub/png/libpng.html",
    "licenseConcluded" : "NOASSERTION",
    "licenseDeclared" : "NOASSERTION",
    "name" : "libpng16-16-1.6.36-6",
    "versionInfo" : "1.6.36-6"
  }, {
    "SPDXID" : "SPDXRef-gnrtd90",
    "copyrightText" : "NOASSERTION",
    "downloadLocation" : "NOASSERTION",
    "externalRefs" : [ {
      "referenceCategory" : "PACKAGE-MANAGER",
      "referenceLocator" : "pkg:generic/libc-bin-2.28-10%2Bdeb10u2@2.28-10%2Bdeb10u2",
      "referenceType" : "purl"
    } ],
    "filesAnalyzed" : false,
    "homepage" : "https://www.gnu.org/software/libc/libc.html",
    "licenseConcluded" : "NOASSERTION",
    "licenseDeclared" : "NOASSERTION",
    "name" : "libc-bin-2.28-10+deb10u2",
    "versionInfo" : "2.28-10+deb10u2"
  }, {
    "SPDXID" : "SPDXRef-gnrtd91",
    "copyrightText" : "NOASSERTION",
    "downloadLocation" : "NOASSERTION",
    "externalRefs" : [ {
      "referenceCategory" : "PACKAGE-MANAGER",
      "referenceLocator" : "pkg:generic/libmount1-2.33.1-0.1@2.33.1-0.1",
      "referenceType" : "purl"
    } ],
    "filesAnalyzed" : false,
    "licenseConcluded" : "NOASSERTION",
    "licenseDeclared" : "NOASSERTION",
    "name" : "libmount1-2.33.1-0.1",
    "versionInfo" : "2.33.1-0.1"
  }, {
    "SPDXID" : "SPDXRef-gnrtd92",
    "copyrightText" : "NOASSERTION",
    "downloadLocation" : "NOASSERTION",
    "externalRefs" : [ {
      "referenceCategory" : "PACKAGE-MANAGER",
      "referenceLocator" : "pkg:generic/libacl1-2.2.53-4@2.2.53-4",
      "referenceType" : "purl"
    } ],
    "filesAnalyzed" : false,
    "homepage" : "https://savannah.nongnu.org/projects/acl/",
    "licenseConcluded" : "NOASSERTION",
    "licenseDeclared" : "NOASSERTION",
    "name" : "libacl1-2.2.53-4",
    "versionInfo" : "2.2.53-4"
  }, {
    "SPDXID" : "SPDXRef-gnrtd93",
    "copyrightText" : "NOASSERTION",
    "downloadLocation" : "NOASSERTION",
    "externalRefs" : [ {
      "referenceCategory" : "PACKAGE-MANAGER",
      "referenceLocator" : "pkg:generic/libp11-kit0-0.23.15-2%2Bdeb10u1@0.23.15-2%2Bdeb10u1",
      "referenceType" : "purl"
    } ],
    "filesAnalyzed" : false,
    "homepage" : "https://p11-glue.github.io/p11-glue/p11-kit.html",
    "licenseConcluded" : "NOASSERTION",
    "licenseDeclared" : "NOASSERTION",
    "name" : "libp11-kit0-0.23.15-2+deb10u1",
    "versionInfo" : "0.23.15-2+deb10u1"
  }, {
    "SPDXID" : "SPDXRef-gnrtd94",
    "copyrightText" : "NOASSERTION",
    "downloadLocation" : "NOASSERTION",
    "externalRefs" : [ {
      "referenceCategory" : "PACKAGE-MANAGER",
      "referenceLocator" : "pkg:generic/libzstd1-1.3.8%2Bdfsg-3%2Bdeb10u2@1.3.8%2Bdfsg-3%2Bdeb10u2",
      "referenceType" : "purl"
    } ],
    "filesAnalyzed" : false,
    "homepage" : "https://github.com/facebook/zstd",
    "licenseConcluded" : "NOASSERTION",
    "licenseDeclared" : "NOASSERTION",
    "name" : "libzstd1-1.3.8+dfsg-3+deb10u2",
    "versionInfo" : "1.3.8+dfsg-3+deb10u2"
  }, {
    "SPDXID" : "SPDXRef-gnrtd95",
    "copyrightText" : "NOASSERTION",
    "downloadLocation" : "NOASSERTION",
    "externalRefs" : [ {
      "referenceCategory" : "PACKAGE-MANAGER",
      "referenceLocator" : "pkg:generic/init-system-helpers-1.56%2Bnmu1@1.56%2Bnmu1",
      "referenceType" : "purl"
    } ],
    "filesAnalyzed" : false,
    "licenseConcluded" : "NOASSERTION",
    "licenseDeclared" : "NOASSERTION",
    "name" : "init-system-helpers-1.56+nmu1",
    "versionInfo" : "1.56+nmu1"
  }, {
    "SPDXID" : "SPDXRef-gnrtd96",
    "copyrightText" : "NOASSERTION",
    "downloadLocation" : "NOASSERTION",
    "externalRefs" : [ {
      "referenceCategory" : "PACKAGE-MANAGER",
      "referenceLocator" : "pkg:generic/libssl1.1-1.1.1n-0%2Bdeb10u6@1.1.1n-0%2Bdeb10u6",
      "referenceType" : "purl"
    } ],
    "filesAnalyzed" : false,
    "homepage" : "https://www.openssl.org/",
    "licenseConcluded" : "NOASSERTION",
    "licenseDeclared" : "NOASSERTION",
    "name" : "libssl1.1-1.1.1n-0+deb10u6",
    "versionInfo" : "1.1.1n-0+deb10u6"
  }, {
    "SPDXID" : "SPDXRef-gnrtd97",
    "copyrightText" : "NOASSERTION",
    "downloadLocation" : "NOASSERTION",
    "externalRefs" : [ {
      "referenceCategory" : "PACKAGE-MANAGER",
      "referenceLocator" : "pkg:generic/libpam-runtime-1.3.1-5A~5.0.0.202203012129@1.3.1-5A~5.0.0.202203012129",
      "referenceType" : "purl"
    } ],
    "filesAnalyzed" : false,
    "homepage" : "http://www.linux-pam.org/",
    "licenseConcluded" : "NOASSERTION",
    "licenseDeclared" : "NOASSERTION",
    "name" : "libpam-runtime-1.3.1-5A~5.0.0.202203012129",
    "versionInfo" : "1.3.1-5A~5.0.0.202203012129"
  }, {
    "SPDXID" : "SPDXRef-gnrtd98",
    "copyrightText" : "NOASSERTION",
    "downloadLocation" : "NOASSERTION",
    "externalRefs" : [ {
      "referenceCategory" : "PACKAGE-MANAGER",
      "referenceLocator" : "pkg:generic/libpam-modules-bin-1.3.1-5A~5.0.0.202203012129@1.3.1-5A~5.0.0.202203012129",
      "referenceType" : "purl"
    } ],
    "filesAnalyzed" : false,
    "homepage" : "http://www.linux-pam.org/",
    "licenseConcluded" : "NOASSERTION",
    "licenseDeclared" : "NOASSERTION",
    "name" : "libpam-modules-bin-1.3.1-5A~5.0.0.202203012129",
    "versionInfo" : "1.3.1-5A~5.0.0.202203012129"
  }, {
    "SPDXID" : "SPDXRef-gnrtd99",
    "copyrightText" : "NOASSERTION",
    "downloadLocation" : "NOASSERTION",
    "externalRefs" : [ {
      "referenceCategory" : "PACKAGE-MANAGER",
      "referenceLocator" : "pkg:generic/zlib1g-1%3A1.2.11.dfsg-1%2Bdeb10u2@1%3A1.2.11.dfsg-1%2Bdeb10u2",
      "referenceType" : "purl"
    } ],
    "filesAnalyzed" : false,
    "homepage" : "http://zlib.net/",
    "licenseConcluded" : "NOASSERTION",
    "licenseDeclared" : "NOASSERTION",
    "name" : "zlib1g-1:1.2.11.dfsg-1+deb10u2",
    "versionInfo" : "1:1.2.11.dfsg-1+deb10u2"
  }, {
    "SPDXID" : "SPDXRef-gnrtd100",
    "copyrightText" : "NOASSERTION",
    "downloadLocation" : "NOASSERTION",
    "externalRefs" : [ {
      "referenceCategory" : "PACKAGE-MANAGER",
      "referenceLocator" : "pkg:generic/libaudit-common-1%3A2.8.4-3@1%3A2.8.4-3",
      "referenceType" : "purl"
    } ],
    "filesAnalyzed" : false,
    "homepage" : "https://people.redhat.com/sgrubb/audit/",
    "licenseConcluded" : "NOASSERTION",
    "licenseDeclared" : "NOASSERTION",
    "name" : "libaudit-common-1:2.8.4-3",
    "versionInfo" : "1:2.8.4-3"
  }, {
    "SPDXID" : "SPDXRef-gnrtd101",
    "copyrightText" : "NOASSERTION",
    "downloadLocation" : "NOASSERTION",
    "externalRefs" : [ {
      "referenceCategory" : "PACKAGE-MANAGER",
      "referenceLocator" : "pkg:generic/liblzma5-5.2.4-1%2Bdeb10u1@5.2.4-1%2Bdeb10u1",
      "referenceType" : "purl"
    } ],
    "filesAnalyzed" : false,
    "homepage" : "https://tukaani.org/xz/",
    "licenseConcluded" : "NOASSERTION",
    "licenseDeclared" : "NOASSERTION",
    "name" : "liblzma5-5.2.4-1+deb10u1",
    "versionInfo" : "5.2.4-1+deb10u1"
  }, {
    "SPDXID" : "SPDXRef-gnrtd102",
    "copyrightText" : "NOASSERTION",
    "downloadLocation" : "NOASSERTION",
    "externalRefs" : [ {
      "referenceCategory" : "PACKAGE-MANAGER",
      "referenceLocator" : "pkg:generic/libsemanage-common-2.8-2@2.8-2",
      "referenceType" : "purl"
    } ],
    "filesAnalyzed" : false,
    "homepage" : "http://userspace.selinuxproject.org/",
    "licenseConcluded" : "NOASSERTION",
    "licenseDeclared" : "NOASSERTION",
    "name" : "libsemanage-common-2.8-2",
    "versionInfo" : "2.8-2"
  }, {
    "SPDXID" : "SPDXRef-gnrtd103",
    "copyrightText" : "NOASSERTION",
    "downloadLocation" : "NOASSERTION",
    "externalRefs" : [ {
      "referenceCategory" : "PACKAGE-MANAGER",
      "referenceLocator" : "pkg:generic/tar-1.30%2Bdfsg-6@1.30%2Bdfsg-6",
      "referenceType" : "purl"
    } ],
    "filesAnalyzed" : false,
    "homepage" : "https://www.gnu.org/software/tar/",
    "licenseConcluded" : "NOASSERTION",
    "licenseDeclared" : "NOASSERTION",
    "name" : "tar-1.30+dfsg-6",
    "versionInfo" : "1.30+dfsg-6"
  }, {
    "SPDXID" : "SPDXRef-gnrtd104",
    "copyrightText" : "NOASSERTION",
    "downloadLocation" : "NOASSERTION",
    "externalRefs" : [ {
      "referenceCategory" : "PACKAGE-MANAGER",
      "referenceLocator" : "pkg:generic/libx11-data-2%3A1.6.7-1%2Bdeb10u4@2%3A1.6.7-1%2Bdeb10u4",
      "referenceType" : "purl"
    } ],
    "filesAnalyzed" : false,
    "licenseConcluded" : "NOASSERTION",
    "licenseDeclared" : "NOASSERTION",
    "name" : "libx11-data-2:1.6.7-1+deb10u4",
    "versionInfo" : "2:1.6.7-1+deb10u4"
  }, {
    "SPDXID" : "SPDXRef-gnrtd105",
    "copyrightText" : "NOASSERTION",
    "downloadLocation" : "NOASSERTION",
    "externalRefs" : [ {
      "referenceCategory" : "PACKAGE-MANAGER",
      "referenceLocator" : "pkg:generic/diffutils-1%3A3.7-3@1%3A3.7-3",
      "referenceType" : "purl"
    } ],
    "filesAnalyzed" : false,
    "homepage" : "http://www.gnu.org/software/diffutils/",
    "licenseConcluded" : "NOASSERTION",
    "licenseDeclared" : "NOASSERTION",
    "name" : "diffutils-1:3.7-3",
    "versionInfo" : "1:3.7-3"
  }, {
    "SPDXID" : "SPDXRef-gnrtd106",
    "copyrightText" : "NOASSERTION",
    "downloadLocation" : "NOASSERTION",
    "externalRefs" : [ {
      "referenceCategory" : "PACKAGE-MANAGER",
      "referenceLocator" : "pkg:generic/libuuid1-2.33.1-0.1@2.33.1-0.1",
      "referenceType" : "purl"
    } ],
    "filesAnalyzed" : false,
    "licenseConcluded" : "NOASSERTION",
    "licenseDeclared" : "NOASSERTION",
    "name" : "libuuid1-2.33.1-0.1",
    "versionInfo" : "2.33.1-0.1"
  }, {
    "SPDXID" : "SPDXRef-gnrtd107",
    "copyrightText" : "NOASSERTION",
    "downloadLocation" : "NOASSERTION",
    "externalRefs" : [ {
      "referenceCategory" : "PACKAGE-MANAGER",
      "referenceLocator" : "pkg:generic/libjbig0-2.1-3.1%2Bb2@2.1-3.1%2Bb2",
      "referenceType" : "purl"
    } ],
    "filesAnalyzed" : false,
    "homepage" : "http://www.cl.cam.ac.uk/~mgk25/jbigkit/",
    "licenseConcluded" : "NOASSERTION",
    "licenseDeclared" : "NOASSERTION",
    "name" : "libjbig0-2.1-3.1+b2",
    "versionInfo" : "2.1-3.1+b2"
  }, {
    "SPDXID" : "SPDXRef-gnrtd108",
    "copyrightText" : "NOASSERTION",
    "downloadLocation" : "NOASSERTION",
    "externalRefs" : [ {
      "referenceCategory" : "PACKAGE-MANAGER",
      "referenceLocator" : "pkg:generic/login-1%3A4.5-1.1@1%3A4.5-1.1",
      "referenceType" : "purl"
    } ],
    "filesAnalyzed" : false,
    "homepage" : "https://github.com/shadow-maint/shadow",
    "licenseConcluded" : "NOASSERTION",
    "licenseDeclared" : "NOASSERTION",
    "name" : "login-1:4.5-1.1",
    "versionInfo" : "1:4.5-1.1"
  }, {
    "SPDXID" : "SPDXRef-gnrtd109",
    "copyrightText" : "NOASSERTION",
    "downloadLocation" : "NOASSERTION",
    "externalRefs" : [ {
      "referenceCategory" : "PACKAGE-MANAGER",
      "referenceLocator" : "pkg:generic/gpgv-2.2.12-1%2Bdeb10u2@2.2.12-1%2Bdeb10u2",
      "referenceType" : "purl"
    } ],
    "filesAnalyzed" : false,
    "homepage" : "https://www.gnupg.org/",
    "licenseConcluded" : "NOASSERTION",
    "licenseDeclared" : "NOASSERTION",
    "name" : "gpgv-2.2.12-1+deb10u2",
    "versionInfo" : "2.2.12-1+deb10u2"
  }, {
    "SPDXID" : "SPDXRef-gnrtd110",
    "copyrightText" : "NOASSERTION",
    "downloadLocation" : "NOASSERTION",
    "externalRefs" : [ {
      "referenceCategory" : "PACKAGE-MANAGER",
      "referenceLocator" : "pkg:generic/ucf-3.0038%2Bnmu1@3.0038%2Bnmu1",
      "referenceType" : "purl"
    } ],
    "filesAnalyzed" : false,
    "licenseConcluded" : "NOASSERTION",
    "licenseDeclared" : "NOASSERTION",
    "name" : "ucf-3.0038+nmu1",
    "versionInfo" : "3.0038+nmu1"
  }, {
    "SPDXID" : "SPDXRef-gnrtd111",
    "copyrightText" : "NOASSERTION",
    "downloadLocation" : "NOASSERTION",
    "externalRefs" : [ {
      "referenceCategory" : "PACKAGE-MANAGER",
      "referenceLocator" : "pkg:generic/libsepol1-2.8-1@2.8-1",
      "referenceType" : "purl"
    } ],
    "filesAnalyzed" : false,
    "homepage" : "http://userspace.selinuxproject.org/",
    "licenseConcluded" : "NOASSERTION",
    "licenseDeclared" : "NOASSERTION",
    "name" : "libsepol1-2.8-1",
    "versionInfo" : "2.8-1"
  }, {
    "SPDXID" : "SPDXRef-gnrtd112",
    "copyrightText" : "NOASSERTION",
    "downloadLocation" : "NOASSERTION",
    "externalRefs" : [ {
      "referenceCategory" : "PACKAGE-MANAGER",
      "referenceLocator" : "pkg:generic/libc6-2.28-10%2Bdeb10u2@2.28-10%2Bdeb10u2",
      "referenceType" : "purl"
    } ],
    "filesAnalyzed" : false,
    "homepage" : "https://www.gnu.org/software/libc/libc.html",
    "licenseConcluded" : "NOASSERTION",
    "licenseDeclared" : "NOASSERTION",
    "name" : "libc6-2.28-10+deb10u2",
    "versionInfo" : "2.28-10+deb10u2"
  }, {
    "SPDXID" : "SPDXRef-gnrtd113",
    "copyrightText" : "NOASSERTION",
    "downloadLocation" : "NOASSERTION",
    "externalRefs" : [ {
      "referenceCategory" : "PACKAGE-MANAGER",
      "referenceLocator" : "pkg:generic/gzip-1.9-3%2Bdeb10u1@1.9-3%2Bdeb10u1",
      "referenceType" : "purl"
    } ],
    "filesAnalyzed" : false,
    "homepage" : "https://www.gnu.org/software/gzip/",
    "licenseConcluded" : "NOASSERTION",
    "licenseDeclared" : "NOASSERTION",
    "name" : "gzip-1.9-3+deb10u1",
    "versionInfo" : "1.9-3+deb10u1"
  }, {
    "SPDXID" : "SPDXRef-gnrtd114",
    "copyrightText" : "NOASSERTION",
    "downloadLocation" : "NOASSERTION",
    "externalRefs" : [ {
      "referenceCategory" : "PACKAGE-MANAGER",
      "referenceLocator" : "pkg:generic/libpam0g-1.3.1-5A~5.0.0.202203012129@1.3.1-5A~5.0.0.202203012129",
      "referenceType" : "purl"
    } ],
    "filesAnalyzed" : false,
    "homepage" : "http://www.linux-pam.org/",
    "licenseConcluded" : "NOASSERTION",
    "licenseDeclared" : "NOASSERTION",
    "name" : "libpam0g-1.3.1-5A~5.0.0.202203012129",
    "versionInfo" : "1.3.1-5A~5.0.0.202203012129"
  }, {
    "SPDXID" : "SPDXRef-gnrtd115",
    "copyrightText" : "NOASSERTION",
    "downloadLocation" : "NOASSERTION",
    "externalRefs" : [ {
      "referenceCategory" : "PACKAGE-MANAGER",
      "referenceLocator" : "pkg:generic/libgcrypt20-1.8.4-5%2Bdeb10u1@1.8.4-5%2Bdeb10u1",
      "referenceType" : "purl"
    } ],
    "filesAnalyzed" : false,
    "homepage" : "https://directory.fsf.org/project/libgcrypt/",
    "licenseConcluded" : "NOASSERTION",
    "licenseDeclared" : "NOASSERTION",
    "name" : "libgcrypt20-1.8.4-5+deb10u1",
    "versionInfo" : "1.8.4-5+deb10u1"
  }, {
    "SPDXID" : "SPDXRef-gnrtd116",
    "copyrightText" : "NOASSERTION",
    "downloadLocation" : "NOASSERTION",
    "externalRefs" : [ {
      "referenceCategory" : "PACKAGE-MANAGER",
      "referenceLocator" : "pkg:generic/libxslt1.1-1.1.32-2.2~deb10u2@1.1.32-2.2~deb10u2",
      "referenceType" : "purl"
    } ],
    "filesAnalyzed" : false,
    "homepage" : "http://xmlsoft.org/xslt/",
    "licenseConcluded" : "NOASSERTION",
    "licenseDeclared" : "NOASSERTION",
    "name" : "libxslt1.1-1.1.32-2.2~deb10u2",
    "versionInfo" : "1.1.32-2.2~deb10u2"
  }, {
    "SPDXID" : "SPDXRef-gnrtd117",
    "copyrightText" : "NOASSERTION",
    "downloadLocation" : "NOASSERTION",
    "externalRefs" : [ {
      "referenceCategory" : "PACKAGE-MANAGER",
      "referenceLocator" : "pkg:generic/libx11-6-2%3A1.6.7-1%2Bdeb10u4@2%3A1.6.7-1%2Bdeb10u4",
      "referenceType" : "purl"
    } ],
    "filesAnalyzed" : false,
    "licenseConcluded" : "NOASSERTION",
    "licenseDeclared" : "NOASSERTION",
    "name" : "libx11-6-2:1.6.7-1+deb10u4",
    "versionInfo" : "2:1.6.7-1+deb10u4"
  }, {
    "SPDXID" : "SPDXRef-gnrtd118",
    "copyrightText" : "NOASSERTION",
    "downloadLocation" : "NOASSERTION",
    "externalRefs" : [ {
      "referenceCategory" : "PACKAGE-MANAGER",
      "referenceLocator" : "pkg:generic/libxpm4-1%3A3.5.12-1%2Bdeb10u2@1%3A3.5.12-1%2Bdeb10u2",
      "referenceType" : "purl"
    } ],
    "filesAnalyzed" : false,
    "homepage" : "https://www.x.org",
    "licenseConcluded" : "NOASSERTION",
    "licenseDeclared" : "NOASSERTION",
    "name" : "libxpm4-1:3.5.12-1+deb10u2",
    "versionInfo" : "1:3.5.12-1+deb10u2"
  }, {
    "SPDXID" : "SPDXRef-gnrtd119",
    "copyrightText" : "NOASSERTION",
    "downloadLocation" : "NOASSERTION",
    "externalRefs" : [ {
      "referenceCategory" : "PACKAGE-MANAGER",
      "referenceLocator" : "pkg:generic/libnginx-mod-http-echo-1.14.2-2%2Bdeb10u5@1.14.2-2%2Bdeb10u5",
      "referenceType" : "purl"
    } ],
    "filesAnalyzed" : false,
    "homepage" : "https://nginx.net",
    "licenseConcluded" : "NOASSERTION",
    "licenseDeclared" : "NOASSERTION",
    "name" : "libnginx-mod-http-echo-1.14.2-2+deb10u5",
    "versionInfo" : "1.14.2-2+deb10u5"
  }, {
    "SPDXID" : "SPDXRef-gnrtd120",
    "copyrightText" : "NOASSERTION",
    "downloadLocation" : "NOASSERTION",
    "externalRefs" : [ {
      "referenceCategory" : "PACKAGE-MANAGER",
      "referenceLocator" : "pkg:generic/libpam-modules-1.3.1-5A~5.0.0.202203012129@1.3.1-5A~5.0.0.202203012129",
      "referenceType" : "purl"
    } ],
    "filesAnalyzed" : false,
    "homepage" : "http://www.linux-pam.org/",
    "licenseConcluded" : "NOASSERTION",
    "licenseDeclared" : "NOASSERTION",
    "name" : "libpam-modules-1.3.1-5A~5.0.0.202203012129",
    "versionInfo" : "1.3.1-5A~5.0.0.202203012129"
  }, {
    "SPDXID" : "SPDXRef-gnrtd121",
    "copyrightText" : "NOASSERTION",
    "downloadLocation" : "NOASSERTION",
    "externalRefs" : [ {
      "referenceCategory" : "PACKAGE-MANAGER",
      "referenceLocator" : "pkg:generic/liblz4-1-1.8.3-1%2Bdeb10u1@1.8.3-1%2Bdeb10u1",
      "referenceType" : "purl"
    } ],
    "filesAnalyzed" : false,
    "homepage" : "https://github.com/Cyan4973/lz4",
    "licenseConcluded" : "NOASSERTION",
    "licenseDeclared" : "NOASSERTION",
    "name" : "liblz4-1-1.8.3-1+deb10u1",
    "versionInfo" : "1.8.3-1+deb10u1"
  }, {
    "SPDXID" : "SPDXRef-gnrtd122",
    "copyrightText" : "NOASSERTION",
    "downloadLocation" : "NOASSERTION",
    "externalRefs" : [ {
      "referenceCategory" : "PACKAGE-MANAGER",
      "referenceLocator" : "pkg:generic/libnginx-mod-stream-1.14.2-2%2Bdeb10u5@1.14.2-2%2Bdeb10u5",
      "referenceType" : "purl"
    } ],
    "filesAnalyzed" : false,
    "homepage" : "https://nginx.net",
    "licenseConcluded" : "NOASSERTION",
    "licenseDeclared" : "NOASSERTION",
    "name" : "libnginx-mod-stream-1.14.2-2+deb10u5",
    "versionInfo" : "1.14.2-2+deb10u5"
  }, {
    "SPDXID" : "SPDXRef-gnrtd123",
    "copyrightText" : "NOASSERTION",
    "downloadLocation" : "NOASSERTION",
    "externalRefs" : [ {
      "referenceCategory" : "PACKAGE-MANAGER",
      "referenceLocator" : "pkg:generic/libnginx-mod-http-xslt-filter-1.14.2-2%2Bdeb10u5@1.14.2-2%2Bdeb10u5",
      "referenceType" : "purl"
    } ],
    "filesAnalyzed" : false,
    "homepage" : "https://nginx.net",
    "licenseConcluded" : "NOASSERTION",
    "licenseDeclared" : "NOASSERTION",
    "name" : "libnginx-mod-http-xslt-filter-1.14.2-2+deb10u5",
    "versionInfo" : "1.14.2-2+deb10u5"
  }, {
    "SPDXID" : "SPDXRef-gnrtd124",
    "copyrightText" : "NOASSERTION",
    "downloadLocation" : "NOASSERTION",
    "externalRefs" : [ {
      "referenceCategory" : "PACKAGE-MANAGER",
      "referenceLocator" : "pkg:generic/libwebp6-0.6.1-2%2Bdeb10u3@0.6.1-2%2Bdeb10u3",
      "referenceType" : "purl"
    } ],
    "filesAnalyzed" : false,
    "homepage" : "https://developers.google.com/speed/webp/",
    "licenseConcluded" : "NOASSERTION",
    "licenseDeclared" : "NOASSERTION",
    "name" : "libwebp6-0.6.1-2+deb10u3",
    "versionInfo" : "0.6.1-2+deb10u3"
  }, {
    "SPDXID" : "SPDXRef-gnrtd125",
    "copyrightText" : "NOASSERTION",
    "downloadLocation" : "NOASSERTION",
    "externalRefs" : [ {
      "referenceCategory" : "PACKAGE-MANAGER",
      "referenceLocator" : "pkg:generic/libxcb1-1.13.1-2@1.13.1-2",
      "referenceType" : "purl"
    } ],
    "filesAnalyzed" : false,
    "homepage" : "https://xcb.freedesktop.org",
    "licenseConcluded" : "NOASSERTION",
    "licenseDeclared" : "NOASSERTION",
    "name" : "libxcb1-1.13.1-2",
    "versionInfo" : "1.13.1-2"
  }, {
    "SPDXID" : "SPDXRef-gnrtd126",
    "copyrightText" : "NOASSERTION",
    "downloadLocation" : "NOASSERTION",
    "externalRefs" : [ {
      "referenceCategory" : "PACKAGE-MANAGER",
      "referenceLocator" : "pkg:generic/base-files-10.3%2Bdeb10u13A~5.0.3.202302012005@10.3%2Bdeb10u13A~5.0.3.202302012005",
      "referenceType" : "purl"
    } ],
    "filesAnalyzed" : false,
    "licenseConcluded" : "NOASSERTION",
    "licenseDeclared" : "NOASSERTION",
    "name" : "base-files-10.3+deb10u13A~5.0.3.202302012005",
    "versionInfo" : "10.3+deb10u13A~5.0.3.202302012005"
  }, {
    "SPDXID" : "SPDXRef-gnrtd127",
    "copyrightText" : "NOASSERTION",
    "downloadLocation" : "NOASSERTION",
    "externalRefs" : [ {
      "referenceCategory" : "PACKAGE-MANAGER",
      "referenceLocator" : "pkg:generic/lsb-base-10.2019051400A~5.0.0.202203012120@10.2019051400A~5.0.0.202203012120",
      "referenceType" : "purl"
    } ],
    "filesAnalyzed" : false,
    "homepage" : "https://wiki.linuxfoundation.org/lsb/start",
    "licenseConcluded" : "NOASSERTION",
    "licenseDeclared" : "NOASSERTION",
    "name" : "lsb-base-10.2019051400A~5.0.0.202203012120",
    "versionInfo" : "10.2019051400A~5.0.0.202203012120"
  } ],
  "relationships" : [ {
    "spdxElementId" : "SPDXRef-DOCUMENT",
    "relationshipType" : "DESCRIBES",
    "relatedSpdxElement" : "SPDXRef-gnrtd0"
  }, {
    "spdxElementId" : "SPDXRef-gnrtd0",
    "relationshipType" : "CONTAINS",
    "relatedSpdxElement" : "SPDXRef-gnrtd27"
  }, {
    "spdxElementId" : "SPDXRef-gnrtd0",
    "relationshipType" : "CONTAINS",
    "relatedSpdxElement" : "SPDXRef-gnrtd79"
  }, {
    "spdxElementId" : "SPDXRef-gnrtd0",
    "relationshipType" : "CONTAINS",
    "relatedSpdxElement" : "SPDXRef-gnrtd80"
  }, {
    "spdxElementId" : "SPDXRef-gnrtd0",
    "relationshipType" : "CONTAINS",
    "relatedSpdxElement" : "SPDXRef-gnrtd78"
  }, {
    "spdxElementId" : "SPDXRef-gnrtd0",
    "relationshipType" : "CONTAINS",
    "relatedSpdxElement" : "SPDXRef-gnrtd94"
  }, {
    "spdxElementId" : "SPDXRef-gnrtd0",
    "relationshipType" : "CONTAINS",
    "relatedSpdxElement" : "SPDXRef-gnrtd95"
  }, {
    "spdxElementId" : "SPDXRef-gnrtd0",
    "relationshipType" : "CONTAINS",
    "relatedSpdxElement" : "SPDXRef-gnrtd76"
  }, {
    "spdxElementId" : "SPDXRef-gnrtd0",
    "relationshipType" : "CONTAINS",
    "relatedSpdxElement" : "SPDXRef-gnrtd77"
  }, {
    "spdxElementId" : "SPDXRef-gnrtd0",
    "relationshipType" : "CONTAINS",
    "relatedSpdxElement" : "SPDXRef-gnrtd93"
  }, {
    "spdxElementId" : "SPDXRef-gnrtd0",
    "relationshipType" : "CONTAINS",
    "relatedSpdxElement" : "SPDXRef-gnrtd25"
  }, {
    "spdxElementId" : "SPDXRef-gnrtd0",
    "relationshipType" : "CONTAINS",
    "relatedSpdxElement" : "SPDXRef-gnrtd26"
  }, {
    "spdxElementId" : "SPDXRef-gnrtd0",
    "relationshipType" : "CONTAINS",
    "relatedSpdxElement" : "SPDXRef-gnrtd23"
  }, {
    "spdxElementId" : "SPDXRef-gnrtd0",
    "relationshipType" : "CONTAINS",
    "relatedSpdxElement" : "SPDXRef-gnrtd96"
  }, {
    "spdxElementId" : "SPDXRef-gnrtd0",
    "relationshipType" : "CONTAINS",
    "relatedSpdxElement" : "SPDXRef-gnrtd24"
  }, {
    "spdxElementId" : "SPDXRef-gnrtd0",
    "relationshipType" : "CONTAINS",
    "relatedSpdxElement" : "SPDXRef-gnrtd97"
  }, {
    "spdxElementId" : "SPDXRef-gnrtd0",
    "relationshipType" : "CONTAINS",
    "relatedSpdxElement" : "SPDXRef-gnrtd22"
  }, {
    "spdxElementId" : "SPDXRef-gnrtd0",
    "relationshipType" : "CONTAINS",
    "relatedSpdxElement" : "SPDXRef-gnrtd74"
  }, {
    "spdxElementId" : "SPDXRef-gnrtd0",
    "relationshipType" : "CONTAINS",
    "relatedSpdxElement" : "SPDXRef-gnrtd75"
  }, {
    "spdxElementId" : "SPDXRef-gnrtd0",
    "relationshipType" : "CONTAINS",
    "relatedSpdxElement" : "SPDXRef-gnrtd73"
  }, {
    "spdxElementId" : "SPDXRef-gnrtd0",
    "relationshipType" : "CONTAINS",
    "relatedSpdxElement" : "SPDXRef-gnrtd89"
  }, {
    "spdxElementId" : "SPDXRef-gnrtd0",
    "relationshipType" : "CONTAINS",
    "relatedSpdxElement" : "SPDXRef-gnrtd72"
  }, {
    "spdxElementId" : "SPDXRef-gnrtd0",
    "relationshipType" : "CONTAINS",
    "relatedSpdxElement" : "SPDXRef-gnrtd90"
  }, {
    "spdxElementId" : "SPDXRef-gnrtd0",
    "relationshipType" : "CONTAINS",
    "relatedSpdxElement" : "SPDXRef-gnrtd70"
  }, {
    "spdxElementId" : "SPDXRef-gnrtd0",
    "relationshipType" : "CONTAINS",
    "relatedSpdxElement" : "SPDXRef-gnrtd88"
  }, {
    "spdxElementId" : "SPDXRef-gnrtd0",
    "relationshipType" : "CONTAINS",
    "relatedSpdxElement" : "SPDXRef-gnrtd71"
  }, {
    "spdxElementId" : "SPDXRef-gnrtd0",
    "relationshipType" : "CONTAINS",
    "relatedSpdxElement" : "SPDXRef-gnrtd20"
  }, {
    "spdxElementId" : "SPDXRef-gnrtd0",
    "relationshipType" : "CONTAINS",
    "relatedSpdxElement" : "SPDXRef-gnrtd21"
  }, {
    "spdxElementId" : "SPDXRef-gnrtd0",
    "relationshipType" : "CONTAINS",
    "relatedSpdxElement" : "SPDXRef-gnrtd18"
  }, {
    "spdxElementId" : "SPDXRef-gnrtd0",
    "relationshipType" : "CONTAINS",
    "relatedSpdxElement" : "SPDXRef-gnrtd91"
  }, {
    "spdxElementId" : "SPDXRef-gnrtd0",
    "relationshipType" : "CONTAINS",
    "relatedSpdxElement" : "SPDXRef-gnrtd19"
  }, {
    "spdxElementId" : "SPDXRef-gnrtd0",
    "relationshipType" : "CONTAINS",
    "relatedSpdxElement" : "SPDXRef-gnrtd92"
  }, {
    "spdxElementId" : "SPDXRef-gnrtd0",
    "relationshipType" : "CONTAINS",
    "relatedSpdxElement" : "SPDXRef-gnrtd2"
  }, {
    "spdxElementId" : "SPDXRef-gnrtd0",
    "relationshipType" : "CONTAINS",
    "relatedSpdxElement" : "SPDXRef-gnrtd68"
  }, {
    "spdxElementId" : "SPDXRef-gnrtd0",
    "relationshipType" : "CONTAINS",
    "relatedSpdxElement" : "SPDXRef-gnrtd69"
  }, {
    "spdxElementId" : "SPDXRef-gnrtd0",
    "relationshipType" : "CONTAINS",
    "relatedSpdxElement" : "SPDXRef-gnrtd67"
  }, {
    "spdxElementId" : "SPDXRef-gnrtd0",
    "relationshipType" : "CONTAINS",
    "relatedSpdxElement" : "SPDXRef-gnrtd127"
  }, {
    "spdxElementId" : "SPDXRef-gnrtd0",
    "relationshipType" : "CONTAINS",
    "relatedSpdxElement" : "SPDXRef-gnrtd33"
  }, {
    "spdxElementId" : "SPDXRef-gnrtd0",
    "relationshipType" : "CONTAINS",
    "relatedSpdxElement" : "SPDXRef-gnrtd65"
  }, {
    "spdxElementId" : "SPDXRef-gnrtd0",
    "relationshipType" : "CONTAINS",
    "relatedSpdxElement" : "SPDXRef-gnrtd125"
  }, {
    "spdxElementId" : "SPDXRef-gnrtd0",
    "relationshipType" : "CONTAINS",
    "relatedSpdxElement" : "SPDXRef-gnrtd66"
  }, {
    "spdxElementId" : "SPDXRef-gnrtd0",
    "relationshipType" : "CONTAINS",
    "relatedSpdxElement" : "SPDXRef-gnrtd126"
  }, {
    "spdxElementId" : "SPDXRef-gnrtd0",
    "relationshipType" : "CONTAINS",
    "relatedSpdxElement" : "SPDXRef-gnrtd36"
  }, {
    "spdxElementId" : "SPDXRef-gnrtd0",
    "relationshipType" : "CONTAINS",
    "relatedSpdxElement" : "SPDXRef-gnrtd1"
  }, {
    "spdxElementId" : "SPDXRef-gnrtd0",
    "relationshipType" : "CONTAINS",
    "relatedSpdxElement" : "SPDXRef-gnrtd37"
  }, {
    "spdxElementId" : "SPDXRef-gnrtd0",
    "relationshipType" : "CONTAINS",
    "relatedSpdxElement" : "SPDXRef-gnrtd34"
  }, {
    "spdxElementId" : "SPDXRef-gnrtd0",
    "relationshipType" : "CONTAINS",
    "relatedSpdxElement" : "SPDXRef-gnrtd35"
  }, {
    "spdxElementId" : "SPDXRef-gnrtd0",
    "relationshipType" : "CONTAINS",
    "relatedSpdxElement" : "SPDXRef-gnrtd63"
  }, {
    "spdxElementId" : "SPDXRef-gnrtd0",
    "relationshipType" : "CONTAINS",
    "relatedSpdxElement" : "SPDXRef-gnrtd123"
  }, {
    "spdxElementId" : "SPDXRef-gnrtd0",
    "relationshipType" : "CONTAINS",
    "relatedSpdxElement" : "SPDXRef-gnrtd64"
  }, {
    "spdxElementId" : "SPDXRef-gnrtd0",
    "relationshipType" : "CONTAINS",
    "relatedSpdxElement" : "SPDXRef-gnrtd124"
  }, {
    "spdxElementId" : "SPDXRef-gnrtd0",
    "relationshipType" : "CONTAINS",
    "relatedSpdxElement" : "SPDXRef-gnrtd122"
  }, {
    "spdxElementId" : "SPDXRef-gnrtd0",
    "relationshipType" : "CONTAINS",
    "relatedSpdxElement" : "SPDXRef-gnrtd61"
  }, {
    "spdxElementId" : "SPDXRef-gnrtd0",
    "relationshipType" : "CONTAINS",
    "relatedSpdxElement" : "SPDXRef-gnrtd28"
  }, {
    "spdxElementId" : "SPDXRef-gnrtd0",
    "relationshipType" : "CONTAINS",
    "relatedSpdxElement" : "SPDXRef-gnrtd62"
  }, {
    "spdxElementId" : "SPDXRef-gnrtd0",
    "relationshipType" : "CONTAINS",
    "relatedSpdxElement" : "SPDXRef-gnrtd120"
  }, {
    "spdxElementId" : "SPDXRef-gnrtd0",
    "relationshipType" : "CONTAINS",
    "relatedSpdxElement" : "SPDXRef-gnrtd59"
  }, {
    "spdxElementId" : "SPDXRef-gnrtd0",
    "relationshipType" : "CONTAINS",
    "relatedSpdxElement" : "SPDXRef-gnrtd121"
  }, {
    "spdxElementId" : "SPDXRef-gnrtd0",
    "relationshipType" : "CONTAINS",
    "relatedSpdxElement" : "SPDXRef-gnrtd60"
  }, {
    "spdxElementId" : "SPDXRef-gnrtd0",
    "relationshipType" : "CONTAINS",
    "relatedSpdxElement" : "SPDXRef-gnrtd31"
  }, {
    "spdxElementId" : "SPDXRef-gnrtd0",
    "relationshipType" : "CONTAINS",
    "relatedSpdxElement" : "SPDXRef-gnrtd32"
  }, {
    "spdxElementId" : "SPDXRef-gnrtd0",
    "relationshipType" : "CONTAINS",
    "relatedSpdxElement" : "SPDXRef-gnrtd29"
  }, {
    "spdxElementId" : "SPDXRef-gnrtd0",
    "relationshipType" : "CONTAINS",
    "relatedSpdxElement" : "SPDXRef-gnrtd30"
  }, {
    "spdxElementId" : "SPDXRef-gnrtd0",
    "relationshipType" : "CONTAINS",
    "relatedSpdxElement" : "SPDXRef-gnrtd7"
  }, {
    "spdxElementId" : "SPDXRef-gnrtd0",
    "relationshipType" : "CONTAINS",
    "relatedSpdxElement" : "SPDXRef-gnrtd5"
  }, {
    "spdxElementId" : "SPDXRef-gnrtd0",
    "relationshipType" : "CONTAINS",
    "relatedSpdxElement" : "SPDXRef-gnrtd6"
  }, {
    "spdxElementId" : "SPDXRef-gnrtd0",
    "relationshipType" : "CONTAINS",
    "relatedSpdxElement" : "SPDXRef-gnrtd118"
  }, {
    "spdxElementId" : "SPDXRef-gnrtd0",
    "relationshipType" : "CONTAINS",
    "relatedSpdxElement" : "SPDXRef-gnrtd119"
  }, {
    "spdxElementId" : "SPDXRef-gnrtd0",
    "relationshipType" : "CONTAINS",
    "relatedSpdxElement" : "SPDXRef-gnrtd58"
  }, {
    "spdxElementId" : "SPDXRef-gnrtd0",
    "relationshipType" : "CONTAINS",
    "relatedSpdxElement" : "SPDXRef-gnrtd56"
  }, {
    "spdxElementId" : "SPDXRef-gnrtd0",
    "relationshipType" : "CONTAINS",
    "relatedSpdxElement" : "SPDXRef-gnrtd116"
  }, {
    "spdxElementId" : "SPDXRef-gnrtd0",
    "relationshipType" : "CONTAINS",
    "relatedSpdxElement" : "SPDXRef-gnrtd57"
  }, {
    "spdxElementId" : "SPDXRef-gnrtd0",
    "relationshipType" : "CONTAINS",
    "relatedSpdxElement" : "SPDXRef-gnrtd117"
  }, {
    "spdxElementId" : "SPDXRef-gnrtd0",
    "relationshipType" : "CONTAINS",
    "relatedSpdxElement" : "SPDXRef-gnrtd54"
  }, {
    "spdxElementId" : "SPDXRef-gnrtd0",
    "relationshipType" : "CONTAINS",
    "relatedSpdxElement" : "SPDXRef-gnrtd114"
  }, {
    "spdxElementId" : "SPDXRef-gnrtd0",
    "relationshipType" : "CONTAINS",
    "relatedSpdxElement" : "SPDXRef-gnrtd55"
  }, {
    "spdxElementId" : "SPDXRef-gnrtd0",
    "relationshipType" : "CONTAINS",
    "relatedSpdxElement" : "SPDXRef-gnrtd115"
  }, {
    "spdxElementId" : "SPDXRef-gnrtd0",
    "relationshipType" : "CONTAINS",
    "relatedSpdxElement" : "SPDXRef-gnrtd4"
  }, {
    "spdxElementId" : "SPDXRef-gnrtd0",
    "relationshipType" : "CONTAINS",
    "relatedSpdxElement" : "SPDXRef-gnrtd53"
  }, {
    "spdxElementId" : "SPDXRef-gnrtd0",
    "relationshipType" : "CONTAINS",
    "relatedSpdxElement" : "SPDXRef-gnrtd113"
  }, {
    "spdxElementId" : "SPDXRef-gnrtd0",
    "relationshipType" : "CONTAINS",
    "relatedSpdxElement" : "SPDXRef-gnrtd111"
  }, {
    "spdxElementId" : "SPDXRef-gnrtd0",
    "relationshipType" : "CONTAINS",
    "relatedSpdxElement" : "SPDXRef-gnrtd50"
  }, {
    "spdxElementId" : "SPDXRef-gnrtd0",
    "relationshipType" : "CONTAINS",
    "relatedSpdxElement" : "SPDXRef-gnrtd112"
  }, {
    "spdxElementId" : "SPDXRef-gnrtd0",
    "relationshipType" : "CONTAINS",
    "relatedSpdxElement" : "SPDXRef-gnrtd51"
  }, {
    "spdxElementId" : "SPDXRef-gnrtd0",
    "relationshipType" : "CONTAINS",
    "relatedSpdxElement" : "SPDXRef-gnrtd109"
  }, {
    "spdxElementId" : "SPDXRef-gnrtd0",
    "relationshipType" : "CONTAINS",
    "relatedSpdxElement" : "SPDXRef-gnrtd48"
  }, {
    "spdxElementId" : "SPDXRef-gnrtd0",
    "relationshipType" : "CONTAINS",
    "relatedSpdxElement" : "SPDXRef-gnrtd110"
  }, {
    "spdxElementId" : "SPDXRef-gnrtd0",
    "relationshipType" : "CONTAINS",
    "relatedSpdxElement" : "SPDXRef-gnrtd49"
  }, {
    "spdxElementId" : "SPDXRef-gnrtd0",
    "relationshipType" : "CONTAINS",
    "relatedSpdxElement" : "SPDXRef-gnrtd3"
  }, {
    "spdxElementId" : "SPDXRef-gnrtd0",
    "relationshipType" : "CONTAINS",
    "relatedSpdxElement" : "SPDXRef-gnrtd52"
  }, {
    "spdxElementId" : "SPDXRef-gnrtd0",
    "relationshipType" : "CONTAINS",
    "relatedSpdxElement" : "SPDXRef-gnrtd16"
  }, {
    "spdxElementId" : "SPDXRef-gnrtd0",
    "relationshipType" : "CONTAINS",
    "relatedSpdxElement" : "SPDXRef-gnrtd17"
  }, {
    "spdxElementId" : "SPDXRef-gnrtd0",
    "relationshipType" : "CONTAINS",
    "relatedSpdxElement" : "SPDXRef-gnrtd108"
  }, {
    "spdxElementId" : "SPDXRef-gnrtd0",
    "relationshipType" : "CONTAINS",
    "relatedSpdxElement" : "SPDXRef-gnrtd45"
  }, {
    "spdxElementId" : "SPDXRef-gnrtd0",
    "relationshipType" : "CONTAINS",
    "relatedSpdxElement" : "SPDXRef-gnrtd105"
  }, {
    "spdxElementId" : "SPDXRef-gnrtd0",
    "relationshipType" : "CONTAINS",
    "relatedSpdxElement" : "SPDXRef-gnrtd46"
  }, {
    "spdxElementId" : "SPDXRef-gnrtd0",
    "relationshipType" : "CONTAINS",
    "relatedSpdxElement" : "SPDXRef-gnrtd106"
  }, {
    "spdxElementId" : "SPDXRef-gnrtd0",
    "relationshipType" : "CONTAINS",
    "relatedSpdxElement" : "SPDXRef-gnrtd43"
  }, {
    "spdxElementId" : "SPDXRef-gnrtd0",
    "relationshipType" : "CONTAINS",
    "relatedSpdxElement" : "SPDXRef-gnrtd87"
  }, {
    "spdxElementId" : "SPDXRef-gnrtd0",
    "relationshipType" : "CONTAINS",
    "relatedSpdxElement" : "SPDXRef-gnrtd103"
  }, {
    "spdxElementId" : "SPDXRef-gnrtd0",
    "relationshipType" : "CONTAINS",
    "relatedSpdxElement" : "SPDXRef-gnrtd44"
  }, {
    "spdxElementId" : "SPDXRef-gnrtd0",
    "relationshipType" : "CONTAINS",
    "relatedSpdxElement" : "SPDXRef-gnrtd104"
  }, {
    "spdxElementId" : "SPDXRef-gnrtd0",
    "relationshipType" : "CONTAINS",
    "relatedSpdxElement" : "SPDXRef-gnrtd14"
  }, {
    "spdxElementId" : "SPDXRef-gnrtd0",
    "relationshipType" : "CONTAINS",
    "relatedSpdxElement" : "SPDXRef-gnrtd15"
  }, {
    "spdxElementId" : "SPDXRef-gnrtd0",
    "relationshipType" : "CONTAINS",
    "relatedSpdxElement" : "SPDXRef-gnrtd47"
  }, {
    "spdxElementId" : "SPDXRef-gnrtd0",
    "relationshipType" : "CONTAINS",
    "relatedSpdxElement" : "SPDXRef-gnrtd107"
  }, {
    "spdxElementId" : "SPDXRef-gnrtd0",
    "relationshipType" : "CONTAINS",
    "relatedSpdxElement" : "SPDXRef-gnrtd13"
  }, {
    "spdxElementId" : "SPDXRef-gnrtd0",
    "relationshipType" : "CONTAINS",
    "relatedSpdxElement" : "SPDXRef-gnrtd11"
  }, {
    "spdxElementId" : "SPDXRef-gnrtd0",
    "relationshipType" : "CONTAINS",
    "relatedSpdxElement" : "SPDXRef-gnrtd12"
  }, {
    "spdxElementId" : "SPDXRef-gnrtd0",
    "relationshipType" : "CONTAINS",
    "relatedSpdxElement" : "SPDXRef-gnrtd85"
  }, {
    "spdxElementId" : "SPDXRef-gnrtd0",
    "relationshipType" : "CONTAINS",
    "relatedSpdxElement" : "SPDXRef-gnrtd86"
  }, {
    "spdxElementId" : "SPDXRef-gnrtd0",
    "relationshipType" : "CONTAINS",
    "relatedSpdxElement" : "SPDXRef-gnrtd83"
  }, {
    "spdxElementId" : "SPDXRef-gnrtd0",
    "relationshipType" : "CONTAINS",
    "relatedSpdxElement" : "SPDXRef-gnrtd84"
  }, {
    "spdxElementId" : "SPDXRef-gnrtd0",
    "relationshipType" : "CONTAINS",
    "relatedSpdxElement" : "SPDXRef-gnrtd100"
  }, {
    "spdxElementId" : "SPDXRef-gnrtd0",
    "relationshipType" : "CONTAINS",
    "relatedSpdxElement" : "SPDXRef-gnrtd39"
  }, {
    "spdxElementId" : "SPDXRef-gnrtd0",
    "relationshipType" : "CONTAINS",
    "relatedSpdxElement" : "SPDXRef-gnrtd101"
  }, {
    "spdxElementId" : "SPDXRef-gnrtd0",
    "relationshipType" : "CONTAINS",
    "relatedSpdxElement" : "SPDXRef-gnrtd40"
  }, {
    "spdxElementId" : "SPDXRef-gnrtd0",
    "relationshipType" : "CONTAINS",
    "relatedSpdxElement" : "SPDXRef-gnrtd98"
  }, {
    "spdxElementId" : "SPDXRef-gnrtd0",
    "relationshipType" : "CONTAINS",
    "relatedSpdxElement" : "SPDXRef-gnrtd81"
  }, {
    "spdxElementId" : "SPDXRef-gnrtd0",
    "relationshipType" : "CONTAINS",
    "relatedSpdxElement" : "SPDXRef-gnrtd99"
  }, {
    "spdxElementId" : "SPDXRef-gnrtd0",
    "relationshipType" : "CONTAINS",
    "relatedSpdxElement" : "SPDXRef-gnrtd38"
  }, {
    "spdxElementId" : "SPDXRef-gnrtd0",
    "relationshipType" : "CONTAINS",
    "relatedSpdxElement" : "SPDXRef-gnrtd82"
  }, {
    "spdxElementId" : "SPDXRef-gnrtd0",
    "relationshipType" : "CONTAINS",
    "relatedSpdxElement" : "SPDXRef-gnrtd9"
  }, {
    "spdxElementId" : "SPDXRef-gnrtd0",
    "relationshipType" : "CONTAINS",
    "relatedSpdxElement" : "SPDXRef-gnrtd10"
  }, {
    "spdxElementId" : "SPDXRef-gnrtd0",
    "relationshipType" : "CONTAINS",
    "relatedSpdxElement" : "SPDXRef-gnrtd102"
  }, {
    "spdxElementId" : "SPDXRef-gnrtd0",
    "relationshipType" : "CONTAINS",
    "relatedSpdxElement" : "SPDXRef-gnrtd41"
  }, {
    "spdxElementId" : "SPDXRef-gnrtd0",
    "relationshipType" : "CONTAINS",
    "relatedSpdxElement" : "SPDXRef-gnrtd8"
  }, {
    "spdxElementId" : "SPDXRef-gnrtd0",
    "relationshipType" : "CONTAINS",
    "relatedSpdxElement" : "SPDXRef-gnrtd42"
  } ]
}
