<?xml version="1.0" encoding="utf-8"?>
<!-- Generator: Adobe Illustrator 25.2.1, SVG Export Plug-In . SVG Version: 6.00 Build 0)  -->
<svg version="1.2" baseProfile="tiny" id="Layer_1" xmlns="http://www.w3.org/2000/svg" xmlns:xlink="http://www.w3.org/1999/xlink"
	 x="0px" y="0px" viewBox="0 0 16 16" overflow="visible" xml:space="preserve">
<path d="M8,1c1.1,0,2,0.9,2,2v4H6V3C6,1.9,6.9,1,8,1z M11,7V3c0-1.7-1.3-3-3-3S5,1.3,5,3v4C3.9,7,3,7.9,3,9v5c0,1.1,0.9,2,2,2h6
	c1.1,0,2-0.9,2-2V9C13,7.9,12.1,7,11,7z M5,8h6c0.6,0,1,0.4,1,1v5c0,0.6-0.4,1-1,1H5c-0.6,0-1-0.4-1-1V9C4,8.4,4.4,8,5,8z"/>
<circle cx="8" cy="10.3" r="1"/>
<rect x="7.5" y="10.9" width="1" height="2.8"/>
</svg>
