<svg xmlns="http://www.w3.org/2000/svg" width="136" height="103.999" viewBox="0 0 136 103.999">
  <g id="Gruppe_18401" data-name="Gruppe 18401" transform="translate(-1089 -412)">
    <path id="Differenzmenge_22" data-name="Differenzmenge 22" d="M15907.22,19679h-7.582l.333-2h7.2a1.689,1.689,0,0,0,1.824-1.5v-18.871l2,2v16.869a3.628,3.628,0,0,1-3.374,3.477l-.082-.219-.323.242Zm-12.652,0h-75.739a3.68,3.68,0,0,1-3.826-3.5v-39.816c.677-.109,1.349-.246,2-.406v40.223a1.692,1.692,0,0,0,1.829,1.5h76.071l-.332,2v0h0Zm16.433-27.436,0,0-2-2v-30.91a1.69,1.69,0,0,0-1.824-1.508h-55.828a5.98,5.98,0,0,1-4.055-1.549l-6.654-6.1a2.047,2.047,0,0,0-1.359-.5h-3.357c-.052-.656-.132-1.328-.239-2h3.6a4.056,4.056,0,0,1,2.709,1.023l6.654,6.1a4.007,4.007,0,0,0,2.71,1.023h55.823a3.687,3.687,0,0,1,3.826,3.506v32.912Zm-96-20.963v-20.1a3.682,3.682,0,0,1,3.826-3.506h11.772c.134.664.235,1.338.3,2h-12.074a1.692,1.692,0,0,0-1.829,1.5v19.582a19.828,19.828,0,0,1-2,.516Z" transform="translate(-14702 -19179)"/>
    <path id="Pfad_17696" data-name="Pfad 17696" d="M148.528,99.357a.824.824,0,0,1-.758.5h-9.222l5.538,15.328a.824.824,0,0,1-.494,1.055l-7.516,2.736a.882.882,0,0,1-.288.049.824.824,0,0,1-.775-.536l-5.859-15.707-7.335,5.48a.855.855,0,0,1-1.31-.824L125.5,77.461a.822.822,0,0,1,1.434-.47l21.427,21.427A.824.824,0,0,1,148.528,99.357Z" transform="translate(1076.393 396.971)" fill="#520b83"/>
    <rect id="Rechteck_7164" data-name="Rechteck 7164" width="32" height="3" rx="1.5" transform="translate(1129 460)" fill="#169d64"/>
    <g id="Gruppe_18400" data-name="Gruppe 18400">
      <path id="Ellipse_465" data-name="Ellipse 465" d="M20,0A20,20,0,1,1,0,20,20,20,0,0,1,20,0Z" transform="translate(1089 412)" fill="#169d64"/>
      <g id="J7nHQU" transform="translate(1344.722 382.459)">
        <g id="Gruppe_11712" data-name="Gruppe 11712" transform="translate(-245.141 42.949)">
          <path id="Pfad_8655" data-name="Pfad 8655" d="M-245.141,49.523c.088-.172.172-.345.264-.515a12.99,12.99,0,0,1,2.912-3.672,9.764,9.764,0,0,1,3.174-1.871,9,9,0,0,1,2.028-.459,9.252,9.252,0,0,1,3.953.408,9.814,9.814,0,0,1,3.637,2.2,13,13,0,0,1,2.806,3.8c.018.037.035.076.06.13-.138.261-.273.535-.425.8a12.923,12.923,0,0,1-2.745,3.381,9.6,9.6,0,0,1-3.98,2.121,9.254,9.254,0,0,1-2.893.257,9.269,9.269,0,0,1-5.179-2.01,12.535,12.535,0,0,1-2.808-3.112,11.591,11.591,0,0,1-.787-1.408.169.169,0,0,0-.017-.025Zm5.178.013a4.237,4.237,0,0,0,4.232,4.24,4.237,4.237,0,0,0,4.241-4.23,4.237,4.237,0,0,0-4.235-4.243A4.237,4.237,0,0,0-239.963,49.536Z" transform="translate(245.141 -42.949)" fill="#fff"/>
          <path id="Pfad_8656" data-name="Pfad 8656" d="M209.2,315.082a2.353,2.353,0,1,1-2.357-2.352A2.355,2.355,0,0,1,209.2,315.082Z" transform="translate(-197.432 -308.493)" fill="#fff"/>
        </g>
      </g>
    </g>
  </g>
</svg>
