<svg xmlns="http://www.w3.org/2000/svg" xmlns:xlink="http://www.w3.org/1999/xlink" width="116.031" height="124.496" viewBox="0 0 116.031 124.496">
  <defs>
    <clipPath id="clip-path">
      <rect id="Rechteck_7267" data-name="Rechteck 7267" width="25.576" height="22.604" fill="none"/>
    </clipPath>
  </defs>
  <g id="Gruppe_18398" data-name="Gruppe 18398" transform="translate(-1103.984 -396)">
    <path id="Differenzmenge_21" data-name="Differenzmenge 21" d="M17980.16,19715h-78.285a.842.842,0,0,1-.607-.252.833.833,0,0,1-.248-.6v-78.463c.686.109,1.357.191,2,.24V19713h76v-18.709l2-1.053v20.908A.861.861,0,0,1,17980.16,19715Zm-1.145-31.434v-15.549l2-3.457v15.5l-2,3.5Zm0-31.4V19630.2h-14.377a2.006,2.006,0,0,1-2-2V19613h-32.717c.053-.662.08-1.334.08-2h34.641l16.377,17.2v20.525l-2,3.436Zm-14.377-38.264v14.3h13.615l-13.615-14.3Zm-61.621,17h0a19.265,19.265,0,0,1-2-.3v-18.762a.848.848,0,0,1,.846-.836H17925c0,.66-.035,1.332-.1,2h-21.885v17.9Z" transform="translate(-16781.016 -19195)" stroke="rgba(0,0,0,0)" stroke-width="1"/>
    <g id="Gruppe_18021" data-name="Gruppe 18021" transform="translate(520.004)">
      <rect id="Rechteck_7252" data-name="Rechteck 7252" width="32" height="16" transform="translate(616.008 440)" fill="#fff"/>
      <path id="Rechteck_7252_-_Kontur" data-name="Rechteck 7252 - Kontur" d="M0-1H32a1,1,0,0,1,1,1V16a1,1,0,0,1-1,1H0a1,1,0,0,1-1-1V0A1,1,0,0,1,0-1ZM31,1H1V15H31Z" transform="translate(616.008 440)" fill="#169d64"/>
      <path id="Linie_4882" data-name="Linie 4882" d="M42,1H0A1,1,0,0,1-1,0,1,1,0,0,1,0-1H42a1,1,0,0,1,1,1A1,1,0,0,1,42,1Z" transform="translate(616.004 472)" fill="#169d64"/>
      <path id="Linie_4883" data-name="Linie 4883" d="M42,1H0A1,1,0,0,1-1,0,1,1,0,0,1,0-1H42a1,1,0,0,1,1,1A1,1,0,0,1,42,1Z" transform="translate(616.004 482)" fill="#169d64"/>
      <path id="Linie_4884" data-name="Linie 4884" d="M32,1H0A1,1,0,0,1-1,0,1,1,0,0,1,0-1H32a1,1,0,0,1,1,1A1,1,0,0,1,32,1Z" transform="translate(616.004 492)" fill="#169d64"/>
    </g>
    <g id="Gruppe_18397" data-name="Gruppe 18397">
      <path id="Ellipse_1394" data-name="Ellipse 1394" d="M14-6A20,20,0,1,1-6,14,20.023,20.023,0,0,1,14-6Z" transform="translate(1109.984 402)" fill="#169d64"/>
      <g id="Gruppe_18090" data-name="Gruppe 18090" transform="translate(1112.602 404.699)">
        <g id="Gruppe_18089" data-name="Gruppe 18089" transform="translate(0 0)" clip-path="url(#clip-path)">
          <path id="Pfad_17873" data-name="Pfad 17873" d="M16.815,9.936h2.2a.3.3,0,0,0,.289-.351,8.2,8.2,0,1,0-2.773,8.033.285.285,0,0,1,.4.028l1.676,1.893a.3.3,0,0,1-.029.421A11.311,11.311,0,1,1,22.482,9.69a.285.285,0,0,0,.281.247h2.522a.29.29,0,0,1,.218.48l-4.236,4.837a.289.289,0,0,1-.435,0L16.6,10.417a.289.289,0,0,1,.217-.48" transform="translate(0 0)" fill="#fff"/>
        </g>
      </g>
    </g>
    <path id="Pfad_17919" data-name="Pfad 17919" d="M15.186,42.311,8.768,52.493a1.145,1.145,0,0,1-1.937,0L.412,42.311A2.676,2.676,0,0,1,0,40.883l.105-37.2S-.645,0,7.795,0s7.8,3.683,7.8,3.683v37.2a2.677,2.677,0,0,1-.412,1.427" transform="translate(1206.498 449.924) rotate(30)" fill="#520b83"/>
    <path id="Pfad_17920" data-name="Pfad 17920" d="M4.875,4.988a4.682,4.682,0,0,0-2.365.669C1.667,4.359.83,3.089.023,1.8a.524.524,0,0,1,.132-.5A6.768,6.768,0,0,1,1.6.54,10.638,10.638,0,0,1,4.87,0h.061A10.637,10.637,0,0,1,8.2.54a6.772,6.772,0,0,1,1.45.762.524.524,0,0,1,.132.5c-.807,1.29-1.644,2.561-2.488,3.858a4.682,4.682,0,0,0-2.365-.669Z" transform="translate(1188.621 486.686) rotate(30)" fill="#fff"/>
  </g>
</svg>
