<svg xmlns="http://www.w3.org/2000/svg" width="116.555" height="113.314" viewBox="0 0 116.555 113.314">
  <g id="Gruppe_18458" data-name="Gruppe 18458" transform="translate(-1097.723 -400)">
    <g id="Gruppe_18457" data-name="Gruppe 18457" transform="translate(164.383)">
      <path id="Pfad_17953" data-name="Pfad 17953" d="M78,9V1a1,1,0,0,0-2,0V9Z" transform="translate(950.838 411)"/>
      <path id="Differenzmenge_34" data-name="Differenzmenge 34" d="M-1195.246,19558.986v0l-10.833,0v-13a5.008,5.008,0,0,1,5-5h10v8a1,1,0,0,0,1,1,1,1,0,0,0,1-1v-8H-1184v.02a19.929,19.929,0,0,1-3.125,10.738,20.04,20.04,0,0,1-8.118,7.244Zm82.166,0h-73.554l.07-.066c.077-.076.16-.156.241-.238a24.993,24.993,0,0,0,5.357-7.949A24.8,24.8,0,0,0-1179,19541v-.02h48.923v8a1,1,0,0,0,1,1,1,1,0,0,0,1-1v-8h10a5.008,5.008,0,0,1,5,5v13Z" transform="translate(2156.918 -19120.984)" fill="#520b83"/>
    </g>
    <path id="Pfad_17939" data-name="Pfad 17939" d="M20.5,46h-6a1,1,0,0,1,0-2h6a1,1,0,1,1,0,2" transform="translate(1115.221 411)"/>
    <path id="Pfad_17940" data-name="Pfad 17940" d="M40.5,46h-6a1,1,0,0,1,0-2h6a1,1,0,0,1,0,2" transform="translate(1115.221 411)"/>
    <path id="Pfad_17941" data-name="Pfad 17941" d="M59.5,46h-6a1,1,0,0,1,0-2h6a1,1,0,0,1,0,2" transform="translate(1115.221 411)"/>
    <path id="Pfad_17942" data-name="Pfad 17942" d="M79.5,46h-6a1,1,0,0,1,0-2h6a1,1,0,0,1,0,2" transform="translate(1115.221 411)"/>
    <path id="Pfad_17943" data-name="Pfad 17943" d="M20.5,58h-6a1,1,0,0,1,0-2h6a1,1,0,1,1,0,2" transform="translate(1115.221 411)"/>
    <path id="Pfad_17944" data-name="Pfad 17944" d="M40.5,58h-6a1,1,0,0,1,0-2h6a1,1,0,0,1,0,2" transform="translate(1115.221 411)"/>
    <path id="Pfad_17945" data-name="Pfad 17945" d="M59.5,58h-6a1,1,0,0,1,0-2h6a1,1,0,0,1,0,2" transform="translate(1115.221 411)"/>
    <path id="Pfad_17947" data-name="Pfad 17947" d="M20.5,70h-6a1,1,0,0,1,0-2h6a1,1,0,1,1,0,2" transform="translate(1115.221 411)"/>
    <path id="Pfad_17948" data-name="Pfad 17948" d="M40.5,70h-6a1,1,0,0,1,0-2h6a1,1,0,0,1,0,2" transform="translate(1115.221 411)"/>
    <path id="Pfad_17949" data-name="Pfad 17949" d="M59.5,70h-6a1,1,0,0,1,0-2h6a1,1,0,0,1,0,2" transform="translate(1115.221 411)"/>
    <path id="Differenzmenge_53" data-name="Differenzmenge 53" d="M-7160.4,19574.885h-6.947l-.747-2h7.694a3.3,3.3,0,0,0,2.382-1.018l.726,2.01A5.269,5.269,0,0,1-7160.4,19574.885Zm-11.753,0h-4.579l.333-2h6.924l-2.679,2Zm-9.647,0h-60.821a5.431,5.431,0,0,1-5.375-5.473V19520h2v49.41a3.427,3.427,0,0,0,3.373,3.471h61.154l-.333,2v0h0Zm26.776-5.734h-2l0-9.281,2,2,0,7.279Zm.008-14.35v0l-2-2,.021-36.8h2l-.021,38.8Z" transform="translate(8363.222 -19075.004)"/>
    <path id="Pfad_17696" data-name="Pfad 17696" d="M148.528,99.357a.824.824,0,0,1-.758.5h-9.222l5.538,15.328a.824.824,0,0,1-.494,1.055l-7.516,2.736a.882.882,0,0,1-.288.049.824.824,0,0,1-.775-.536l-5.859-15.707-7.335,5.48a.855.855,0,0,1-1.31-.824L125.5,77.461a.822.822,0,0,1,1.434-.47l21.427,21.427A.824.824,0,0,1,148.528,99.357Z" transform="translate(1065.67 394.285)" fill="#520b83"/>
    <path id="Ellipse_465" data-name="Ellipse 465" d="M20,0A20,20,0,1,1,0,20,20,20,0,0,1,20,0Z" transform="translate(1097.723 400)" fill="#169d64"/>
    <g id="J7nHQU" transform="translate(1353.443 370.461)">
      <g id="Gruppe_11712" data-name="Gruppe 11712" transform="translate(-245.141 42.949)">
        <path id="Pfad_8655" data-name="Pfad 8655" d="M-245.141,49.523c.088-.172.172-.345.264-.515a12.99,12.99,0,0,1,2.912-3.672,9.764,9.764,0,0,1,3.174-1.871,9,9,0,0,1,2.028-.459,9.252,9.252,0,0,1,3.953.408,9.814,9.814,0,0,1,3.637,2.2,13,13,0,0,1,2.806,3.8c.018.037.035.076.06.13-.138.261-.273.535-.425.8a12.923,12.923,0,0,1-2.745,3.381,9.6,9.6,0,0,1-3.98,2.121,9.254,9.254,0,0,1-2.893.257,9.269,9.269,0,0,1-5.179-2.01,12.535,12.535,0,0,1-2.808-3.112,11.591,11.591,0,0,1-.787-1.408.169.169,0,0,0-.017-.025Zm5.178.013a4.237,4.237,0,0,0,4.232,4.24,4.237,4.237,0,0,0,4.241-4.23,4.237,4.237,0,0,0-4.235-4.243A4.237,4.237,0,0,0-239.963,49.536Z" transform="translate(245.141 -42.949)" fill="#fff"/>
        <path id="Pfad_8656" data-name="Pfad 8656" d="M209.2,315.082a2.353,2.353,0,1,1-2.357-2.352A2.355,2.355,0,0,1,209.2,315.082Z" transform="translate(-197.432 -308.493)" fill="#fff"/>
      </g>
    </g>
  </g>
</svg>
