<svg width="128" height="118" viewBox="0 0 128 118" fill="none" xmlns="http://www.w3.org/2000/svg">
<g id="Icon_EmptyStates-HRA 04">
<path id="Differenzmenge 27" d="M111.142 103.994H88.9153C88.7089 103.337 88.537 102.669 88.3997 101.994H109.999V78.0996C110.683 78.1696 111.355 78.2704 111.999 78.3984V103.145C111.999 103.257 111.976 103.367 111.933 103.471C111.89 103.574 111.826 103.669 111.746 103.748C111.667 103.827 111.573 103.889 111.469 103.932C111.365 103.974 111.254 103.995 111.142 103.994ZM83.7229 103.994H32.8557C32.6273 103.994 32.4079 103.904 32.2463 103.742C32.0881 103.583 31.9992 103.367 31.9993 103.143V28.1055H33.9993V101.99H83.3186C83.4246 102.654 83.5599 103.328 83.7239 103.99L83.7229 103.994ZM111.994 73.3145C111.354 73.2145 110.682 73.1321 109.994 73.0781V19.1973H95.6145C95.0841 19.1973 94.5755 18.9864 94.2004 18.6113C93.8254 18.2363 93.6145 17.7277 93.6145 17.1973V1.99805H33.9993V7.81055C33.3623 7.64255 32.6893 7.49214 31.9993 7.36914V0.839844C32.0027 0.61622 32.094 0.403206 32.2532 0.246094C32.4123 0.0889819 32.6262 0.000498417 32.8499 0H95.6165L111.995 17.2012L111.994 73.3145ZM95.6155 2.89648V17.1973H109.234L95.6155 2.89648ZM33.9983 23.1035H31.9983V12.4629C32.6663 12.6129 33.3383 12.7986 33.9983 13.0176V23.1035Z" fill="black"/>
<g id="Gruppe 18283">
<path id="Linie 4930" d="M92.9954 41.0002H70.9954C70.7301 41.0002 70.4758 40.8949 70.2883 40.7074C70.1007 40.5198 69.9954 40.2655 69.9954 40.0002C69.9954 39.735 70.1007 39.4807 70.2883 39.2931C70.4758 39.1056 70.7301 39.0002 70.9954 39.0002H92.9954C93.2606 39.0002 93.5149 39.1056 93.7025 39.2931C93.89 39.4807 93.9954 39.735 93.9954 40.0002C93.9954 40.2655 93.89 40.5198 93.7025 40.7074C93.5149 40.8949 93.2606 41.0002 92.9954 41.0002Z" fill="#169D64"/>
<path id="Linie 4931" d="M92.9954 65.0002H70.9954C70.7301 65.0002 70.4758 64.8949 70.2883 64.7074C70.1007 64.5198 69.9954 64.2655 69.9954 64.0002C69.9954 63.735 70.1007 63.4807 70.2883 63.2931C70.4758 63.1056 70.7301 63.0002 70.9954 63.0002H92.9954C93.2606 63.0002 93.5149 63.1056 93.7025 63.2931C93.89 63.4807 93.9954 63.735 93.9954 64.0002C93.9954 64.2655 93.89 64.5198 93.7025 64.7074C93.5149 64.8949 93.2606 65.0002 92.9954 65.0002Z" fill="#169D64"/>
<path id="Pfad 17907" d="M53.1184 45.0024C52.8192 45.0036 52.5296 44.8971 52.3024 44.7024L47.8024 40.8224C47.5512 40.606 47.3964 40.2987 47.3718 39.968C47.3473 39.6374 47.455 39.3106 47.6714 39.0594C47.8878 38.8082 48.1952 38.6533 48.5258 38.6288C48.8564 38.6042 49.1833 38.712 49.4345 38.9284L53.0294 42.0284L60.4624 34.1374C60.575 34.0179 60.7099 33.9217 60.8596 33.8544C61.0093 33.7871 61.1709 33.7499 61.335 33.7449C61.4991 33.74 61.6625 33.7675 61.8159 33.8257C61.9694 33.884 62.1099 33.9719 62.2294 34.0844C62.3489 34.1969 62.4451 34.3319 62.5125 34.4816C62.5798 34.6313 62.6169 34.7928 62.6218 34.9569C62.6268 35.121 62.5994 35.2845 62.5412 35.4379C62.4829 35.5914 62.3949 35.7319 62.2824 35.8514L54.0294 44.6134C53.9122 44.737 53.7708 44.8353 53.6142 44.9022C53.4575 44.9691 53.2888 45.0032 53.1184 45.0024Z" fill="#169D64"/>
<g id="Gruppe 18283_2">
<path id="Linie 4890" d="M59.9956 70.2505C59.8314 70.2507 59.6688 70.2185 59.5171 70.1557C59.3654 70.0929 59.2276 70.0007 59.1116 69.8845L49.1116 59.8845C48.9955 59.7684 48.9034 59.6306 48.8405 59.4789C48.7777 59.3272 48.7454 59.1647 48.7454 59.0005C48.7454 58.8363 48.7777 58.6737 48.8405 58.522C48.9034 58.3704 48.9955 58.2326 49.1116 58.1165C49.2277 58.0004 49.3655 57.9083 49.5172 57.8454C49.6688 57.7826 49.8314 57.7502 49.9956 57.7502C50.1598 57.7502 50.3223 57.7826 50.474 57.8454C50.6257 57.9083 50.7635 58.0004 50.8796 58.1165L60.8796 68.1165C61.0545 68.2913 61.1735 68.514 61.2218 68.7565C61.27 68.9991 61.2453 69.2504 61.1507 69.4789C61.056 69.7073 60.8958 69.9025 60.6902 70.0399C60.4846 70.1772 60.2429 70.2505 59.9956 70.2505Z" fill="#169D64"/>
<path id="Linie 4891" d="M49.9956 70.2505C49.8314 70.2507 49.6688 70.2185 49.5171 70.1557C49.3654 70.0929 49.2276 70.0007 49.1116 69.8845C48.9955 69.7684 48.9034 69.6306 48.8405 69.4789C48.7777 69.3272 48.7454 69.1647 48.7454 69.0005C48.7454 68.8363 48.7777 68.6737 48.8405 68.522C48.9034 68.3704 48.9955 68.2326 49.1116 68.1165L59.1116 58.1165C59.2277 58.0004 59.3655 57.9083 59.5172 57.8454C59.6688 57.7826 59.8314 57.7502 59.9956 57.7502C60.1598 57.7502 60.3223 57.7826 60.474 57.8454C60.6257 57.9083 60.7635 58.0004 60.8796 58.1165C60.9957 58.2326 61.0878 58.3704 61.1506 58.522C61.2135 58.6737 61.2458 58.8363 61.2458 59.0005C61.2458 59.1647 61.2135 59.3272 61.1506 59.4789C61.0878 59.6306 60.9957 59.7684 60.8796 59.8845L50.8796 69.8845C50.7636 70.0007 50.6258 70.0929 50.4741 70.1557C50.3224 70.2185 50.1598 70.2507 49.9956 70.2505Z" fill="#169D64"/>
</g>
</g>
<g id="Gruppe 18410">
<path id="Ellipse 465" d="M107.999 77.9983C111.955 77.9983 115.822 79.1713 119.111 81.3689C122.4 83.5665 124.963 86.6901 126.477 90.3446C127.991 93.9991 128.387 98.0205 127.615 101.9C126.843 105.78 124.938 109.343 122.141 112.14C119.344 114.937 115.781 116.842 111.901 117.614C108.021 118.386 104 117.99 100.346 116.476C96.6911 114.962 93.5675 112.399 91.3699 109.11C89.1722 105.821 87.9993 101.954 87.9993 97.9983C87.9993 92.694 90.1064 87.6069 93.8571 83.8562C97.6079 80.1054 102.695 77.9983 107.999 77.9983Z" fill="#169D64"/>
<g id="Gruppe 17863">
<path id="Pfad 6165" d="M117.342 94.3024L105.342 104.516C104.958 104.834 104.473 105.004 103.974 104.997C103.476 104.989 102.996 104.805 102.621 104.476L98.6212 100.838C98.4328 100.672 98.2807 100.469 98.1745 100.241C98.0683 100.013 98.0103 99.766 98.0041 99.5148C97.9979 99.2635 98.0437 99.0137 98.1385 98.781C98.2333 98.5483 98.3752 98.3377 98.5552 98.1624C98.9285 97.7933 99.429 97.5813 99.9538 97.5702C100.479 97.559 100.988 97.7495 101.376 98.1024L104.037 100.521L114.661 91.4864C115.062 91.1488 115.576 90.9756 116.099 91.0016C116.623 91.0275 117.117 91.2508 117.482 91.6264C117.657 91.8069 117.793 92.0216 117.882 92.257C117.97 92.4925 118.009 92.7437 117.996 92.9949C117.983 93.2461 117.918 93.4918 117.805 93.7168C117.693 93.9418 117.535 94.1411 117.342 94.3024Z" fill="white"/>
</g>
</g>
<path id="Pfad 17828" d="M47.9993 29.6233C48.0103 29.7005 47.995 29.7792 47.956 29.8467C47.9169 29.9142 47.8563 29.9666 47.7839 29.9956C47.7115 30.0245 47.6314 30.0283 47.5566 30.0063C47.4818 29.9843 47.4165 29.9378 47.3713 29.8743C45.8343 27.7743 43.8236 26.0666 41.5025 24.89C39.1815 23.7133 36.6156 23.1008 34.0133 23.1023H22.3363C22.2503 23.1021 22.1651 23.1189 22.0857 23.1518C22.0062 23.1846 21.934 23.2327 21.8732 23.2935C21.8123 23.3542 21.7641 23.4263 21.7311 23.5058C21.6982 23.5852 21.6813 23.6703 21.6813 23.7563V31.3403C21.6814 31.4591 21.6491 31.5758 21.5879 31.6777C21.5267 31.7796 21.4389 31.8629 21.3339 31.9186C21.2289 31.9743 21.1107 32.0004 20.992 31.994C20.8734 31.9876 20.7586 31.949 20.6603 31.8823L0.287266 18.0773C0.198788 18.0173 0.126342 17.9366 0.076263 17.8423C0.0261845 17.7479 0 17.6426 0 17.5358C0 17.4289 0.0261845 17.3237 0.076263 17.2293C0.126342 17.1349 0.198788 17.0542 0.287266 16.9943L20.6603 3.18226C20.7586 3.11556 20.8734 3.07693 20.992 3.07053C21.1107 3.06413 21.2289 3.09019 21.3339 3.14593C21.4389 3.20166 21.5267 3.28495 21.5879 3.38685C21.6491 3.48875 21.6814 3.6054 21.6813 3.72426V11.3073C21.6811 11.3933 21.698 11.4785 21.7309 11.5581C21.7637 11.6376 21.812 11.7099 21.8728 11.7707C21.9337 11.8316 22.0059 11.8798 22.0855 11.9127C22.165 11.9455 22.2502 11.9624 22.3363 11.9623H27.4463C32.418 11.9619 37.2252 13.7434 40.996 16.9836C44.7668 20.2238 47.2514 24.7081 47.9993 29.6233Z" fill="#520B83"/>
</g>
</svg>
