<svg xmlns="http://www.w3.org/2000/svg" width="80" height="80.001" viewBox="0 0 80 80.001">
  <g data-name="Gruppe 13987" transform="translate(-499.216 -1443.786)">
    <g data-name="Gruppe 13987" transform="translate(499.216 1443.786)">
      <path data-name="Pfad 17667" d="M44.159,171a40,40,0,1,0-40-40,40,40,0,0,0,40,40" transform="translate(-4.159 -91)" fill="#2ba160"/>
      <path data-name="Pfad 17668" d="M68.217,131.931H13.863a2.117,2.117,0,0,1,0-4.233H68.217a2.117,2.117,0,0,1,0,4.233" transform="translate(-1.041 -75.913)" fill="#fff"/>
      <path data-name="Pfad 17669" d="M65.324,116.944,36.648,100.051l-20.72,35.174,11.676,6.86,24.2-2" transform="translate(0.678 -87.28)" fill="#fff"/>
      <path data-name="Pfad 17670" d="M38.089,130.515a10.683,10.683,0,1,1,7.555-3.128,10.611,10.611,0,0,1-7.555,3.128m0-19.956a9.273,9.273,0,1,0,6.556,2.716,9.209,9.209,0,0,0-6.556-2.716" transform="translate(5.399 -83.54)" fill="#2ba160"/>
      <path data-name="Pfad 17671" d="M29.77,131.678a1.039,1.039,0,0,1-.453-.1,1.058,1.058,0,0,1-.5-1.41c1.9-3.988,8.265-13.2,17.265-20.947a1.058,1.058,0,0,1,1.38,1.6c-8.755,7.534-14.91,16.42-16.735,20.251a1.059,1.059,0,0,1-.957.6" transform="translate(5.934 -83.616)" fill="#2ba160"/>
      <path data-name="Pfad 17672" d="M51.649,124.574a1.05,1.05,0,0,1-.54-.15c-9.92-5.911-20.3-8.931-24.516-9.443a1.059,1.059,0,0,1,.257-2.1c4.384.535,15.143,3.649,25.343,9.728a1.058,1.058,0,0,1-.543,1.967" transform="translate(4.68 -82.009)" fill="#2ba160"/>
    </g>
  </g>
</svg>
