<svg xmlns="http://www.w3.org/2000/svg" width="80" height="80.001" viewBox="0 0 80 80.001">
  <g data-name="Gruppe 13966" transform="translate(-647.266 -1478.836)">
    <path data-name="Pfad 17664" d="M44.159,80a40,40,0,1,0-40-40,40,40,0,0,0,40,40" transform="translate(643.107 1478.836)" fill="#d50a39"/>
    <path data-name="Pfad 17665" d="M43.806,28.455H64V20.307a3.239,3.239,0,0,0-3.225-3.252H18.361a3.239,3.239,0,0,0-3.225,3.252v8.148h20.2v-.749a1.62,1.62,0,0,1,1.613-1.627h5.248a1.62,1.62,0,0,1,1.613,1.627M64,49.778V31.1h-20.2v2.212a1.621,1.621,0,0,1-1.613,1.625H36.945a1.621,1.621,0,0,1-1.613-1.625V31.1h-20.2V49.778a3.239,3.239,0,0,0,3.225,3.252H60.776A3.239,3.239,0,0,0,64,49.778" transform="translate(647.697 1485.748)" fill="#fff"/>
    <path data-name="Pfad 17666" d="M41.454,20.533V15.491A3.253,3.253,0,0,0,38.2,12.239H30.885a3.252,3.252,0,0,0-3.252,3.252v5.042a3.432,3.432,0,0,0,2.638,3.137V14.878h8.545V23.67a3.432,3.432,0,0,0,2.638-3.137" transform="translate(652.723 1483.854)" fill="#fff"/>
    <rect data-name="Rechteck 7040" width="3.756" height="4.083" transform="translate(685.385 1514.246)" fill="#fff"/>
  </g>
</svg>
