<svg width="48" height="49" viewBox="0 0 48 49" fill="none" xmlns="http://www.w3.org/2000/svg">
<path d="M47.7228 19.1706C47.3262 18.7741 46.7116 18.7741 46.3151 19.1706L40.4266 25.059V15.3243C40.4266 9.61428 35.7674 4.95508 30.0574 4.95508H18.6573C18.1021 4.95508 17.666 5.39126 17.666 5.9464C17.666 6.50154 18.1021 6.93772 18.6573 6.93772H30.0574C34.677 6.93772 38.444 10.7047 38.444 15.3243V25.0789L32.4763 19.1111C32.0797 18.7146 31.4651 18.7146 31.0686 19.1111C30.6721 19.5076 30.6721 20.1223 31.0686 20.5188L38.7216 28.1718C38.7216 28.1718 38.9198 28.3304 39.0388 28.3899C39.1578 28.4494 39.2965 28.4692 39.4155 28.4692C39.5345 28.4692 39.6732 28.4494 39.7922 28.3899C39.9112 28.3304 40.0301 28.2709 40.1094 28.1718L47.7029 20.5981C48.0995 20.2016 48.0995 19.587 47.7029 19.1904L47.7228 19.1706Z" fill="black"/>
<path d="M39.4344 38.3145C36.9759 38.3145 34.914 40.079 34.458 42.3987H10.0517C9.59567 40.079 7.53372 38.3145 5.07525 38.3145C2.27973 38.3145 -0.000305176 40.5945 -0.000305176 43.39C-0.000305176 46.1855 2.27973 48.4656 5.07525 48.4656C7.53372 48.4656 9.59567 46.701 10.0517 44.3813H34.458C34.914 46.701 36.9759 48.4656 39.4344 48.4656C42.2299 48.4656 44.5099 46.1855 44.5099 43.39C44.5099 40.5945 42.2299 38.3145 39.4344 38.3145ZM5.07525 46.5028C3.37018 46.5028 1.98233 45.1149 1.98233 43.4098C1.98233 41.7048 3.37018 40.3169 5.07525 40.3169C6.78032 40.3169 8.16817 41.7048 8.16817 43.4098C8.16817 45.1149 6.78032 46.5028 5.07525 46.5028ZM39.4344 46.5028C37.7293 46.5028 36.3415 45.1149 36.3415 43.4098C36.3415 41.7048 37.7293 40.3169 39.4344 40.3169C41.1395 40.3169 42.5273 41.7048 42.5273 43.4098C42.5273 45.1149 41.1395 46.5028 39.4344 46.5028Z" fill="black"/>
<path d="M5.07525 11.0261C7.87077 11.0261 10.1508 8.74608 10.1508 5.95056C10.1508 3.15503 7.87077 0.875 5.07525 0.875C2.27973 0.875 -0.000305176 3.15503 -0.000305176 5.95056C-0.000305176 8.74608 2.27973 11.0261 5.07525 11.0261ZM5.07525 2.85764C6.78032 2.85764 8.16817 4.24549 8.16817 5.95056C8.16817 7.65563 6.78032 9.04347 5.07525 9.04347C3.37018 9.04347 1.98233 7.65563 1.98233 5.95056C1.98233 4.24549 3.37018 2.85764 5.07525 2.85764Z" fill="#169D64"/>
</svg>