<svg xmlns="http://www.w3.org/2000/svg" width="24" height="24" viewBox="0 0 24 24">
  <g id="arrow-Right-Gruppe_14256" data-name="Gruppe 14256" transform="translate(-964 -568)">
    <rect  data-name="Rechteck 2281" width="24" height="24" transform="translate(964 568)" fill="none"/>
    <path  data-name="Linie 366" d="M102.211,152.6a.75.75,0,0,1-.53-1.28l3.471-3.471-3.471-3.471a.75.75,0,0,1,1.061-1.061l4,4a.75.75,0,0,1,0,1.061l-4,4A.748.748,0,0,1,102.211,152.6Z" transform="translate(872.289 431.658)" fill="#040405"/>
  </g>
</svg>
