<svg width="603" height="313" viewBox="0 0 603 313" fill="none" xmlns="http://www.w3.org/2000/svg">
<g clip-path="url(#clip0_3500_1309)">
<path d="M157.384 109.401C177.503 109.401 197.17 115.367 213.898 126.544C230.627 137.722 243.665 153.609 251.364 172.196C259.063 190.784 261.078 211.237 257.153 230.97C253.228 250.702 243.539 268.828 229.313 283.054C215.087 297.28 196.961 306.968 177.229 310.893C157.497 314.818 137.043 312.804 118.456 305.105C99.8682 297.405 83.9812 284.367 72.8037 267.639C61.6261 250.911 55.6602 231.243 55.6602 211.124C55.6602 184.146 66.3774 158.272 85.4543 139.195C104.531 120.118 130.405 109.401 157.384 109.401Z" fill="#1E49D8"/>
<path d="M157.384 2.87897C146.924 2.87617 136.49 3.92134 126.239 5.99881C101.744 10.9765 78.8249 21.8281 59.4509 37.6208C40.0769 53.4135 24.8279 73.6749 15.0148 96.6633C11.0671 105.947 8.053 115.6 6.01704 125.48C1.83266 145.897 1.83266 166.951 6.01704 187.368C10.07 207.019 17.9688 225.674 29.259 242.26C51.9179 275.62 86.7218 298.798 126.238 306.845C146.793 311.006 167.973 311.006 188.527 306.845C213.022 301.868 235.941 291.016 255.315 275.223C274.689 259.431 289.938 239.169 299.752 216.181C303.7 206.898 306.715 197.245 308.751 187.365C312.936 166.948 312.936 145.894 308.751 125.477C304.698 105.826 296.799 87.171 285.509 70.5846C262.85 37.2251 228.046 14.0468 188.53 5.99977C178.278 3.92185 167.844 2.87636 157.384 2.87897ZM157.384 0C244.304 0 314.767 70.0338 314.767 156.424C314.767 242.814 244.304 312.848 157.384 312.848C70.4628 312.848 0 242.814 0 156.424C0 70.0338 70.4628 0 157.384 0Z" fill="#1E49D8"/>
<path d="M117.158 215.923V214.579H113.343V206.545H111.825V215.923H117.158ZM121.216 216.084C121.772 216.113 122.326 215.999 122.825 215.753C123.323 215.506 123.75 215.135 124.064 214.675L123.2 213.829C123.018 214.155 122.751 214.424 122.426 214.609C122.102 214.794 121.733 214.886 121.36 214.877C121.113 214.896 120.866 214.861 120.634 214.775C120.402 214.69 120.191 214.555 120.016 214.38C119.841 214.205 119.706 213.994 119.621 213.762C119.535 213.53 119.5 213.283 119.519 213.036V212.808H124.318V212.257C124.318 210.322 123.27 208.777 121.214 208.777C119.226 208.777 118.003 210.201 118.003 212.431C118.003 214.662 119.227 216.084 121.216 216.084ZM121.216 209.917C121.44 209.917 121.662 209.965 121.866 210.058C122.071 210.15 122.253 210.286 122.4 210.455C122.548 210.623 122.658 210.822 122.722 211.037C122.787 211.252 122.805 211.478 122.774 211.7V211.835H119.523V211.739C119.504 211.505 119.533 211.271 119.61 211.049C119.686 210.828 119.808 210.626 119.967 210.454C120.127 210.283 120.32 210.146 120.535 210.054C120.75 209.961 120.982 209.915 121.216 209.917ZM132.072 216.581C132.072 215.372 131.346 214.646 129.626 214.646H127.907C127.289 214.646 126.926 214.499 126.926 214.122C126.926 213.773 127.248 213.547 127.598 213.424C127.897 213.497 128.203 213.533 128.511 213.531C130.285 213.531 131.306 212.577 131.306 211.167C131.317 210.793 131.233 210.423 131.06 210.091C130.888 209.76 130.633 209.478 130.321 209.272V208.99H131.745V207.808H130.67C130.052 207.808 129.757 208.184 129.757 208.802V208.994C129.355 208.841 128.928 208.767 128.498 208.775C126.724 208.775 125.715 209.742 125.715 211.167C125.698 211.599 125.811 212.027 126.038 212.395C126.265 212.764 126.597 213.056 126.991 213.236V213.289C126.319 213.451 125.755 213.8 125.755 214.525C125.745 214.768 125.818 215.007 125.962 215.202C126.107 215.398 126.313 215.538 126.548 215.6V215.748C126.215 215.777 125.905 215.932 125.683 216.182C125.46 216.432 125.342 216.757 125.352 217.092C125.352 218.153 126.239 218.771 128.519 218.771C131.037 218.771 132.072 218.034 132.072 216.581ZM130.701 216.742C130.701 217.387 130.137 217.71 128.995 217.71H128.081C126.993 217.71 126.577 217.32 126.577 216.756C126.575 216.59 126.619 216.427 126.703 216.285C126.788 216.143 126.91 216.027 127.056 215.95H129.421C130.379 215.95 130.705 216.259 130.705 216.742H130.701ZM128.511 212.468C127.648 212.468 127.154 212.078 127.154 211.286V211.019C127.154 210.226 127.651 209.837 128.511 209.837C129.371 209.837 129.868 210.226 129.868 211.019V211.288C129.868 212.084 129.371 212.468 128.511 212.468ZM139.054 215.923V214.727H138.315V211.22C138.315 209.662 137.307 208.775 135.507 208.775C134.986 208.736 134.463 208.841 133.998 209.081C133.534 209.321 133.144 209.684 132.874 210.132L133.747 210.925C133.912 210.629 134.155 210.383 134.449 210.216C134.743 210.048 135.078 209.964 135.417 209.973C136.398 209.973 136.856 210.47 136.856 211.316V211.907H135.592C133.643 211.907 132.609 212.62 132.609 214.003C132.596 214.296 132.646 214.587 132.757 214.858C132.869 215.129 133.038 215.372 133.253 215.57C133.468 215.768 133.724 215.917 134.002 216.006C134.281 216.096 134.576 216.123 134.866 216.086C135.307 216.13 135.75 216.022 136.121 215.78C136.493 215.539 136.77 215.177 136.908 214.756H136.975C136.981 214.916 137.018 215.073 137.084 215.218C137.151 215.364 137.246 215.494 137.363 215.603C137.481 215.711 137.619 215.796 137.769 215.85C137.919 215.905 138.079 215.93 138.238 215.923H139.054ZM135.279 214.969C134.553 214.969 134.096 214.646 134.096 214.028V213.786C134.096 213.182 134.594 212.846 135.615 212.846H136.851V213.854C136.854 214.539 136.183 214.969 135.283 214.969H135.279ZM142.927 215.923V214.727H141.96V205.981H140.493V214.472C140.473 214.671 140.498 214.872 140.567 215.06C140.635 215.248 140.746 215.419 140.889 215.558C141.033 215.698 141.206 215.803 141.396 215.866C141.586 215.929 141.788 215.949 141.987 215.923H142.927ZM144.428 215.923H147.747C150.138 215.923 151.71 214.364 151.71 211.234C151.71 208.103 150.138 206.545 147.747 206.545H144.428V215.923ZM145.946 214.579V207.888H147.747C149.144 207.888 150.084 208.789 150.084 210.48V211.988C150.084 213.681 149.144 214.579 147.747 214.579H145.946ZM156.241 216.084C158.19 216.084 159.452 214.66 159.452 212.43C159.452 210.199 158.19 208.775 156.241 208.775C154.293 208.775 153.03 210.199 153.03 212.43C153.03 214.66 154.293 216.084 156.241 216.084ZM156.241 214.875C155.247 214.875 154.575 214.257 154.575 213.021V211.838C154.575 210.602 155.247 209.984 156.241 209.984C157.236 209.984 157.907 210.602 157.907 211.838V213.021C157.907 214.257 157.236 214.875 156.241 214.875ZM163.779 216.084C164.367 216.122 164.952 215.971 165.448 215.652C165.944 215.332 166.324 214.862 166.533 214.31L165.418 213.715C165.305 214.058 165.085 214.356 164.789 214.563C164.494 214.771 164.139 214.877 163.779 214.867C162.704 214.867 162.153 214.128 162.153 213.053V211.806C162.153 210.731 162.704 209.992 163.779 209.992C164.111 209.97 164.442 210.064 164.713 210.257C164.985 210.45 165.182 210.732 165.27 211.053L166.479 210.489C166.272 209.951 165.898 209.494 165.412 209.185C164.926 208.875 164.353 208.73 163.779 208.769C161.763 208.769 160.612 210.194 160.612 212.424C160.612 214.654 161.763 216.084 163.779 216.084ZM168.036 215.923H169.487V208.748H169.554L170.293 210.266L172.354 214.015L174.41 210.266L175.149 208.748H175.216V215.923H176.663V206.545H174.945L172.431 211.316H172.354L169.842 206.547H168.036V215.923ZM184.306 215.923V214.579H180.492V206.545H178.976V215.923H184.306ZM186.966 216.084C187.093 216.1 187.221 216.088 187.343 216.048C187.465 216.009 187.576 215.944 187.67 215.856C187.763 215.769 187.837 215.663 187.884 215.544C187.932 215.426 187.953 215.298 187.947 215.17V214.969C187.928 214.722 187.816 214.491 187.634 214.322C187.452 214.154 187.214 214.06 186.966 214.06C186.718 214.06 186.479 214.154 186.297 214.322C186.116 214.491 186.004 214.722 185.985 214.969V215.17C185.978 215.298 185.999 215.426 186.047 215.545C186.095 215.663 186.169 215.77 186.262 215.857C186.356 215.944 186.468 216.01 186.59 216.049C186.712 216.088 186.841 216.1 186.968 216.084H186.966ZM194.115 215.923H195.578V205.981H194.113V210.092H194.046C193.904 209.691 193.637 209.346 193.284 209.108C192.93 208.871 192.51 208.754 192.085 208.775C190.325 208.775 189.302 210.132 189.302 212.43C189.302 214.727 190.323 216.084 192.085 216.084C192.509 216.102 192.928 215.984 193.281 215.747C193.634 215.51 193.902 215.167 194.046 214.767H194.113L194.115 215.923ZM192.53 214.821C192.298 214.828 192.068 214.785 191.854 214.696C191.64 214.608 191.447 214.474 191.288 214.305C191.129 214.137 191.008 213.936 190.933 213.717C190.857 213.498 190.829 213.265 190.85 213.034V211.825C190.829 211.594 190.857 211.361 190.933 211.142C191.008 210.923 191.129 210.723 191.288 210.554C191.447 210.385 191.64 210.251 191.854 210.163C192.068 210.074 192.298 210.031 192.53 210.038C193.417 210.038 194.115 210.518 194.115 211.234V213.625C194.115 214.337 193.417 214.821 192.53 214.821ZM200.416 216.084C200.972 216.113 201.526 215.999 202.025 215.752C202.524 215.505 202.951 215.133 203.265 214.673L202.401 213.827C202.219 214.151 201.953 214.421 201.63 214.605C201.307 214.79 200.94 214.883 200.568 214.875C200.321 214.894 200.074 214.859 199.842 214.773C199.61 214.688 199.399 214.553 199.224 214.378C199.049 214.203 198.914 213.992 198.829 213.76C198.743 213.528 198.708 213.281 198.727 213.034V212.806H203.526V212.255C203.526 210.32 202.478 208.775 200.422 208.775C198.434 208.775 197.211 210.199 197.211 212.43C197.211 214.66 198.428 216.084 200.416 216.084ZM200.416 209.917C200.641 209.917 200.862 209.965 201.067 210.058C201.271 210.15 201.453 210.286 201.601 210.455C201.748 210.623 201.858 210.822 201.923 211.037C201.987 211.252 202.005 211.478 201.975 211.7V211.835H198.724V211.739C198.704 211.505 198.734 211.271 198.81 211.049C198.887 210.828 199.008 210.626 199.168 210.454C199.327 210.283 199.52 210.146 199.735 210.054C199.95 209.961 200.182 209.915 200.416 209.917Z" fill="white"/>
<path d="M126.852 65.2566V63.9131H123.036V55.8789H121.518V65.2566H126.852ZM130.91 65.4179C131.465 65.4472 132.02 65.3328 132.518 65.0857C133.017 64.8386 133.444 64.4672 133.758 64.0072L132.894 63.1608C132.712 63.4866 132.444 63.7565 132.12 63.9412C131.795 64.1259 131.427 64.2184 131.053 64.2087C130.807 64.2277 130.559 64.1931 130.327 64.1074C130.095 64.0216 129.885 63.8866 129.71 63.7118C129.535 63.5369 129.4 63.3263 129.314 63.0943C129.228 62.8624 129.194 62.6146 129.213 62.3681V62.1397H134.011V61.5888C134.011 59.6542 132.963 58.1091 130.908 58.1091C128.919 58.1091 127.697 59.5333 127.697 61.7635C127.697 63.9937 128.921 65.4179 130.91 65.4179ZM130.91 59.2511C131.134 59.251 131.356 59.2989 131.56 59.3916C131.764 59.4843 131.946 59.6196 132.094 59.7885C132.241 59.9575 132.351 60.156 132.416 60.3708C132.48 60.5857 132.498 60.8119 132.468 61.0342V61.1685H129.217V61.0725C129.197 60.8393 129.227 60.6046 129.303 60.3834C129.38 60.1623 129.502 59.9595 129.661 59.7881C129.82 59.6166 130.014 59.4803 130.229 59.3879C130.444 59.2954 130.675 59.2488 130.91 59.2511ZM141.765 65.915C141.765 64.7058 141.04 63.9803 139.32 63.9803H137.6C136.982 63.9803 136.619 63.8325 136.619 63.4563C136.619 63.107 136.942 62.8805 137.291 62.7577C137.59 62.8313 137.897 62.8674 138.205 62.8652C139.978 62.8652 140.999 61.9113 140.999 60.5006C141.011 60.1269 140.926 59.7566 140.753 59.425C140.581 59.0934 140.326 58.8115 140.014 58.6062V58.3241H141.438V57.1418H140.363C139.745 57.1418 139.449 57.518 139.449 58.136V58.3279C139.048 58.1752 138.62 58.101 138.19 58.1091C136.417 58.1091 135.407 59.0765 135.407 60.5006C135.391 60.9332 135.503 61.3609 135.731 61.7294C135.958 62.0978 136.29 62.3903 136.684 62.5696V62.6233C136.012 62.7846 135.448 63.1339 135.448 63.8594C135.438 64.102 135.511 64.3407 135.655 64.5361C135.799 64.7315 136.006 64.872 136.24 64.9342V65.082C135.907 65.1108 135.598 65.266 135.375 65.5159C135.153 65.7657 135.035 66.0912 135.045 66.4255C135.045 67.4869 135.931 68.1049 138.212 68.1049C140.731 68.1049 141.765 67.3679 141.765 65.915ZM140.395 66.0762C140.395 66.7211 139.83 67.0435 138.688 67.0435H137.775C136.687 67.0435 136.27 66.6539 136.27 66.0896C136.268 65.9242 136.312 65.7614 136.397 65.6192C136.482 65.477 136.604 65.3609 136.75 65.2835H139.115C140.072 65.2835 140.398 65.5925 140.398 66.0762H140.395ZM138.205 61.8019C137.341 61.8019 136.848 61.4123 136.848 60.6196V60.3528C136.848 59.5601 137.345 59.1705 138.205 59.1705C139.065 59.1705 139.562 59.5601 139.562 60.3528V60.6215C139.562 61.418 139.065 61.8019 138.205 61.8019ZM148.747 65.2566V64.0609H148.008V60.5543C148.008 58.9958 147 58.1091 145.2 58.1091C144.678 58.0695 144.156 58.1754 143.691 58.4149C143.226 58.6545 142.837 59.0184 142.566 59.4661L143.44 60.2588C143.605 59.9626 143.848 59.7172 144.142 59.5494C144.437 59.3815 144.772 59.2976 145.11 59.3068C146.091 59.3068 146.55 59.8039 146.55 60.6503V61.2414H145.285C143.337 61.2414 142.303 61.9535 142.303 63.3373C142.289 63.6296 142.34 63.9213 142.451 64.1919C142.562 64.4625 142.731 64.7055 142.946 64.9039C143.161 65.1023 143.417 65.2513 143.696 65.3404C143.975 65.4295 144.269 65.4566 144.56 65.4198C145.001 65.4641 145.444 65.3563 145.815 65.1144C146.186 64.8725 146.464 64.511 146.602 64.0897H146.669C146.674 64.2495 146.711 64.4067 146.778 64.5521C146.845 64.6975 146.939 64.8283 147.057 64.9368C147.174 65.0453 147.312 65.1295 147.462 65.1844C147.613 65.2393 147.772 65.2638 147.932 65.2566H148.747ZM144.971 64.3027C144.246 64.3027 143.789 63.9803 143.789 63.3623V63.1204C143.789 62.5159 144.286 62.18 145.307 62.18H146.543V63.1876C146.548 63.8728 145.876 64.3027 144.976 64.3027H144.971ZM152.621 65.2566V64.0609H151.653V55.3146H150.186V63.8056C150.166 64.005 150.191 64.2063 150.26 64.3945C150.328 64.5827 150.438 64.753 150.582 64.8926C150.726 65.0322 150.899 65.1374 151.09 65.2005C151.28 65.2635 151.482 65.2827 151.68 65.2566H152.621ZM154.126 65.2566H157.444C159.835 65.2566 161.407 63.6982 161.407 60.5678C161.407 57.4374 159.835 55.8789 157.444 55.8789H154.126V65.2566ZM155.644 63.9131V57.2224H157.444C158.841 57.2224 159.782 58.1226 159.782 59.8135V61.3221C159.782 63.0149 158.841 63.9131 157.444 63.9131H155.644ZM165.935 65.4179C167.883 65.4179 169.146 63.9937 169.146 61.7635C169.146 59.5333 167.883 58.1091 165.935 58.1091C163.987 58.1091 162.724 59.5333 162.724 61.7635C162.724 63.9937 163.987 65.4179 165.935 65.4179ZM165.935 64.2087C164.941 64.2087 164.269 63.5907 164.269 62.3546V61.1723C164.269 59.9363 164.941 59.3183 165.935 59.3183C166.929 59.3183 167.601 59.9363 167.601 61.1723V62.3546C167.601 63.5907 166.929 64.2087 165.935 64.2087ZM173.472 65.4179C174.061 65.4564 174.646 65.3048 175.142 64.9855C175.638 64.6662 176.018 64.1961 176.226 63.6444L175.111 63.0494C174.999 63.3923 174.778 63.6896 174.483 63.8971C174.187 64.1046 173.833 64.2112 173.472 64.201C172.397 64.201 171.847 63.4621 171.847 62.3873V61.1397C171.847 60.0649 172.397 59.326 173.472 59.326C173.805 59.3039 174.135 59.3975 174.407 59.5909C174.679 59.7843 174.875 60.0657 174.963 60.3873L176.173 59.8231C175.965 59.2855 175.591 58.8284 175.105 58.5189C174.619 58.2094 174.047 58.0638 173.472 58.1034C171.457 58.1034 170.305 59.5275 170.305 61.7577C170.305 63.988 171.457 65.4179 173.472 65.4179ZM177.728 65.2566H179.179V58.0823H179.246L179.985 59.6004L182.041 63.3488L184.097 59.6004L184.835 58.0823H184.903V65.2566H186.354V55.8789H184.638L182.124 60.6503H182.047L179.534 55.8808H177.728V65.2566ZM193.998 65.2566V63.9131H190.183V55.8789H188.668V65.2566H193.998Z" fill="#1E49D8"/>
<path d="M465.558 56.781C467.708 56.781 468.957 55.6121 468.957 53.8655C468.957 52.3742 468.111 51.5412 466.243 51.1785L465.411 51.0038C464.403 50.8023 463.919 50.4664 463.919 49.6872C463.919 48.8676 464.537 48.4243 465.612 48.4243C466.034 48.4031 466.455 48.4864 466.837 48.6669C467.219 48.8474 467.55 49.1194 467.802 49.4588L468.863 48.5183C468.489 48.0428 468.006 47.6639 467.455 47.4134C466.904 47.163 466.301 47.0482 465.696 47.0788C463.706 47.0808 462.414 48.1018 462.414 49.7678C462.414 51.2591 463.341 52.1055 465.155 52.4414L465.988 52.5892C467.076 52.8041 467.453 53.2206 467.453 53.9461C467.453 54.8463 466.835 55.4374 465.639 55.4374C465.162 55.4432 464.69 55.3354 464.262 55.1228C463.835 54.9102 463.464 54.599 463.18 54.2148L462.132 55.1956C462.537 55.7127 463.058 56.1262 463.654 56.4018C464.25 56.6775 464.902 56.8074 465.558 56.781ZM474.909 56.6197H476.374V49.6334H474.909V54.3089C474.909 55.1284 474.17 55.518 473.418 55.518C472.518 55.518 472.074 54.9538 472.074 53.8924V49.6334H470.61V54.0805C470.61 55.8002 471.456 56.781 472.894 56.781C473.32 56.8119 473.745 56.6995 474.1 56.4617C474.456 56.2239 474.721 55.8742 474.855 55.4681H474.909V56.6197ZM479.934 56.6197V51.9309C479.944 51.7556 479.99 51.5842 480.069 51.4274C480.148 51.2706 480.258 51.1318 480.393 51.0196C480.528 50.9075 480.685 50.8243 480.854 50.7753C481.022 50.7264 481.199 50.7127 481.373 50.7351C482.237 50.7351 482.65 51.2725 482.65 52.3608V56.6197H484.114V51.9309C484.114 51.1247 484.799 50.7351 485.538 50.7351C486.425 50.7351 486.828 51.286 486.828 52.3608V56.6197H488.293V52.1861C488.293 50.4664 487.473 49.4722 486.085 49.4722C485.626 49.4463 485.171 49.5715 484.79 49.8287C484.409 50.0859 484.122 50.4609 483.974 50.8963H483.934C483.794 50.4639 483.516 50.0897 483.142 49.8321C482.767 49.5745 482.318 49.448 481.865 49.4722C481.452 49.4533 481.045 49.5725 480.707 49.8109C480.37 50.0494 480.121 50.3935 480.001 50.7889H479.934V49.6334H478.47V56.6197H479.934ZM491.784 56.6197V51.9309C491.794 51.7556 491.84 51.5842 491.919 51.4274C491.998 51.2706 492.108 51.1318 492.243 51.0196C492.378 50.9075 492.535 50.8243 492.704 50.7753C492.872 50.7264 493.049 50.7127 493.223 50.7351C494.087 50.7351 494.5 51.2725 494.5 52.3608V56.6197H495.964V51.9309C495.964 51.1247 496.649 50.7351 497.388 50.7351C498.275 50.7351 498.678 51.286 498.678 52.3608V56.6197H500.142V52.1861C500.142 50.4664 499.323 49.4722 497.935 49.4722C497.476 49.4463 497.021 49.5715 496.64 49.8287C496.258 50.0859 495.972 50.4609 495.824 50.8963H495.787C495.648 50.4639 495.37 50.0897 494.995 49.8321C494.621 49.5745 494.172 49.448 493.718 49.4722C493.305 49.4524 492.897 49.5712 492.559 49.8097C492.22 50.0482 491.971 50.3928 491.851 50.7889H491.784V49.6334H490.319V56.6197H491.784ZM504.91 56.781C505.465 56.8098 506.018 56.6954 506.516 56.4487C507.015 56.2019 507.441 55.8312 507.754 55.3722L506.891 54.5258C506.709 54.8516 506.441 55.1215 506.116 55.3062C505.792 55.4909 505.423 55.5834 505.05 55.5737C504.804 55.5927 504.556 55.5581 504.324 55.4724C504.092 55.3866 503.881 55.2516 503.706 55.0768C503.532 54.9019 503.397 54.6913 503.311 54.4593C503.225 54.2274 503.19 53.9796 503.209 53.7331V53.5047H508.008V52.9538C508.008 51.0192 506.96 49.4741 504.904 49.4741C502.916 49.4741 501.693 50.8983 501.693 53.1285C501.693 55.3587 502.922 56.781 504.91 56.781ZM504.91 50.6142C505.134 50.6141 505.356 50.662 505.56 50.7547C505.765 50.8474 505.947 50.9827 506.094 51.1516C506.242 51.3205 506.352 51.5191 506.416 51.7339C506.481 51.9488 506.499 52.175 506.468 52.3972V52.5316H503.217V52.4356C503.198 52.2024 503.227 51.9677 503.304 51.7465C503.38 51.5254 503.502 51.3226 503.661 51.1511C503.821 50.9797 504.014 50.8434 504.229 50.751C504.444 50.6585 504.676 50.6119 504.91 50.6142ZM518.748 56.6197V55.424H518.009V51.9174C518.009 50.3589 517.002 49.4722 515.201 49.4722C514.68 49.4326 514.158 49.5385 513.693 49.778C513.228 50.0176 512.838 50.3815 512.568 50.8292L513.441 51.6218C513.606 51.3264 513.848 51.0815 514.142 50.9137C514.435 50.7459 514.769 50.6616 515.107 50.6699C516.088 50.6699 516.547 51.167 516.547 52.0134V52.6045H515.282C513.334 52.6045 512.299 53.3166 512.299 54.7004C512.286 54.9927 512.337 55.2844 512.448 55.555C512.559 55.8256 512.728 56.0686 512.943 56.267C513.158 56.4654 513.414 56.6144 513.693 56.7035C513.971 56.7926 514.266 56.8197 514.556 56.7829C514.997 56.8272 515.44 56.7194 515.812 56.4775C516.183 56.2356 516.461 55.8741 516.599 55.4528H516.666C516.671 55.6125 516.708 55.7695 516.775 55.9147C516.841 56.06 516.936 56.1907 517.053 56.2992C517.17 56.4077 517.308 56.4919 517.458 56.5469C517.608 56.6019 517.767 56.6267 517.927 56.6197H518.748ZM514.973 55.6658C514.247 55.6658 513.791 55.3434 513.791 54.7254V54.4835C513.791 53.879 514.288 53.5431 515.309 53.5431H516.545V54.5507C516.545 55.2359 515.873 55.6658 514.973 55.6658ZM522.618 56.6197V55.424H521.65V46.6777H520.186V55.1687C520.166 55.3678 520.191 55.5688 520.259 55.7568C520.328 55.9448 520.438 56.1149 520.581 56.2544C520.724 56.3939 520.897 56.4992 521.087 56.5625C521.277 56.6258 521.479 56.6453 521.677 56.6197H522.618ZM526.366 56.6197V55.424H525.399V46.6777H523.934V55.1687C523.914 55.3678 523.939 55.5688 524.008 55.7568C524.076 55.9448 524.186 56.1149 524.329 56.2544C524.473 56.3939 524.646 56.4992 524.836 56.5625C525.025 56.6258 525.227 56.6453 525.425 56.6197H526.366ZM530.504 56.781C531.06 56.8103 531.614 56.6959 532.113 56.4488C532.612 56.2017 533.039 55.8302 533.352 55.3703L532.489 54.5238C532.306 54.8497 532.039 55.1195 531.714 55.3042C531.39 55.4889 531.021 55.5815 530.648 55.5718C530.401 55.5908 530.154 55.5562 529.922 55.4705C529.69 55.3847 529.479 55.2497 529.304 55.0749C529.129 54.9 528.994 54.6894 528.909 54.4574C528.823 54.2255 528.788 53.9777 528.807 53.7312V53.5028H533.606V52.9519C533.606 51.0173 532.558 49.4722 530.502 49.4722C528.514 49.4722 527.291 50.8963 527.291 53.1266C527.291 55.3568 528.516 56.781 530.504 56.781ZM530.504 50.6142C530.728 50.6141 530.95 50.662 531.154 50.7547C531.359 50.8474 531.541 50.9827 531.688 51.1516C531.836 51.3205 531.946 51.5191 532.01 51.7339C532.075 51.9488 532.093 52.175 532.062 52.3972V52.5316H528.811V52.4356C528.792 52.2024 528.821 51.9677 528.898 51.7465C528.974 51.5254 529.096 51.3226 529.255 51.1511C529.415 50.9797 529.608 50.8434 529.823 50.751C530.038 50.6585 530.27 50.6119 530.504 50.6142ZM536.698 56.6197V52.1593C536.698 51.4338 537.343 51.0441 538.498 51.0441H539.074V49.6334H538.684C538.258 49.601 537.834 49.7171 537.484 49.962C537.134 50.207 536.88 50.5656 536.765 50.977H536.698V49.6334H535.233V56.6197H536.698ZM464.269 70.1048H466.136L468.017 73.8935H469.71L467.681 69.9436C468.243 69.7922 468.733 69.4481 469.066 68.9716C469.4 68.4951 469.555 67.9165 469.504 67.3372C469.542 66.9667 469.498 66.5926 469.376 66.2407C469.254 65.8889 469.058 65.5677 468.799 65.2993C468.541 65.031 468.228 64.822 467.881 64.6867C467.534 64.5514 467.162 64.4931 466.79 64.5158H462.747V73.8935H464.269V70.1048ZM464.269 68.8285V65.8459H466.687C466.848 65.8257 467.011 65.8416 467.165 65.8924C467.318 65.9432 467.459 66.0276 467.576 66.1395C467.693 66.2515 467.784 66.3881 467.842 66.5395C467.899 66.6909 467.922 66.8533 467.909 67.0147V67.6558C467.922 67.8173 467.899 67.9796 467.842 68.131C467.784 68.2824 467.693 68.419 467.576 68.531C467.459 68.6429 467.318 68.7274 467.165 68.7782C467.011 68.829 466.848 68.8448 466.687 68.8246L464.269 68.8285ZM473.982 74.0548C474.538 74.0841 475.092 73.9697 475.591 73.7226C476.09 73.4755 476.517 73.1041 476.83 72.6441L475.967 71.7977C475.785 72.1235 475.517 72.3934 475.192 72.5781C474.868 72.7628 474.499 72.8553 474.126 72.8456C473.88 72.8646 473.632 72.83 473.4 72.7443C473.168 72.6585 472.957 72.5235 472.782 72.3487C472.608 72.1738 472.473 71.9632 472.387 71.7312C472.301 71.4993 472.266 71.2515 472.285 71.005V70.7766H477.084V70.2257C477.084 68.2911 476.036 66.746 473.98 66.746C471.992 66.746 470.769 68.1702 470.769 70.4004C470.769 72.6306 471.994 74.0548 473.982 74.0548ZM473.982 67.888C474.206 67.8879 474.428 67.9358 474.633 68.0285C474.837 68.1212 475.019 68.2566 475.167 68.4255C475.314 68.5944 475.424 68.7929 475.488 69.0077C475.553 69.2226 475.571 69.4488 475.541 69.6711V69.8054H472.289V69.7094C472.27 69.4762 472.299 69.2415 472.376 69.0203C472.452 68.7992 472.574 68.5964 472.734 68.425C472.893 68.2535 473.086 68.1172 473.301 68.0248C473.516 67.9323 473.748 67.8857 473.982 67.888ZM481.412 74.0548C482 74.0933 482.586 73.9417 483.081 73.6224C483.577 73.3031 483.958 72.833 484.166 72.2813L483.051 71.6863C482.938 72.0292 482.718 72.3265 482.422 72.534C482.127 72.7415 481.773 72.8481 481.412 72.8379C480.337 72.8379 479.786 72.099 479.786 71.0242V69.7766C479.786 68.7018 480.337 67.9629 481.412 67.9629C481.745 67.9421 482.075 68.0369 482.346 68.2314C482.617 68.4258 482.812 68.7079 482.899 69.03L484.108 68.4657C483.901 67.9281 483.527 67.4711 483.041 67.1616C482.555 66.8521 481.983 66.7064 481.408 66.746C479.393 66.746 478.241 68.1702 478.241 70.4004C478.241 72.6306 479.397 74.0548 481.412 74.0548ZM485.563 73.8935H487.026V69.2047C487.026 68.3986 487.778 68.0089 488.544 68.0089C489.444 68.0089 489.861 68.5598 489.861 69.6346V73.8935H491.325V69.4599C491.325 67.7402 490.479 66.746 489.055 66.746C488.628 66.7203 488.206 66.8352 487.851 67.0731C487.497 67.311 487.231 67.6586 487.093 68.0627H487.026V63.9515H485.563V73.8935ZM496.567 73.8935V72.6978H495.21V68.103H496.674V66.9073H495.21V64.9995H493.893V66.2221C493.893 66.7019 493.732 66.9073 493.248 66.9073H492.657V68.103H493.743V72.3754C493.722 72.5825 493.748 72.7916 493.819 72.9874C493.89 73.1832 494.003 73.3605 494.152 73.5063C494.301 73.6521 494.48 73.7626 494.677 73.8296C494.874 73.8967 495.084 73.9185 495.29 73.8935H496.567ZM500.476 74.0548C502.156 74.0548 503.244 73.1546 503.244 71.8111C503.244 70.6825 502.559 70.0108 501.027 69.7824L500.382 69.7018C499.643 69.5809 499.307 69.339 499.307 68.8016C499.307 68.2642 499.684 67.9283 500.49 67.9283C500.815 67.9278 501.136 67.9984 501.431 68.1354C501.726 68.2723 501.987 68.4722 502.196 68.721L503.096 67.8573C502.779 67.4811 502.378 67.1844 501.925 66.9908C501.473 66.7971 500.981 66.712 500.49 66.7422C498.954 66.7422 497.899 67.5349 497.899 68.8918C497.899 70.1816 498.772 70.7996 500.196 70.9743L500.841 71.0549C501.567 71.1509 501.835 71.4848 501.835 71.9282C501.835 72.5193 501.405 72.8686 500.559 72.8686C500.175 72.8686 499.797 72.779 499.453 72.6071C499.11 72.4352 498.812 72.1856 498.582 71.8783L497.642 72.742C497.973 73.1732 498.404 73.5178 498.898 73.7464C499.391 73.975 499.933 74.0808 500.476 74.0548ZM507.637 74.0548C508.193 74.0841 508.747 73.9697 509.246 73.7226C509.745 73.4755 510.172 73.1041 510.486 72.6441L509.622 71.7977C509.44 72.1235 509.172 72.3934 508.848 72.5781C508.523 72.7628 508.154 72.8553 507.781 72.8456C507.535 72.8646 507.287 72.83 507.055 72.7443C506.823 72.6585 506.612 72.5235 506.438 72.3487C506.263 72.1738 506.128 71.9632 506.042 71.7312C505.956 71.4993 505.922 71.2515 505.941 71.005V70.7766H510.739V70.2257C510.739 68.2911 509.691 66.746 507.635 66.746C505.647 66.746 504.424 68.1702 504.424 70.4004C504.424 72.6306 505.649 74.0548 507.637 74.0548ZM507.637 67.888C507.861 67.8882 508.083 67.9363 508.287 68.0291C508.491 68.1219 508.673 68.2573 508.82 68.4262C508.968 68.595 509.077 68.7935 509.142 69.0082C509.206 69.2229 509.224 69.4489 509.194 69.6711V69.8054H505.944V69.7094C505.925 69.4762 505.955 69.2415 506.031 69.0203C506.108 68.7992 506.229 68.5964 506.389 68.425C506.548 68.2535 506.741 68.1172 506.956 68.0248C507.171 67.9323 507.403 67.8857 507.637 67.888ZM515.577 73.8935V72.6978H514.221V68.103H515.685V66.9073H514.221V64.9995H512.904V66.2221C512.904 66.7019 512.743 66.9073 512.259 66.9073H511.668V68.103H512.756V72.3754C512.735 72.5823 512.761 72.7913 512.831 72.9869C512.902 73.1825 513.016 73.3597 513.164 73.5055C513.312 73.6512 513.492 73.7618 513.688 73.829C513.885 73.8961 514.095 73.9182 514.301 73.8935H515.577ZM522.282 73.8935V72.6978H518.385L522.188 68.0396V66.9073H516.827V68.103H520.454L516.706 72.7093V73.8935H522.282ZM528.045 73.8935H529.51V66.9073H528.045V71.5827C528.045 72.4022 527.306 72.7919 526.554 72.7919C525.654 72.7919 525.211 72.2276 525.211 71.1662V66.9073H523.746V71.3543C523.746 73.074 524.593 74.0548 526.03 74.0548C526.457 74.0857 526.881 73.9734 527.237 73.7355C527.592 73.4977 527.858 73.148 527.992 72.742H528.045V73.8935ZM533.07 73.8935V69.2181C533.07 68.3986 533.822 68.0089 534.588 68.0089C535.488 68.0089 535.905 68.5598 535.905 69.648V73.8935H537.369V69.4599C537.369 67.7402 536.523 66.746 535.099 66.746C534.673 66.7203 534.25 66.8352 533.896 67.0731C533.541 67.311 533.275 67.6586 533.137 68.0627H533.07V66.9111H531.606V73.8935H533.07ZM545.525 74.5519C545.525 73.3427 544.799 72.6172 543.079 72.6172H541.36C540.742 72.6172 540.379 72.4694 540.379 72.0932C540.379 71.7439 540.701 71.5174 541.051 71.3946C541.35 71.4682 541.656 71.5043 541.964 71.5021C543.738 71.5021 544.759 70.5482 544.759 69.1375C544.77 68.7643 544.687 68.3943 544.515 68.0627C544.343 67.7311 544.089 67.449 543.778 67.2431V66.961H545.202V65.7787H544.125C543.507 65.7787 543.212 66.1549 543.212 66.7729V66.9648C542.808 66.813 542.38 66.74 541.949 66.7499C540.175 66.7499 539.166 67.7172 539.166 69.1413C539.149 69.5739 539.262 70.0017 539.489 70.3701C539.716 70.7386 540.048 71.0311 540.442 71.2104V71.2641C539.77 71.4253 539.206 71.7746 539.206 72.5001C539.196 72.7427 539.269 72.9815 539.414 73.1769C539.558 73.3723 539.764 73.5127 539.999 73.5749V73.7227C539.666 73.7515 539.356 73.9068 539.134 74.1566C538.911 74.4065 538.793 74.7319 538.803 75.0662C538.803 76.1276 539.69 76.7456 541.97 76.7456C544.49 76.7418 545.525 76.0048 545.525 74.5519ZM544.154 74.7131C544.154 75.358 543.59 75.6804 542.448 75.6804H541.534C540.446 75.6804 540.03 75.2908 540.03 74.7265C540.028 74.5611 540.072 74.3983 540.156 74.2561C540.241 74.1139 540.363 73.9978 540.509 73.9204H542.878C543.832 73.9204 544.154 74.2294 544.154 74.7131ZM541.964 70.4388C541.101 70.4388 540.607 70.0492 540.607 69.2565V68.9878C540.607 68.1951 541.104 67.8055 541.964 67.8055C542.824 67.8055 543.321 68.1951 543.321 68.9878V69.2565C543.321 70.0549 542.824 70.4388 541.964 70.4388ZM548.828 74.0548C550.507 74.0548 551.595 73.1546 551.595 71.8111C551.595 70.6825 550.91 70.0108 549.379 69.7824L548.734 69.7018C547.995 69.5809 547.659 69.339 547.659 68.8016C547.659 68.2642 548.035 67.9283 548.841 67.9283C549.166 67.9278 549.487 67.9984 549.782 68.1354C550.077 68.2723 550.338 68.4722 550.547 68.721L551.448 67.8573C551.13 67.4811 550.729 67.1844 550.277 66.9908C549.824 66.7971 549.332 66.712 548.841 66.7422C547.306 66.7422 546.25 67.5349 546.25 68.8918C546.25 70.1816 547.123 70.7996 548.547 70.9743L549.192 71.0549C549.918 71.1509 550.187 71.4848 550.187 71.9282C550.187 72.5193 549.757 72.8686 548.91 72.8686C548.527 72.8683 548.149 72.7786 547.806 72.6067C547.463 72.4348 547.165 72.1854 546.935 71.8783L545.995 72.742C546.326 73.1729 546.757 73.5174 547.25 73.746C547.743 73.9746 548.285 74.0805 548.828 74.0548ZM555.384 74.0548C557.063 74.0548 558.152 73.1546 558.152 71.8111C558.152 70.6825 557.466 70.0108 555.935 69.7824L555.29 69.7018C554.551 69.5809 554.215 69.339 554.215 68.8016C554.215 68.2642 554.591 67.9283 555.397 67.9283C555.723 67.9278 556.044 67.9984 556.339 68.1354C556.633 68.2723 556.895 68.4722 557.104 68.721L558.004 67.8573C557.686 67.4811 557.285 67.1844 556.833 66.9908C556.38 66.7971 555.889 66.712 555.397 66.7422C553.862 66.7422 552.806 67.5349 552.806 68.8918C552.806 70.1816 553.68 70.7996 555.104 70.9743L555.749 71.0549C556.474 71.1509 556.743 71.4848 556.743 71.9282C556.743 72.5193 556.313 72.8686 555.467 72.8686C555.083 72.8683 554.705 72.7786 554.362 72.6067C554.019 72.4348 553.721 72.1854 553.492 71.8783L552.551 72.742C552.883 73.1732 553.314 73.5178 553.807 73.7464C554.301 73.975 554.843 74.0808 555.386 74.0548H555.384ZM562.507 71.0146L562.063 72.5328H561.996L561.591 71.0146L560.194 66.9034H558.731L561.271 74.1968L560.868 75.3791H559.685V76.5806H560.532C560.947 76.6421 561.371 76.541 561.713 76.2982C562.056 76.0555 562.292 75.6898 562.372 75.2774L565.315 66.9073H563.904L562.507 71.0146ZM568.66 74.0509C570.339 74.0509 571.428 73.1508 571.428 71.8073C571.428 70.6787 570.742 70.0069 569.211 69.7785L568.566 69.6979C567.827 69.577 567.491 69.3352 567.491 68.7978C567.491 68.2604 567.867 67.9245 568.673 67.9245C568.998 67.9239 569.32 67.9946 569.614 68.1316C569.909 68.2685 570.17 68.4684 570.38 68.7172L571.28 67.8535C570.962 67.4773 570.561 67.1805 570.109 66.9869C569.656 66.7933 569.165 66.7082 568.673 66.7384C567.138 66.7384 566.082 67.531 566.082 68.888C566.082 70.1778 566.956 70.7958 568.38 70.9704L569.025 71.051C569.75 71.147 570.019 71.481 570.019 71.9243C570.019 72.5155 569.589 72.8648 568.742 72.8648C568.359 72.864 567.98 72.7737 567.637 72.6011C567.295 72.4285 566.997 72.1784 566.767 71.8706L565.827 72.7343C566.158 73.1667 566.588 73.5126 567.081 73.7426C567.575 73.9725 568.116 74.0796 568.66 74.0548V74.0509ZM576.197 73.8935V72.6978H574.84V68.103H576.305V66.9073H574.84V64.9995H573.523V66.2221C573.523 66.7019 573.362 66.9073 572.879 66.9073H572.287V68.103H573.376V72.3754C573.355 72.5823 573.38 72.7913 573.451 72.9869C573.522 73.1825 573.635 73.3597 573.784 73.5055C573.932 73.6512 574.111 73.7618 574.308 73.829C574.505 73.8961 574.714 73.9182 574.921 73.8935H576.197ZM580.577 74.0548C581.133 74.0841 581.687 73.9697 582.186 73.7226C582.685 73.4755 583.112 73.1041 583.425 72.6441L582.562 71.7977C582.379 72.1235 582.112 72.3934 581.787 72.5781C581.463 72.7628 581.094 72.8553 580.721 72.8456C580.474 72.8646 580.227 72.83 579.995 72.7443C579.763 72.6585 579.552 72.5235 579.377 72.3487C579.202 72.1738 579.067 71.9632 578.982 71.7312C578.896 71.4993 578.861 71.2515 578.88 71.005V70.7766H583.679V70.2257C583.679 68.2911 582.631 66.746 580.575 66.746C578.587 66.746 577.364 68.1702 577.364 70.4004C577.364 72.6306 578.589 74.0548 580.577 74.0548ZM580.577 67.888C580.802 67.8878 581.024 67.9358 581.228 68.0287C581.433 68.1217 581.615 68.2574 581.763 68.4267C581.911 68.5961 582.02 68.7951 582.085 69.0104C582.149 69.2257 582.166 69.4523 582.135 69.6749V69.8093H578.884V69.7133C578.864 69.4798 578.893 69.2446 578.969 69.023C579.046 68.8014 579.167 68.5981 579.327 68.4263C579.486 68.2544 579.68 68.1178 579.895 68.0251C580.11 67.9324 580.343 67.8857 580.577 67.888ZM586.771 73.8935V69.2047C586.78 69.0294 586.826 68.858 586.905 68.7012C586.984 68.5445 587.095 68.4056 587.23 68.2935C587.365 68.1813 587.522 68.0981 587.69 68.0492C587.859 68.0002 588.036 67.9865 588.21 68.0089C589.074 68.0089 589.486 68.5463 589.486 69.6346V73.8935H590.951V69.2047C590.951 68.3986 591.636 68.0089 592.375 68.0089C593.262 68.0089 593.665 68.5598 593.665 69.6346V73.8935H595.129V69.4599C595.129 67.7402 594.31 66.746 592.922 66.746C592.463 66.7201 592.008 66.8453 591.626 67.1025C591.245 67.3597 590.959 67.7347 590.811 68.1702H590.77C590.631 67.7377 590.353 67.3635 589.978 67.1059C589.604 66.8483 589.155 66.7218 588.701 66.746C588.288 66.7263 587.88 66.845 587.541 67.0835C587.203 67.322 586.954 67.6666 586.834 68.0627H586.767V66.9111H585.302V73.8935H586.771ZM599.897 74.0548C600.453 74.0841 601.007 73.9697 601.506 73.7226C602.005 73.4755 602.431 73.1041 602.745 72.6441L601.881 71.7977C601.699 72.1235 601.431 72.3934 601.107 72.5781C600.783 72.7628 600.414 72.8553 600.041 72.8456C599.794 72.8646 599.546 72.83 599.314 72.7443C599.082 72.6585 598.872 72.5235 598.697 72.3487C598.522 72.1738 598.387 71.9632 598.301 71.7312C598.216 71.4993 598.181 71.2515 598.2 71.005V70.7766H602.998V70.2257C602.998 68.2911 601.95 66.746 599.895 66.746C597.906 66.746 596.684 68.1702 596.684 70.4004C596.684 72.6306 597.908 74.0548 599.897 74.0548ZM599.897 67.888C600.121 67.8879 600.343 67.9358 600.547 68.0285C600.751 68.1212 600.933 68.2566 601.081 68.4255C601.229 68.5944 601.338 68.7929 601.403 69.0077C601.468 69.2226 601.485 69.4488 601.455 69.6711V69.8054H598.204V69.7094C598.185 69.4762 598.214 69.2415 598.291 69.0203C598.367 68.7992 598.489 68.5964 598.648 68.425C598.807 68.2535 599.001 68.1172 599.216 68.0248C599.431 67.9323 599.663 67.8857 599.897 67.888Z" fill="#1E49D8"/>
<path d="M462.746 207.286H466.068C468.46 207.286 470.032 205.727 470.032 202.597C470.032 199.466 468.46 197.908 466.068 197.908H462.746V207.286ZM464.264 205.942V199.252H466.068C467.466 199.252 468.406 200.152 468.406 201.843V203.351C468.406 205.044 467.466 205.942 466.068 205.942H464.264ZM474.559 207.447C475.115 207.476 475.67 207.362 476.168 207.115C476.667 206.868 477.094 206.496 477.408 206.036L476.544 205.19C476.362 205.516 476.094 205.786 475.77 205.97C475.445 206.155 475.077 206.248 474.703 206.238C474.457 206.257 474.209 206.222 473.977 206.136C473.745 206.051 473.535 205.916 473.36 205.741C473.185 205.566 473.05 205.355 472.964 205.123C472.878 204.892 472.844 204.644 472.863 204.397V204.169H477.661V203.618C477.661 201.683 476.613 200.138 474.558 200.138C472.569 200.138 471.347 201.562 471.347 203.793C471.347 206.023 472.571 207.447 474.559 207.447ZM474.559 201.28C474.784 201.28 475.006 201.328 475.21 201.421C475.414 201.513 475.596 201.649 475.744 201.818C475.891 201.987 476.001 202.185 476.066 202.4C476.13 202.615 476.148 202.841 476.118 203.063V203.198H472.867V203.102C472.847 202.868 472.877 202.634 472.953 202.413C473.03 202.191 473.152 201.989 473.311 201.817C473.47 201.646 473.664 201.509 473.879 201.417C474.094 201.325 474.325 201.278 474.559 201.28ZM483.521 207.286H484.985V200.299H483.521V204.975C483.521 205.794 482.782 206.184 482.029 206.184C481.129 206.184 480.686 205.62 480.686 204.558V200.299H479.221V204.747C479.221 206.466 480.068 207.447 481.505 207.447C481.932 207.478 482.357 207.366 482.712 207.128C483.067 206.89 483.333 206.54 483.467 206.134H483.521V207.286ZM490.288 207.286V206.09H488.935V201.495H490.4V200.299H488.935V198.392H487.618V199.614C487.618 200.094 487.457 200.299 486.974 200.299H486.382V201.495H487.471V205.768C487.45 205.974 487.475 206.183 487.546 206.379C487.617 206.575 487.73 206.752 487.879 206.898C488.027 207.043 488.206 207.154 488.403 207.221C488.6 207.288 488.809 207.31 489.016 207.286H490.288ZM494.198 207.447C495.877 207.447 496.966 206.547 496.966 205.203C496.966 204.075 496.28 203.403 494.749 203.175L494.104 203.094C493.365 202.973 493.029 202.731 493.029 202.194C493.029 201.656 493.405 201.321 494.211 201.321C494.536 201.32 494.858 201.391 495.152 201.528C495.447 201.665 495.708 201.864 495.918 202.113L496.818 201.25C496.5 200.873 496.099 200.577 495.647 200.383C495.194 200.189 494.703 200.104 494.211 200.134C492.676 200.134 491.62 200.927 491.62 202.284C491.62 203.574 492.494 204.192 493.918 204.366L494.563 204.447C495.288 204.543 495.557 204.877 495.557 205.32C495.557 205.912 495.127 206.261 494.28 206.261C493.897 206.261 493.518 206.171 493.175 205.999C492.832 205.827 492.533 205.578 492.304 205.27L491.363 206.134C491.695 206.566 492.127 206.911 492.621 207.14C493.115 207.368 493.658 207.474 494.202 207.447H494.198ZM501.319 207.447C501.907 207.485 502.492 207.334 502.988 207.015C503.484 206.695 503.864 206.225 504.073 205.674L502.961 205.079C502.849 205.421 502.628 205.719 502.333 205.926C502.038 206.134 501.683 206.24 501.322 206.23C500.248 206.23 499.697 205.491 499.697 204.416V203.169C499.697 202.094 500.248 201.355 501.322 201.355C501.655 201.333 501.985 201.427 502.257 201.62C502.529 201.813 502.725 202.095 502.814 202.416L504.023 201.852C503.815 201.316 503.441 200.86 502.955 200.552C502.47 200.244 501.898 200.099 501.324 200.138C499.309 200.138 498.157 201.562 498.157 203.793C498.157 206.023 499.309 207.447 501.324 207.447H501.319ZM505.474 207.286H506.938V202.597C506.938 201.791 507.691 201.401 508.456 201.401C509.357 201.401 509.773 201.952 509.773 203.027V207.286H511.238V202.852C511.238 201.132 510.391 200.138 508.967 200.138C508.541 200.113 508.118 200.227 507.764 200.465C507.409 200.703 507.143 201.051 507.005 201.455H506.938V197.344H505.474V207.286ZM516.007 207.447C516.563 207.476 517.117 207.362 517.616 207.115C518.115 206.868 518.542 206.496 518.855 206.036L517.992 205.19C517.809 205.516 517.542 205.786 517.217 205.97C516.893 206.155 516.524 206.248 516.151 206.238C515.904 206.257 515.657 206.222 515.425 206.136C515.193 206.051 514.982 205.916 514.807 205.741C514.632 205.566 514.497 205.355 514.412 205.123C514.326 204.892 514.291 204.644 514.31 204.397V204.169H519.109V203.618C519.109 201.683 518.061 200.138 516.005 200.138C514.017 200.138 512.794 201.562 512.794 203.793C512.794 206.023 514.019 207.447 516.007 207.447ZM516.007 201.28C516.231 201.28 516.453 201.328 516.657 201.421C516.862 201.513 517.044 201.649 517.191 201.818C517.339 201.987 517.449 202.185 517.513 202.4C517.578 202.615 517.596 202.841 517.566 203.063V203.198H514.314V203.102C514.295 202.868 514.324 202.634 514.401 202.413C514.477 202.191 514.599 201.989 514.758 201.817C514.918 201.646 515.111 201.509 515.326 201.417C515.541 201.325 515.773 201.278 516.007 201.28ZM462.746 224.56H467.314C467.652 224.546 467.984 224.465 468.29 224.321C468.596 224.177 468.869 223.973 469.095 223.721C469.321 223.469 469.493 223.175 469.603 222.855C469.712 222.535 469.756 222.196 469.732 221.859C469.75 221.586 469.713 221.312 469.623 221.054C469.534 220.795 469.394 220.557 469.212 220.353C469.03 220.149 468.809 219.983 468.562 219.865C468.316 219.747 468.048 219.679 467.775 219.665V219.589C468.015 219.571 468.248 219.505 468.462 219.395C468.675 219.284 468.864 219.131 469.016 218.945C469.168 218.758 469.281 218.543 469.347 218.312C469.413 218.081 469.431 217.839 469.4 217.6C469.42 217.271 469.368 216.941 469.248 216.634C469.128 216.327 468.944 216.049 468.707 215.819C468.47 215.59 468.187 215.414 467.876 215.304C467.565 215.194 467.234 215.152 466.905 215.182H462.746V224.56ZM464.264 220.408H466.873C467.038 220.387 467.205 220.404 467.363 220.455C467.522 220.507 467.666 220.593 467.787 220.708C467.908 220.822 468.002 220.962 468.063 221.116C468.123 221.271 468.149 221.438 468.137 221.604V222.064C468.148 222.23 468.122 222.396 468.061 222.551C468.001 222.705 467.906 222.844 467.786 222.958C467.665 223.072 467.52 223.158 467.362 223.209C467.205 223.261 467.037 223.277 466.873 223.256H464.268L464.264 220.408ZM464.264 216.485H466.615C466.769 216.466 466.926 216.481 467.073 216.53C467.221 216.578 467.356 216.658 467.469 216.765C467.581 216.871 467.669 217.001 467.726 217.146C467.783 217.29 467.808 217.445 467.798 217.6V218.034C467.808 218.189 467.783 218.344 467.726 218.488C467.669 218.633 467.581 218.763 467.469 218.869C467.356 218.976 467.221 219.056 467.073 219.104C466.926 219.153 466.769 219.168 466.615 219.149H464.268L464.264 216.485ZM475.728 224.56H477.193V217.573H475.728V222.249C475.728 223.068 474.989 223.458 474.237 223.458C473.337 223.458 472.893 222.894 472.893 221.832V217.573H471.429V222.02C471.429 223.74 472.275 224.721 473.713 224.721C474.14 224.752 474.564 224.639 474.919 224.402C475.275 224.164 475.541 223.814 475.675 223.408H475.728V224.56ZM480.753 224.56V219.884C480.753 219.065 481.505 218.675 482.271 218.675C483.171 218.675 483.588 219.226 483.588 220.314V224.56H485.052V220.126C485.052 218.406 484.206 217.412 482.782 217.412C482.356 217.386 481.933 217.501 481.579 217.739C481.224 217.977 480.958 218.325 480.82 218.729H480.753V217.577H479.289V224.56H480.753ZM491.474 224.56H492.939V214.618H491.474V218.729H491.407C491.265 218.327 490.998 217.983 490.645 217.745C490.291 217.508 489.871 217.391 489.446 217.412C487.686 217.412 486.663 218.769 486.663 221.066C486.663 223.364 487.684 224.721 489.446 224.721C489.87 224.739 490.289 224.622 490.641 224.386C490.994 224.149 491.262 223.807 491.407 223.408H491.474V224.56ZM489.889 223.458C489.657 223.465 489.427 223.422 489.213 223.333C488.999 223.245 488.806 223.111 488.647 222.942C488.489 222.773 488.367 222.573 488.292 222.354C488.217 222.134 488.188 221.902 488.21 221.671V220.462C488.188 220.231 488.217 219.998 488.292 219.779C488.367 219.56 488.489 219.359 488.647 219.191C488.806 219.022 488.999 218.888 489.213 218.799C489.427 218.711 489.657 218.668 489.889 218.675C490.776 218.675 491.474 219.155 491.474 219.871V222.262C491.474 222.974 490.776 223.458 489.889 223.458ZM497.774 224.721C498.33 224.751 498.884 224.637 499.383 224.39C499.883 224.143 500.31 223.772 500.624 223.312L499.76 222.466C499.578 222.791 499.31 223.061 498.986 223.246C498.661 223.431 498.293 223.523 497.919 223.514C497.673 223.533 497.425 223.498 497.193 223.412C496.961 223.326 496.751 223.191 496.576 223.017C496.401 222.842 496.266 222.631 496.18 222.399C496.094 222.167 496.06 221.92 496.079 221.673V221.445H500.877V220.894C500.877 218.959 499.829 217.414 497.774 217.414C495.785 217.414 494.563 218.838 494.563 221.068C494.563 223.299 495.787 224.721 497.774 224.721ZM497.774 218.554C497.998 218.554 498.22 218.601 498.425 218.694C498.629 218.787 498.811 218.922 498.959 219.091C499.107 219.26 499.217 219.458 499.282 219.673C499.346 219.888 499.364 220.115 499.334 220.337V220.471H496.083V220.375C496.063 220.142 496.093 219.908 496.169 219.687C496.245 219.466 496.367 219.263 496.526 219.092C496.685 218.92 496.878 218.784 497.093 218.691C497.308 218.599 497.54 218.552 497.774 218.554ZM504.72 224.721C506.399 224.721 507.487 223.821 507.487 222.477C507.487 221.349 506.802 220.677 505.27 220.448L504.625 220.368C503.887 220.247 503.551 220.005 503.551 219.468C503.551 218.93 503.927 218.594 504.733 218.594C505.058 218.594 505.379 218.664 505.674 218.801C505.969 218.938 506.23 219.138 506.439 219.387L507.339 218.523C507.022 218.147 506.621 217.85 506.168 217.657C505.716 217.463 505.224 217.378 504.733 217.408C503.198 217.408 502.142 218.201 502.142 219.558C502.142 220.848 503.015 221.466 504.439 221.64L505.084 221.721C505.81 221.817 506.078 222.151 506.078 222.594C506.078 223.185 505.648 223.535 504.802 223.535C504.419 223.534 504.04 223.445 503.698 223.273C503.355 223.101 503.057 222.851 502.827 222.544L501.887 223.408C502.218 223.839 502.649 224.184 503.143 224.412C503.636 224.641 504.178 224.747 504.721 224.721H504.72ZM510.606 224.56V220.099C510.606 219.374 511.251 218.984 512.406 218.984H512.982V217.573H512.593C512.167 217.541 511.743 217.657 511.393 217.902C511.043 218.147 510.789 218.505 510.673 218.917H510.606V217.573H509.142V224.56H510.606ZM516.961 224.721C517.517 224.75 518.071 224.636 518.57 224.389C519.069 224.142 519.496 223.77 519.809 223.31L518.945 222.464C518.763 222.79 518.496 223.059 518.171 223.244C517.847 223.429 517.478 223.521 517.105 223.512C516.859 223.53 516.611 223.495 516.38 223.409C516.148 223.323 515.938 223.188 515.764 223.013C515.589 222.838 515.455 222.628 515.369 222.396C515.284 222.165 515.249 221.917 515.268 221.671V221.443H520.066V220.892C520.066 218.957 519.018 217.412 516.963 217.412C514.974 217.412 513.752 218.836 513.752 221.066C513.752 223.297 514.973 224.721 516.961 224.721ZM516.961 218.554C517.185 218.554 517.407 218.602 517.611 218.695C517.816 218.787 517.998 218.923 518.145 219.091C518.293 219.26 518.403 219.459 518.467 219.674C518.532 219.889 518.55 220.115 518.519 220.337V220.471H515.268V220.375C515.249 220.142 515.278 219.908 515.355 219.686C515.431 219.465 515.553 219.262 515.712 219.091C515.872 218.92 516.065 218.783 516.28 218.691C516.495 218.598 516.727 218.552 516.961 218.554ZM524.391 224.721C524.979 224.759 525.564 224.608 526.06 224.288C526.556 223.969 526.936 223.499 527.145 222.947L526.03 222.352C525.917 222.695 525.697 222.993 525.401 223.2C525.106 223.408 524.751 223.514 524.391 223.504C523.316 223.504 522.765 222.765 522.765 221.69V220.443C522.765 219.368 523.316 218.629 524.391 218.629C524.723 218.607 525.054 218.7 525.325 218.894C525.597 219.087 525.794 219.369 525.882 219.69L527.091 219.126C526.884 218.588 526.51 218.131 526.024 217.822C525.538 217.512 524.965 217.367 524.391 217.406C522.375 217.406 521.224 218.83 521.224 221.061C521.224 223.291 522.375 224.721 524.391 224.721ZM528.542 224.56H530.006V219.871C530.006 219.065 530.759 218.675 531.525 218.675C532.425 218.675 532.841 219.226 532.841 220.301V224.56H534.306V220.126C534.306 218.406 533.459 217.412 532.035 217.412C531.609 217.386 531.186 217.501 530.832 217.739C530.478 217.977 530.211 218.325 530.074 218.729H530.006V214.618H528.542V224.56ZM539.545 224.56V223.364H538.189V218.769H539.653V217.573H538.189V215.665H536.872V216.888C536.872 217.368 536.711 217.573 536.227 217.573H535.636V218.769H536.724V223.041C536.703 223.248 536.729 223.458 536.8 223.653C536.87 223.849 536.984 224.027 537.133 224.172C537.281 224.318 537.461 224.429 537.658 224.496C537.855 224.563 538.064 224.585 538.271 224.56H539.545ZM543.455 224.721C545.135 224.721 546.223 223.821 546.223 222.477C546.223 221.349 545.538 220.677 544.006 220.448L543.361 220.368C542.622 220.247 542.286 220.005 542.286 219.468C542.286 218.93 542.662 218.594 543.469 218.594C543.794 218.594 544.115 218.664 544.41 218.801C544.704 218.938 544.966 219.138 545.175 219.387L546.075 218.523C545.758 218.147 545.357 217.85 544.904 217.657C544.451 217.463 543.96 217.378 543.469 217.408C541.933 217.408 540.877 218.201 540.877 219.558C540.877 220.848 541.751 221.466 543.175 221.64L543.82 221.721C544.545 221.817 544.814 222.151 544.814 222.594C544.814 223.185 544.384 223.535 543.538 223.535C543.154 223.535 542.775 223.445 542.432 223.273C542.089 223.101 541.791 222.852 541.561 222.544L540.62 223.408C540.952 223.839 541.382 224.183 541.876 224.412C542.369 224.641 542.91 224.747 543.453 224.721H543.455ZM550.616 224.721C551.172 224.75 551.726 224.636 552.225 224.389C552.724 224.142 553.151 223.77 553.464 223.31L552.601 222.464C552.418 222.79 552.151 223.059 551.826 223.244C551.502 223.429 551.133 223.521 550.76 223.512C550.514 223.53 550.266 223.495 550.035 223.409C549.803 223.323 549.593 223.188 549.419 223.013C549.244 222.838 549.11 222.628 549.024 222.396C548.939 222.165 548.904 221.917 548.923 221.671V221.443H553.722V220.892C553.722 218.957 552.674 217.412 550.618 217.412C548.63 217.412 547.407 218.836 547.407 221.066C547.407 223.297 548.628 224.721 550.616 224.721ZM550.616 218.554C550.84 218.554 551.062 218.602 551.266 218.695C551.471 218.787 551.653 218.923 551.8 219.091C551.948 219.26 552.058 219.459 552.122 219.674C552.187 219.889 552.205 220.115 552.175 220.337V220.471H548.923V220.375C548.904 220.142 548.933 219.908 549.01 219.686C549.086 219.465 549.208 219.262 549.367 219.091C549.527 218.92 549.72 218.783 549.935 218.691C550.15 218.598 550.382 218.552 550.616 218.554ZM558.556 224.56V223.364H557.199V218.769H558.664V217.573H557.199V215.665H555.883V216.888C555.883 217.368 555.721 217.573 555.238 217.573H554.647V218.769H555.737V223.041C555.716 223.248 555.742 223.457 555.812 223.652C555.883 223.848 555.996 224.025 556.144 224.171C556.292 224.316 556.471 224.427 556.668 224.494C556.864 224.562 557.074 224.584 557.28 224.56H558.556ZM565.26 224.56V223.364H561.364L565.166 218.702V217.573H559.806V218.769H563.433L559.685 223.375V224.56H565.26ZM571.024 224.56H572.489V217.573H571.024V222.249C571.024 223.068 570.285 223.458 569.533 223.458C568.633 223.458 568.189 222.894 568.189 221.832V217.573H566.725V222.02C566.725 223.74 567.571 224.721 569.009 224.721C569.436 224.752 569.861 224.639 570.216 224.4C570.572 224.161 570.837 223.811 570.97 223.404H571.024V224.56ZM576.049 224.56V219.884C576.049 219.065 576.801 218.675 577.567 218.675C578.467 218.675 578.884 219.226 578.884 220.314V224.56H580.348V220.126C580.348 218.406 579.502 217.412 578.078 217.412C577.652 217.386 577.229 217.501 576.874 217.739C576.52 217.977 576.254 218.325 576.116 218.729H576.049V217.577H574.584V224.56H576.049ZM588.503 225.218C588.503 224.009 587.778 223.283 586.058 223.283H584.335C583.717 223.283 583.354 223.135 583.354 222.759C583.354 222.41 583.676 222.183 584.026 222.061C584.324 222.134 584.631 222.17 584.939 222.168C586.713 222.168 587.734 221.214 587.734 219.804C587.745 219.43 587.661 219.06 587.49 218.729C587.318 218.397 587.064 218.115 586.753 217.909V217.627H588.177V216.445H587.102C586.484 216.445 586.189 216.821 586.189 217.439V217.631C585.785 217.479 585.357 217.406 584.926 217.416C583.152 217.416 582.143 218.383 582.143 219.807C582.126 220.24 582.239 220.668 582.466 221.036C582.693 221.405 583.025 221.697 583.419 221.876V221.93C582.747 222.091 582.183 222.441 582.183 223.166C582.173 223.409 582.246 223.647 582.39 223.843C582.535 224.038 582.741 224.179 582.976 224.241V224.389C582.642 224.418 582.333 224.573 582.111 224.823C581.888 225.072 581.77 225.398 581.78 225.732C581.78 226.794 582.667 227.412 584.947 227.412C587.469 227.408 588.503 226.671 588.503 225.218ZM587.133 225.379C587.133 226.024 586.569 226.346 585.427 226.346H584.513C583.425 226.346 583.008 225.957 583.008 225.393C583.007 225.227 583.05 225.064 583.135 224.922C583.22 224.78 583.342 224.664 583.488 224.586H585.853C586.81 224.586 587.133 224.895 587.133 225.379ZM584.943 221.105C584.079 221.105 583.586 220.715 583.586 219.923V219.654C583.586 218.861 584.083 218.472 584.943 218.472C585.803 218.472 586.3 218.861 586.3 219.654V219.923C586.3 220.721 585.803 221.105 584.943 221.105Z" fill="#1E49D8"/>
<path d="M446.72 61.1781H279.74C279.549 61.1781 279.366 61.1023 279.231 60.9673C279.096 60.8323 279.02 60.6492 279.02 60.4583C279.02 60.2675 279.096 60.0844 279.231 59.9494C279.366 59.8144 279.549 59.7386 279.74 59.7386H446.72C446.911 59.7386 447.094 59.8144 447.229 59.9494C447.364 60.0844 447.44 60.2675 447.44 60.4583C447.44 60.6492 447.364 60.8323 447.229 60.9673C447.094 61.1023 446.911 61.1781 446.72 61.1781Z" fill="#1E49D8"/>
<path d="M447.2 211.844H259.107C258.917 211.844 258.733 211.768 258.599 211.633C258.464 211.498 258.388 211.315 258.388 211.124C258.388 210.933 258.464 210.75 258.599 210.615C258.733 210.48 258.917 210.405 259.107 210.405H447.2C447.391 210.405 447.574 210.48 447.709 210.615C447.844 210.75 447.92 210.933 447.92 211.124C447.92 211.315 447.844 211.498 447.709 211.633C447.574 211.768 447.391 211.844 447.2 211.844Z" fill="#1E49D8"/>
</g>
<defs>
<clipPath id="clip0_3500_1309">
<rect width="603" height="312.848" fill="white"/>
</clipPath>
</defs>
</svg>
