<svg width="60" height="61" viewBox="0 0 60 61" fill="none" xmlns="http://www.w3.org/2000/svg">
<path d="M29.9439 59.9457C46.3058 59.9457 59.5698 46.6817 59.5698 30.3197C59.5698 13.9577 46.3058 0.693726 29.9439 0.693726C13.5819 0.693726 0.317871 13.9577 0.317871 30.3197C0.317871 46.6817 13.5819 59.9457 29.9439 59.9457Z" fill="white"/>
<path d="M29.9439 0.307673C36.8678 0.311949 43.5774 2.7095 48.936 7.09418C54.2947 11.4789 57.9729 17.5811 59.3476 24.3671C60.7223 31.1532 59.7091 38.2058 56.4794 44.3303C53.2497 50.4548 48.0023 55.2747 41.626 57.9733C34.2965 61.0459 26.0477 61.0867 18.6881 58.0867C11.3286 55.0868 5.45899 49.2909 2.36627 41.9698C-0.726454 34.6488 -0.78989 26.4001 2.18987 19.0324C5.16963 11.6646 10.9494 5.77913 18.2619 2.66632C21.9576 1.10217 25.9309 0.299941 29.9439 0.307673ZM29.9439 59.5596C36.6899 59.556 43.2272 57.2205 48.4483 52.9488C53.6695 48.6772 57.2535 42.7319 58.5932 36.1204C59.9329 29.5088 58.9458 22.6374 55.7993 16.6702C52.6528 10.703 47.5403 6.00696 41.3279 3.37762C34.1865 0.382253 26.1488 0.341345 18.9774 3.26387C11.8059 6.1864 6.08626 11.8338 3.07277 18.9675C0.0592772 26.1011 -0.00203597 34.1388 2.90227 41.3176C5.80658 48.4964 11.4394 54.2304 18.5654 57.262C22.1651 58.7854 26.0352 59.5669 29.9439 59.5596Z" fill="#0032D9"/>
<path d="M20.5212 43.9827C20.4805 43.9826 20.4401 43.9761 20.4015 43.9634L11.0233 40.8973C10.9461 40.8722 10.8788 40.8233 10.831 40.7577C10.7832 40.6922 10.7572 40.6132 10.7568 40.532V29.325C10.7569 29.264 10.7714 29.2039 10.7991 29.1497C10.8268 29.0954 10.867 29.0484 10.9163 29.0126C10.9656 28.9769 11.0227 28.9533 11.083 28.9438C11.1432 28.9343 11.2048 28.9392 11.2627 28.9581L20.6425 32.0234C20.7199 32.0487 20.7873 32.0977 20.8352 32.1636C20.8831 32.2295 20.9089 32.3088 20.9089 32.3903V43.5966C20.9089 43.699 20.8682 43.7972 20.7958 43.8696C20.7234 43.942 20.6252 43.9827 20.5228 43.9827H20.5212ZM11.5292 40.2501L20.1351 43.0637V32.6706L11.5292 29.8571V40.2501Z" fill="#0032D9"/>
<path d="M11.1429 29.711C11.0614 29.7109 10.982 29.685 10.9161 29.637C10.8502 29.589 10.8011 29.5214 10.776 29.4438C10.7602 29.3956 10.7541 29.3447 10.758 29.2941C10.7618 29.2435 10.7756 29.1942 10.7986 29.1489C10.8215 29.1036 10.8532 29.0634 10.8917 29.0303C10.9303 28.9973 10.9749 28.9722 11.0232 28.9565L17.9825 26.6828C18.0307 26.667 18.0816 26.6608 18.1322 26.6647C18.1828 26.6686 18.2321 26.6824 18.2774 26.7053C18.3226 26.7283 18.3629 26.7599 18.396 26.7985C18.429 26.837 18.4541 26.8817 18.4698 26.9299C18.4856 26.9781 18.4918 27.029 18.4879 27.0796C18.484 27.1302 18.4702 27.1795 18.4473 27.2248C18.4243 27.2701 18.3927 27.3104 18.3541 27.3434C18.3156 27.3764 18.2709 27.4015 18.2227 27.4172L11.2626 29.6917C11.224 29.7044 11.1836 29.7109 11.1429 29.711Z" fill="#0032D9"/>
<path d="M20.5234 43.9827C20.4209 43.9827 20.3227 43.942 20.2503 43.8696C20.1779 43.7972 20.1372 43.699 20.1372 43.5966V32.391C20.1373 32.3096 20.1631 32.2303 20.2109 32.1644C20.2588 32.0985 20.3262 32.0494 20.4037 32.0242L29.7819 28.9581C29.8398 28.9392 29.9014 28.9343 29.9616 28.9438C30.0218 28.9533 30.0789 28.9769 30.1283 29.0126C30.1776 29.0484 30.2178 29.0954 30.2455 29.1497C30.2732 29.2039 30.2877 29.264 30.2877 29.325V40.532C30.2877 40.6134 30.2619 40.6928 30.214 40.7587C30.1662 40.8246 30.0987 40.8736 30.0213 40.8989L20.6431 43.965C20.6044 43.9771 20.564 43.9831 20.5234 43.9827ZM20.9095 32.6706V43.0637L29.5131 40.2501V29.8571L20.9095 32.6706Z" fill="#0032D9"/>
<path d="M39.2787 43.9827C39.1763 43.9827 39.0781 43.942 39.0057 43.8696C38.9333 43.7972 38.8926 43.699 38.8926 43.5966V32.391C38.8926 32.3096 38.9184 32.2303 38.9663 32.1644C39.0141 32.0985 39.0816 32.0494 39.159 32.0242L48.5372 28.9581C48.5952 28.9392 48.6568 28.9343 48.717 28.9438C48.7772 28.9533 48.8343 28.9769 48.8837 29.0126C48.933 29.0484 48.9732 29.0954 49.0009 29.1497C49.0286 29.2039 49.0431 29.264 49.0431 29.325V40.532C49.0431 40.6134 49.0173 40.6928 48.9694 40.7587C48.9215 40.8246 48.8541 40.8736 48.7767 40.8989L39.3984 43.965C39.3597 43.9771 39.3193 43.9831 39.2787 43.9827ZM39.6649 32.6706V43.0637L48.2708 40.2501V29.8571L39.6649 32.6706Z" fill="#0032D9"/>
<path d="M48.6572 29.7111C48.6165 29.711 48.5761 29.7044 48.5375 29.6917L41.5774 27.4165C41.5291 27.4008 41.4845 27.3757 41.4459 27.3426C41.4074 27.3096 41.3757 27.2693 41.3528 27.2241C41.3298 27.1788 41.316 27.1295 41.3122 27.0789C41.3083 27.0283 41.3144 26.9774 41.3302 26.9292C41.346 26.8809 41.3711 26.8363 41.4041 26.7977C41.4371 26.7592 41.4774 26.7276 41.5227 26.7046C41.5679 26.6816 41.6173 26.6678 41.6679 26.664C41.7185 26.6601 41.7693 26.6662 41.8176 26.682L48.7769 28.958C48.8641 28.9867 48.9382 29.0455 48.986 29.1238C49.0338 29.2021 49.0521 29.2949 49.0377 29.3855C49.0233 29.4761 48.9771 29.5587 48.9073 29.6183C48.8376 29.678 48.7489 29.7108 48.6572 29.7111Z" fill="#0032D9"/>
<path d="M39.278 43.9827C39.2374 43.9826 39.197 43.9761 39.1583 43.9634L29.7801 40.8973C29.7029 40.8722 29.6357 40.8233 29.5878 40.7577C29.54 40.6922 29.5141 40.6132 29.5137 40.532V29.325C29.5137 29.264 29.5282 29.2039 29.5559 29.1497C29.5836 29.0954 29.6238 29.0484 29.6731 29.0126C29.7225 28.9769 29.7796 28.9533 29.8398 28.9438C29.9 28.9343 29.9616 28.9392 30.0195 28.9581L39.3978 32.0242C39.4752 32.0494 39.5426 32.0985 39.5905 32.1644C39.6383 32.2303 39.6641 32.3096 39.6642 32.391V43.5966C39.6642 43.699 39.6235 43.7972 39.5511 43.8696C39.4787 43.942 39.3805 43.9827 39.278 43.9827ZM30.286 40.2501L38.8919 43.0637V32.6706L30.286 29.8571V40.2501Z" fill="#0032D9"/>
<path d="M29.8998 29.7115C29.7974 29.7115 29.6992 29.6708 29.6268 29.5984C29.5544 29.526 29.5137 29.4277 29.5137 29.3253V18.1198C29.5137 18.0384 29.5395 17.959 29.5874 17.8932C29.6352 17.8273 29.7027 17.7782 29.7801 17.753L39.1583 14.6869C39.2163 14.668 39.2779 14.6631 39.3381 14.6725C39.3983 14.682 39.4554 14.7056 39.5047 14.7414C39.5541 14.7772 39.5943 14.8241 39.622 14.8784C39.6497 14.9327 39.6642 14.9928 39.6642 15.0537V26.26C39.6641 26.3414 39.6383 26.4208 39.5905 26.4867C39.5426 26.5525 39.4752 26.6016 39.3978 26.6269L30.0195 29.6922C29.9809 29.7049 29.9405 29.7114 29.8998 29.7115ZM30.286 18.3994V28.7924L38.8919 25.9797V15.5858L30.286 18.3994Z" fill="#0032D9"/>
<path d="M39.2788 15.4398C39.2381 15.4397 39.1977 15.4332 39.1591 15.4205L32.199 13.1453C32.1507 13.1295 32.106 13.1044 32.0675 13.0714C32.029 13.0384 31.9973 12.9981 31.9744 12.9528C31.9514 12.9076 31.9376 12.8582 31.9337 12.8076C31.9299 12.757 31.936 12.7062 31.9518 12.6579C31.9676 12.6097 31.9927 12.565 32.0257 12.5265C32.0587 12.488 32.099 12.4563 32.1443 12.4334C32.1895 12.4104 32.2389 12.3966 32.2895 12.3927C32.3401 12.3889 32.3909 12.395 32.4391 12.4108L39.3985 14.6868C39.4856 14.7155 39.5598 14.7742 39.6075 14.8525C39.6553 14.9309 39.6737 15.0237 39.6593 15.1143C39.6449 15.2049 39.5987 15.2874 39.5289 15.3471C39.4592 15.4067 39.3705 15.4396 39.2788 15.4398Z" fill="#0032D9"/>
<path d="M29.8994 29.7115C29.8588 29.7114 29.8184 29.7049 29.7797 29.6922L20.4007 26.6299C20.3233 26.6047 20.2558 26.5556 20.208 26.4897C20.1601 26.4239 20.1343 26.3445 20.1343 26.2631V15.0537C20.1343 14.9928 20.1488 14.9327 20.1765 14.8784C20.2042 14.8241 20.2444 14.7772 20.2937 14.7414C20.3431 14.7056 20.4002 14.682 20.4604 14.6725C20.5206 14.6631 20.5822 14.668 20.6401 14.6869L30.023 17.7522C30.1004 17.7774 30.1679 17.8265 30.2157 17.8924C30.2636 17.9583 30.2894 18.0376 30.2894 18.119V29.3253C30.2894 29.4277 30.2488 29.526 30.1763 29.5984C30.1039 29.6708 30.0057 29.7115 29.9033 29.7115H29.8994ZM20.9097 25.9797L29.5133 28.7924V18.3994L20.9097 15.5858V25.9797Z" fill="#0032D9"/>
<path d="M20.5208 15.4398C20.4393 15.4397 20.3599 15.4137 20.294 15.3657C20.2281 15.3177 20.1791 15.2501 20.154 15.1726C20.1382 15.1243 20.132 15.0735 20.1359 15.0229C20.1398 14.9723 20.1536 14.9229 20.1765 14.8777C20.1995 14.8324 20.2311 14.7921 20.2697 14.7591C20.3082 14.7261 20.3529 14.701 20.4011 14.6852L27.3604 12.4115C27.4087 12.3957 27.4595 12.3896 27.5101 12.3935C27.5607 12.3973 27.6101 12.4111 27.6553 12.4341C27.7006 12.457 27.7409 12.4887 27.7739 12.5272C27.8069 12.5658 27.832 12.6104 27.8478 12.6587C27.8636 12.7069 27.8697 12.7578 27.8658 12.8084C27.862 12.859 27.8482 12.9083 27.8252 12.9536C27.8022 12.9988 27.7706 13.0391 27.7321 13.0721C27.6935 13.1052 27.6489 13.1303 27.6006 13.146L20.6405 15.4205C20.6019 15.4332 20.5615 15.4397 20.5208 15.4398Z" fill="#0032D9"/>
</svg>
