<svg width="60" height="61" viewBox="0 0 60 61" fill="none" xmlns="http://www.w3.org/2000/svg">
<path d="M29.9439 59.9457C46.3058 59.9457 59.5698 46.6817 59.5698 30.3197C59.5698 13.9577 46.3058 0.693726 29.9439 0.693726C13.5819 0.693726 0.317871 13.9577 0.317871 30.3197C0.317871 46.6817 13.5819 59.9457 29.9439 59.9457Z" fill="white"/>
<path d="M29.9439 0.307673C36.8678 0.311949 43.5774 2.7095 48.936 7.09418C54.2947 11.4789 57.9729 17.5811 59.3476 24.3671C60.7223 31.1532 59.7091 38.2058 56.4794 44.3303C53.2497 50.4548 48.0023 55.2747 41.626 57.9733C34.2965 61.0459 26.0477 61.0867 18.6881 58.0867C11.3286 55.0868 5.45899 49.2909 2.36627 41.9698C-0.726454 34.6488 -0.78989 26.4001 2.18987 19.0324C5.16963 11.6646 10.9494 5.77913 18.2619 2.66632C21.9576 1.10217 25.9309 0.299941 29.9439 0.307673ZM29.9439 59.5596C36.6899 59.556 43.2272 57.2205 48.4483 52.9488C53.6695 48.6772 57.2535 42.7319 58.5932 36.1204C59.9329 29.5088 58.9458 22.6374 55.7993 16.6702C52.6528 10.703 47.5403 6.00696 41.3279 3.37762C34.1865 0.382253 26.1488 0.341345 18.9774 3.26387C11.8059 6.1864 6.08626 11.8338 3.07277 18.9675C0.0592772 26.1011 -0.00203597 34.1388 2.90227 41.3176C5.80658 48.4964 11.4394 54.2304 18.5654 57.262C22.1651 58.7854 26.0352 59.5669 29.9439 59.5596Z" fill="#0032D9"/>
<path d="M18.3598 32.0282C18.2762 32.0282 18.1949 32.0011 18.1281 31.9509C18.0462 31.8895 17.992 31.798 17.9775 31.6966C17.963 31.5952 17.9894 31.4923 18.0509 31.4103L29.1614 16.7109C29.2228 16.6289 29.3143 16.5748 29.4157 16.5603C29.5171 16.5458 29.6201 16.5722 29.702 16.6336C29.7426 16.6641 29.7768 16.7022 29.8026 16.7458C29.8284 16.7894 29.8454 16.8377 29.8526 16.8879C29.8598 16.9381 29.857 16.9893 29.8444 17.0384C29.8318 17.0875 29.8097 17.1337 29.7792 17.1742L18.6687 31.8745C18.6327 31.9223 18.586 31.9611 18.5324 31.9878C18.4788 32.0144 18.4197 32.0283 18.3598 32.0282Z" fill="#0032D9"/>
<path d="M18.36 32.0281C18.2925 32.0282 18.2261 32.0105 18.1676 31.9769C18.1091 31.9433 18.0604 31.8949 18.0263 31.8366C18.0006 31.7928 17.9838 31.7444 17.9768 31.6941C17.9698 31.6437 17.9728 31.5926 17.9857 31.5434C17.9985 31.4943 18.0209 31.4481 18.0516 31.4077C18.0823 31.3672 18.1207 31.3332 18.1646 31.3076L43.2818 16.6089C43.3702 16.5572 43.4755 16.5427 43.5746 16.5686C43.6736 16.5945 43.7583 16.6587 43.8101 16.7471C43.8618 16.8355 43.8763 16.9408 43.8503 17.0399C43.8244 17.1389 43.7602 17.2237 43.6718 17.2754L18.5554 31.9749C18.4961 32.0097 18.4287 32.0281 18.36 32.0281Z" fill="#0032D9"/>
<path d="M18.36 32.028C18.2627 32.0283 18.1689 31.9919 18.0973 31.926C18.0257 31.8601 17.9816 31.7697 17.9739 31.6727C17.9699 31.6221 17.9759 31.5712 17.9916 31.5229C18.0073 31.4746 18.0323 31.4298 18.0653 31.3913C18.0983 31.3527 18.1386 31.321 18.1839 31.2979C18.2291 31.2749 18.2785 31.2611 18.3291 31.2572L43.4456 29.2191C43.4961 29.2149 43.547 29.2208 43.5953 29.2364C43.6436 29.2519 43.6883 29.2768 43.727 29.3097C43.7657 29.3425 43.7975 29.3827 43.8206 29.4278C43.8437 29.4729 43.8578 29.5222 43.8618 29.5728C43.8663 29.6235 43.8606 29.6746 43.8452 29.7232C43.8298 29.7718 43.805 29.8168 43.7721 29.8557C43.7392 29.8946 43.699 29.9266 43.6537 29.9499C43.6084 29.9732 43.5589 29.9873 43.5081 29.9914L18.3909 32.0264L18.36 32.028Z" fill="#0032D9"/>
<path d="M29.4698 45.9832C29.4118 45.9832 29.3544 45.97 29.3022 45.9447C29.2499 45.9195 29.204 45.8827 29.1678 45.8372L18.0581 31.8823C17.995 31.8023 17.966 31.7005 17.9776 31.5992C17.9892 31.498 18.0403 31.4054 18.1199 31.3417C18.1999 31.2785 18.3017 31.2496 18.4029 31.2612C18.5042 31.2727 18.5968 31.3239 18.6605 31.4035L29.7718 45.3561C29.8169 45.4129 29.8452 45.4814 29.8532 45.5535C29.8613 45.6256 29.8488 45.6986 29.8173 45.764C29.7857 45.8294 29.7364 45.8846 29.675 45.9232C29.6135 45.9618 29.5424 45.9831 29.4698 45.9832Z" fill="#0032D9"/>
<path d="M13.1541 34.834C12.4476 33.6821 12.1431 32.3285 12.2883 30.9851C12.4335 29.6417 13.0201 28.3843 13.9564 27.41C14.8927 26.4357 16.1256 25.7994 17.4622 25.6009C18.7988 25.4023 20.1635 25.6526 21.3425 26.3127C22.5216 26.9727 23.4485 28.0051 23.978 29.2483C24.5074 30.4915 24.6097 31.8752 24.2686 33.1827C23.9275 34.4902 23.1624 35.6476 22.0931 36.4737C21.0238 37.2998 19.7107 37.748 18.3595 37.7479C17.3145 37.7508 16.2864 37.4841 15.3746 36.9737C14.4627 36.4633 13.6979 35.7263 13.1541 34.834Z" fill="white"/>
<path d="M32.3488 16.9426C32.3488 17.5122 32.1799 18.069 31.8634 18.5426C31.547 19.0162 31.0972 19.3853 30.5709 19.6033C30.0447 19.8213 29.4656 19.8783 28.907 19.7672C28.3483 19.6561 27.8352 19.3818 27.4324 18.979C27.0296 18.5763 26.7553 18.0631 26.6442 17.5044C26.5331 16.9458 26.5901 16.3667 26.8081 15.8405C27.0261 15.3142 27.3952 14.8644 27.8688 14.548C28.3424 14.2315 28.8992 14.0626 29.4688 14.0626C30.2326 14.0626 30.9652 14.366 31.5053 14.9061C32.0454 15.4462 32.3488 16.1788 32.3488 16.9426Z" fill="white"/>
<path d="M29.4692 20.2086C28.8233 20.2086 28.1918 20.0171 27.6547 19.6582C27.1176 19.2993 26.699 18.7892 26.4517 18.1924C26.2045 17.5956 26.1399 16.9389 26.2659 16.3053C26.3919 15.6718 26.703 15.0898 27.1598 14.633C27.6165 14.1762 28.1985 13.8652 28.8321 13.7392C29.4656 13.6131 30.1223 13.6778 30.7191 13.925C31.3159 14.1722 31.826 14.5908 32.1849 15.128C32.5438 15.6651 32.7354 16.2965 32.7354 16.9425C32.7343 17.8084 32.3899 18.6386 31.7776 19.2509C31.1653 19.8632 30.3352 20.2076 29.4692 20.2086ZM29.4692 14.4487C28.976 14.4487 28.4939 14.595 28.0838 14.869C27.6737 15.143 27.354 15.5325 27.1653 15.9882C26.9765 16.4439 26.9271 16.9453 27.0234 17.429C27.1196 17.9128 27.3571 18.3571 27.7059 18.7059C28.0546 19.0547 28.499 19.2922 28.9827 19.3884C29.4665 19.4846 29.9679 19.4352 30.4236 19.2465C30.8793 19.0577 31.2687 18.7381 31.5428 18.328C31.8168 17.9179 31.963 17.4357 31.963 16.9425C31.9622 16.2814 31.6992 15.6475 31.2317 15.18C30.7642 14.7125 30.1304 14.4495 29.4692 14.4487Z" fill="#0032D9"/>
<path d="M29.4697 13.6764C30.1157 13.6764 30.7472 13.8679 31.2843 14.2268C31.8214 14.5857 32.24 15.0958 32.4872 15.6926C32.7344 16.2894 32.7991 16.9461 32.6731 17.5797C32.5471 18.2133 32.236 18.7952 31.7792 19.252C31.3225 19.7088 30.7405 20.0198 30.1069 20.1459C29.4734 20.2719 28.8166 20.2072 28.2198 19.96C27.623 19.7128 27.1129 19.2942 26.7541 18.7571C26.3952 18.22 26.2036 17.5885 26.2036 16.9425C26.2046 16.0766 26.5491 15.2464 27.1614 14.6341C27.7737 14.0218 28.6038 13.6774 29.4697 13.6764ZM29.4697 19.4363C29.963 19.4363 30.4451 19.2901 30.8552 19.016C31.2653 18.742 31.585 18.3525 31.7737 17.8968C31.9625 17.4412 32.0118 16.9397 31.9156 16.456C31.8194 15.9722 31.5819 15.5279 31.2331 15.1791C30.8844 14.8304 30.44 14.5928 29.9562 14.4966C29.4725 14.4004 28.9711 14.4498 28.5154 14.6385C28.0597 14.8273 27.6702 15.1469 27.3962 15.557C27.1222 15.9671 26.9759 16.4493 26.9759 16.9425C26.9767 17.6037 27.2397 18.2375 27.7072 18.705C28.1748 19.1725 28.8086 19.4355 29.4697 19.4363Z" fill="#0032D9"/>
<path d="M45.5136 16.9424C45.5136 17.3452 45.3942 17.7389 45.1704 18.0738C44.9466 18.4087 44.6285 18.6698 44.2564 18.8239C43.8843 18.9781 43.4748 19.0184 43.0797 18.9398C42.6846 18.8612 42.3218 18.6673 42.0369 18.3824C41.7521 18.0976 41.5581 17.7347 41.4796 17.3397C41.401 16.9446 41.4413 16.5351 41.5955 16.163C41.7496 15.7908 42.0106 15.4728 42.3456 15.249C42.6805 15.0252 43.0742 14.9058 43.477 14.9058C44.0172 14.9058 44.5352 15.1203 44.9171 15.5023C45.299 15.8842 45.5136 16.4022 45.5136 16.9424Z" fill="white"/>
<path d="M43.4774 19.3666C42.9983 19.3666 42.5299 19.2245 42.1314 18.9583C41.733 18.6921 41.4225 18.3137 41.2391 17.871C41.0557 17.4283 41.0078 16.9412 41.1012 16.4712C41.1947 16.0012 41.4255 15.5696 41.7643 15.2307C42.1031 14.8919 42.5348 14.6612 43.0048 14.5677C43.4748 14.4742 43.9619 14.5222 44.4046 14.7055C44.8473 14.8889 45.2257 15.1994 45.4919 15.5979C45.7581 15.9963 45.9002 16.4647 45.9002 16.9439C45.8996 17.5862 45.6441 18.2021 45.1899 18.6563C44.7357 19.1106 44.1198 19.366 43.4774 19.3666ZM43.4774 15.2934C43.151 15.2934 42.8319 15.3902 42.5605 15.5716C42.2891 15.7529 42.0776 16.0107 41.9526 16.3123C41.8277 16.6139 41.795 16.9457 41.8587 17.2659C41.9224 17.586 42.0796 17.8801 42.3104 18.1109C42.5412 18.3417 42.8353 18.4989 43.1555 18.5626C43.4756 18.6263 43.8075 18.5936 44.109 18.4687C44.4106 18.3438 44.6684 18.1322 44.8497 17.8608C45.0311 17.5894 45.1279 17.2703 45.1279 16.9439C45.1279 16.506 44.954 16.0861 44.6446 15.7763C44.3351 15.4665 43.9153 15.2923 43.4774 15.2919V15.2934Z" fill="#0032D9"/>
<path d="M43.4765 14.5197C43.9556 14.5197 44.4241 14.6617 44.8225 14.928C45.2209 15.1942 45.5314 15.5726 45.7148 16.0153C45.8982 16.458 45.9461 16.9451 45.8527 17.4151C45.7592 17.885 45.5284 18.3167 45.1896 18.6555C44.8508 18.9944 44.4191 19.2251 43.9491 19.3186C43.4791 19.4121 42.992 19.3641 42.5493 19.1807C42.1066 18.9974 41.7282 18.6868 41.462 18.2884C41.1958 17.89 41.0537 17.4216 41.0537 16.9424C41.0543 16.3 41.3098 15.6842 41.764 15.2299C42.2182 14.7757 42.8341 14.5203 43.4765 14.5197ZM43.4765 18.5928C43.8029 18.5928 44.122 18.496 44.3934 18.3147C44.6648 18.1333 44.8763 17.8756 45.0013 17.574C45.1262 17.2724 45.1589 16.9406 45.0952 16.6204C45.0315 16.3003 44.8743 16.0062 44.6435 15.7754C44.4127 15.5446 44.1186 15.3874 43.7984 15.3237C43.4783 15.26 43.1464 15.2927 42.8449 15.4176C42.5433 15.5425 42.2855 15.7541 42.1042 16.0255C41.9228 16.2969 41.826 16.616 41.826 16.9424C41.8264 17.38 42.0005 17.7996 42.3099 18.109C42.6193 18.4184 43.0389 18.5924 43.4765 18.5928Z" fill="#0032D9"/>
<path d="M47.546 29.6054C47.546 30.4104 47.3073 31.1973 46.86 31.8666C46.4128 32.5359 45.7771 33.0576 45.0334 33.3657C44.2897 33.6737 43.4713 33.7543 42.6818 33.5973C41.8923 33.4402 41.1671 33.0526 40.5979 32.4834C40.0287 31.9142 39.641 31.1889 39.484 30.3994C39.3269 29.6099 39.4075 28.7915 39.7156 28.0478C40.0236 27.3041 40.5453 26.6684 41.2146 26.2212C41.884 25.774 42.6709 25.5353 43.4759 25.5353C44.5553 25.5353 45.5906 25.9641 46.3539 26.7274C47.1171 27.4907 47.546 28.5259 47.546 29.6054Z" fill="white"/>
<path d="M43.4758 34.0617C42.5944 34.0617 41.7329 33.8003 41 33.3107C40.2672 32.821 39.696 32.125 39.3587 31.3108C39.0215 30.4965 38.9332 29.6005 39.1052 28.7361C39.2771 27.8716 39.7015 27.0776 40.3247 26.4544C40.948 25.8312 41.742 25.4067 42.6064 25.2348C43.4708 25.0629 44.3668 25.1511 45.1811 25.4884C45.9954 25.8257 46.6914 26.3968 47.181 27.1297C47.6707 27.8625 47.932 28.7241 47.932 29.6054C47.9306 30.7869 47.4607 31.9195 46.6253 32.7549C45.7899 33.5903 44.6572 34.0603 43.4758 34.0617ZM43.4758 25.9215C42.7472 25.9215 42.0349 26.1375 41.4291 26.5423C40.8233 26.9471 40.3511 27.5225 40.0723 28.1956C39.7934 28.8688 39.7205 29.6095 39.8626 30.3241C40.0048 31.0387 40.3556 31.6952 40.8708 32.2104C41.3861 32.7256 42.0425 33.0764 42.7571 33.2186C43.4717 33.3607 44.2124 33.2878 44.8856 33.0089C45.5587 32.7301 46.1341 32.2579 46.5389 31.6521C46.9437 31.0463 47.1597 30.334 47.1597 29.6054C47.1587 28.6287 46.7703 27.6923 46.0796 27.0016C45.3889 26.311 44.4525 25.9225 43.4758 25.9215Z" fill="#0032D9"/>
<path d="M43.4758 25.1492C44.3572 25.1492 45.2187 25.4105 45.9515 25.9002C46.6844 26.3898 47.2555 27.0858 47.5928 27.9001C47.9301 28.7144 48.0184 29.6104 47.8464 30.4748C47.6745 31.3392 47.2501 32.1333 46.6268 32.7565C46.0036 33.3797 45.2096 33.8041 44.3452 33.9761C43.4807 34.148 42.5847 34.0598 41.7705 33.7225C40.9562 33.3852 40.2602 32.814 39.7705 32.0812C39.2809 31.3484 39.0195 30.4868 39.0195 29.6054C39.021 28.424 39.4909 27.2914 40.3263 26.456C41.1617 25.6206 42.2944 25.1506 43.4758 25.1492ZM43.4758 33.2894C44.2044 33.2894 44.9167 33.0733 45.5225 32.6685C46.1283 32.2637 46.6005 31.6884 46.8793 31.0152C47.1581 30.3421 47.2311 29.6013 47.0889 28.8867C46.9468 28.1721 46.5959 27.5157 46.0807 27.0005C45.5655 26.4853 44.9091 26.1344 44.1945 25.9923C43.4799 25.8501 42.7392 25.9231 42.066 26.2019C41.3929 26.4807 40.8175 26.9529 40.4127 27.5587C40.0079 28.1646 39.7918 28.8768 39.7918 29.6054C39.7929 30.5822 40.1813 31.5186 40.872 32.2092C41.5626 32.8999 42.4991 33.2883 43.4758 33.2894Z" fill="#0032D9"/>
<path d="M33.5396 45.5962C33.5396 46.4012 33.3009 47.1881 32.8537 47.8574C32.4064 48.5268 31.7708 49.0484 31.0271 49.3565C30.2834 49.6646 29.465 49.7452 28.6755 49.5881C27.886 49.4311 27.1607 49.0434 26.5915 48.4742C26.0223 47.905 25.6347 47.1798 25.4776 46.3903C25.3206 45.6007 25.4012 44.7824 25.7092 44.0387C26.0173 43.2949 26.539 42.6593 27.2083 42.2121C27.8776 41.7648 28.6645 41.5261 29.4695 41.5261C30.549 41.5261 31.5842 41.9549 32.3475 42.7182C33.1108 43.4815 33.5396 44.5168 33.5396 45.5962Z" fill="white"/>
<path d="M29.4699 50.0498C28.5886 50.0498 27.727 49.7885 26.9942 49.2988C26.2613 48.8092 25.6902 48.1132 25.3529 47.2989C25.0156 46.4847 24.9274 45.5886 25.0993 44.7242C25.2712 43.8598 25.6957 43.0658 26.3189 42.4425C26.9421 41.8193 27.7361 41.3949 28.6006 41.223C29.465 41.051 30.361 41.1393 31.1753 41.4765C31.9895 41.8138 32.6855 42.385 33.1752 43.1178C33.6648 43.8507 33.9262 44.7122 33.9262 45.5936C33.9248 46.775 33.4548 47.9077 32.6194 48.7431C31.784 49.5785 30.6514 50.0484 29.4699 50.0498ZM29.4699 41.9096C28.7413 41.9096 28.0291 42.1257 27.4232 42.5305C26.8174 42.9353 26.3452 43.5107 26.0664 44.1838C25.7876 44.857 25.7146 45.5977 25.8568 46.3123C25.9989 47.0269 26.3498 47.6833 26.865 48.1985C27.3802 48.7137 28.0366 49.0646 28.7512 49.2067C29.4658 49.3489 30.2066 49.2759 30.8797 48.9971C31.5529 48.7183 32.1282 48.2461 32.533 47.6403C32.9378 47.0345 33.1539 46.3222 33.1539 45.5936C33.1522 44.6173 32.7635 43.6814 32.0729 42.9913C31.3823 42.3011 30.4463 41.913 29.4699 41.912V41.9096Z" fill="#0032D9"/>
<path d="M29.4699 41.14C30.3513 41.14 31.2129 41.4014 31.9457 41.891C32.6785 42.3807 33.2497 43.0767 33.587 43.8909C33.9243 44.7052 34.0125 45.6012 33.8406 46.4656C33.6686 47.3301 33.2442 48.1241 32.621 48.7473C31.9978 49.3705 31.2037 49.795 30.3393 49.9669C29.4749 50.1388 28.5789 50.0506 27.7646 49.7133C26.9503 49.376 26.2543 48.8049 25.7647 48.072C25.275 47.3392 25.0137 46.4776 25.0137 45.5963C25.0151 44.4148 25.4851 43.2822 26.3205 42.4468C27.1559 41.6114 28.2885 41.1414 29.4699 41.14ZM29.4699 49.2802C30.1985 49.2802 30.9108 49.0642 31.5166 48.6594C32.1224 48.2546 32.5946 47.6792 32.8734 47.0061C33.1523 46.3329 33.2252 45.5922 33.0831 44.8776C32.9409 44.163 32.5901 43.5065 32.0749 42.9913C31.5597 42.4761 30.9032 42.1253 30.1886 41.9831C29.474 41.841 28.7333 41.9139 28.0601 42.1928C27.387 42.4716 26.8116 42.9438 26.4068 43.5496C26.002 44.1554 25.786 44.8677 25.786 45.5963C25.787 46.573 26.1755 47.5094 26.8661 48.2001C27.5568 48.8907 28.4932 49.2792 29.4699 49.2802Z" fill="#0032D9"/>
<path d="M18.3593 38.1341C17.8654 38.134 17.3731 38.0778 16.8919 37.9666C16.7936 37.9421 16.7088 37.8799 16.6558 37.7935C16.6029 37.7071 16.5861 37.6033 16.609 37.5045C16.6319 37.4058 16.6927 37.32 16.7783 37.2657C16.8639 37.2114 16.9674 37.193 17.0665 37.2143C18.3538 37.514 19.7053 37.3587 20.891 36.7747C22.0768 36.1907 23.0238 35.2141 23.571 34.0109C24.1181 32.8077 24.2318 31.4522 23.8926 30.1747C23.5533 28.8971 22.7822 27.7765 21.7102 27.0033C20.6382 26.23 19.3315 25.8519 18.0122 25.9331C16.6929 26.0143 15.4424 26.5498 14.4733 27.4487C13.5043 28.3476 12.8764 29.5543 12.6964 30.8638C12.5164 32.1733 12.7954 33.5047 13.486 34.6317C13.5126 34.6749 13.5304 34.7229 13.5384 34.773C13.5464 34.8231 13.5445 34.8743 13.5327 34.9236C13.521 34.9729 13.4996 35.0195 13.4699 35.0606C13.4401 35.1017 13.4026 35.1365 13.3594 35.1631C13.3162 35.1896 13.2681 35.2074 13.2181 35.2154C13.168 35.2235 13.1168 35.2215 13.0675 35.2098C13.0181 35.198 12.9716 35.1766 12.9305 35.1469C12.8894 35.1171 12.8546 35.0796 12.828 35.0364C12.0768 33.8117 11.7529 32.3725 11.9072 30.9441C12.0614 29.5157 12.6851 28.1788 13.6805 27.1428C14.6759 26.1068 15.9868 25.4302 17.4079 25.219C18.829 25.0078 20.2801 25.2739 21.5337 25.9756C22.7874 26.6773 23.773 27.775 24.336 29.0968C24.899 30.4186 25.0077 31.8898 24.6451 33.28C24.2825 34.6702 23.4691 35.9009 22.3322 36.7793C21.1953 37.6577 19.7991 38.1342 18.3624 38.1341H18.3593Z" fill="#0032D9"/>
</svg>
