<svg width="48" height="49" viewBox="0 0 48 49" fill="none" xmlns="http://www.w3.org/2000/svg">
<path d="M10.1282 39.5953C9.88763 39.595 9.64975 39.5449 9.42953 39.4481C9.20932 39.3513 9.01152 39.21 8.84862 39.033C8.68572 38.856 8.56125 38.6472 8.48303 38.4197C8.40482 38.1922 8.37456 37.951 8.39416 37.7113L9.27017 27.0673C9.28612 26.8719 9.35914 26.6855 9.48016 26.5313L26.9222 4.33128C27.2588 3.90258 27.6766 3.54439 28.1517 3.27719C28.6269 3.00999 29.15 2.839 29.6912 2.774C30.2324 2.709 30.7811 2.75125 31.3059 2.89834C31.8308 3.04544 32.3216 3.29449 32.7502 3.63128L38.0252 7.77628C38.8907 8.45635 39.4508 9.45239 39.582 10.5453C39.7133 11.6383 39.4051 12.7386 38.7252 13.6043L21.2832 35.8043C21.162 35.9584 20.9982 36.0735 20.8122 36.1353L10.6782 39.5043C10.5009 39.5639 10.3152 39.5947 10.1282 39.5953ZM11.2392 27.5313L10.4202 37.4833L19.8972 34.3333L37.1532 12.3753C37.5056 11.9268 37.6654 11.3567 37.5975 10.7903C37.5296 10.224 37.2396 9.70779 36.7912 9.35528L31.5182 5.21028C31.2962 5.03582 31.042 4.90678 30.7701 4.83055C30.4982 4.75432 30.214 4.73239 29.9337 4.76601C29.6533 4.79962 29.3824 4.88813 29.1362 5.02647C28.8901 5.16481 28.6736 5.35028 28.4992 5.57228L11.2392 27.5313Z" fill="#01012B"/>
<path d="M35.4322 17.1843C35.2084 17.1841 34.9911 17.1087 34.8152 16.9703L24.5852 8.93234C24.3779 8.76851 24.2439 8.52931 24.2124 8.26699C24.181 8.00468 24.2546 7.74057 24.4172 7.53234C24.5809 7.32493 24.82 7.19073 25.0823 7.15907C25.3447 7.1274 25.6088 7.20084 25.8172 7.36334L36.0472 15.4013C36.2106 15.5299 36.3299 15.7061 36.3885 15.9056C36.447 16.1051 36.442 16.3179 36.374 16.5143C36.306 16.7108 36.1785 16.8812 36.0091 17.0018C35.8398 17.1225 35.6371 17.1873 35.4292 17.1873L35.4322 17.1843Z" fill="#01012B"/>
<path d="M20.4962 36.1924C20.2723 36.1921 20.0551 36.1168 19.8792 35.9784L9.64916 27.9404C9.4419 27.7766 9.30789 27.5374 9.27641 27.275C9.24494 27.0127 9.31854 26.7486 9.48116 26.5404C9.64485 26.333 9.88398 26.1988 10.1463 26.1671C10.4086 26.1355 10.6728 26.2089 10.8812 26.3714L21.1112 34.4094C21.2746 34.5379 21.3939 34.7142 21.4524 34.9137C21.511 35.1132 21.5059 35.3259 21.438 35.5224C21.37 35.7189 21.2424 35.8893 21.0731 36.0099C20.9038 36.1305 20.7011 36.1954 20.4932 36.1954L20.4962 36.1924Z" fill="#01012B"/>
<path d="M45.6905 46.5955H2.30951C2.04429 46.5955 1.78994 46.4901 1.6024 46.3026C1.41487 46.115 1.30951 45.8607 1.30951 45.5955C1.30951 45.3302 1.41487 45.0759 1.6024 44.8884C1.78994 44.7008 2.04429 44.5955 2.30951 44.5955H45.6905C45.9557 44.5955 46.2101 44.7008 46.3976 44.8884C46.5852 45.0759 46.6905 45.3302 46.6905 45.5955C46.6905 45.8607 46.5852 46.115 46.3976 46.3026C46.2101 46.4901 45.9557 46.5955 45.6905 46.5955Z" fill="#169D64"/>
</svg>
