<svg xmlns="http://www.w3.org/2000/svg" xmlns:xlink="http://www.w3.org/1999/xlink" width="648" height="440" viewBox="0 0 648 440">
  <defs>
    <filter id="Rechteck_6268" x="80" y="151.04" width="272" height="88" filterUnits="userSpaceOnUse">
      <feOffset dx="8" dy="8" input="SourceAlpha"/>
      <feGaussianBlur stdDeviation="3" result="blur"/>
      <feFlood flood-opacity="0.161"/>
      <feComposite operator="in" in2="blur"/>
      <feComposite in="SourceGraphic"/>
    </filter>
    <filter id="Pfad_17501" x="198.971" y="221.041" width="34.058" height="26.029" filterUnits="userSpaceOnUse">
      <feOffset dx="8" dy="8" input="SourceAlpha"/>
      <feGaussianBlur stdDeviation="3" result="blur-2"/>
      <feFlood flood-opacity="0.161"/>
      <feComposite operator="in" in2="blur-2"/>
      <feComposite in="SourceGraphic"/>
    </filter>
    <clipPath id="clip-path">
      <rect id="Rechteck_6272" data-name="Rechteck 6272" width="235" height="33" transform="translate(-21884 521)" fill="#fff" stroke="#707070" stroke-width="1"/>
    </clipPath>
  </defs>
  <g id="Gruppe_17487" data-name="Gruppe 17487" transform="translate(21974 -270)">
    <rect id="Rechteck_6260" data-name="Rechteck 6260" width="648" height="440" transform="translate(-21974 270)" fill="#fff"/>
    <rect id="Rechteck_6271" data-name="Rechteck 6271" width="52.121" height="310.738" transform="translate(-21805.209 398.44)" fill="#ededed"/>
    <rect id="Rechteck_6265" data-name="Rechteck 6265" width="52.121" height="310.738" transform="translate(-21622.785 398.44)" fill="#ededed"/>
    <rect id="Rechteck_6263" data-name="Rechteck 6263" width="52.121" height="311.738" transform="translate(-21440.363 397.44)" fill="#ededed"/>
    <path id="Linie_3328" data-name="Linie 3328" d="M.5,363.744h-1V0h1Z" transform="translate(-21753.078 345.434)" fill="#bfcbf6"/>
    <path id="Linie_3332" data-name="Linie 3332" d="M.5,311.014h-1V0h1Z" transform="translate(-21909.439 398.164)" fill="#ededed"/>
    <path id="Linie_3333" data-name="Linie 3333" d="M.5,311.014h-1V0h1Z" transform="translate(-21727.016 398.164)" fill="#ededed"/>
    <path id="Linie_3334" data-name="Linie 3334" d="M.5,311.014h-1V0h1Z" transform="translate(-21544.594 398.164)" fill="#ededed"/>
    <path id="Linie_3345" data-name="Linie 3345" d="M.5,311.014h-1V0h1Z" transform="translate(-21857.318 398.164)" fill="#ededed"/>
    <path id="Linie_3346" data-name="Linie 3346" d="M.5,311.014h-1V0h1Z" transform="translate(-21674.895 398.164)" fill="#ededed"/>
    <path id="Linie_3347" data-name="Linie 3347" d="M.5,311.014h-1V0h1Z" transform="translate(-21492.473 398.164)" fill="#ededed"/>
    <path id="Linie_3358" data-name="Linie 3358" d="M.5,311.014h-1V0h1Z" transform="translate(-21779.137 398.164)" fill="#fff"/>
    <path id="Linie_3359" data-name="Linie 3359" d="M.5,311.014h-1V0h1Z" transform="translate(-21596.715 398.164)" fill="#fff"/>
    <path id="Linie_3360" data-name="Linie 3360" d="M.5,311.014h-1V0h1Z" transform="translate(-21414.291 398.164)" fill="#fff"/>
    <path id="Linie_3370" data-name="Linie 3370" d="M.5,311.014h-1V0h1Z" transform="translate(-21883.379 398.164)" fill="#ededed"/>
    <path id="Linie_3371" data-name="Linie 3371" d="M.5,311.014h-1V0h1Z" transform="translate(-21700.957 398.164)" fill="#ededed"/>
    <path id="Linie_3372" data-name="Linie 3372" d="M.5,311.014h-1V0h1Z" transform="translate(-21518.533 398.164)" fill="#ededed"/>
    <path id="Linie_3384" data-name="Linie 3384" d="M.5,311.014h-1V0h1Z" transform="translate(-21805.199 398.164)" fill="#ededed"/>
    <path id="Linie_3385" data-name="Linie 3385" d="M.5,311.014h-1V0h1Z" transform="translate(-21622.773 398.164)" fill="#ededed"/>
    <path id="Linie_3386" data-name="Linie 3386" d="M.5,311.014h-1V0h1Z" transform="translate(-21440.352 398.164)" fill="#ededed"/>
    <path id="Linie_3396" data-name="Linie 3396" d="M.5,311.014h-1V0h1Z" transform="translate(-21831.258 398.164)" fill="#ededed"/>
    <path id="Linie_3397" data-name="Linie 3397" d="M.5,311.014h-1V0h1Z" transform="translate(-21648.836 398.164)" fill="#ededed"/>
    <path id="Linie_3398" data-name="Linie 3398" d="M.5,311.014h-1V0h1Z" transform="translate(-21466.412 398.164)" fill="#ededed"/>
    <path id="Linie_3408" data-name="Linie 3408" d="M.5,363.744h-1V0h1Z" transform="translate(-21570.654 345.434)" fill="#bfcbf6"/>
    <path id="Linie_3412" data-name="Linie 3412" d="M.5,363.744h-1V0h1Z" transform="translate(-21935.5 345.434)" fill="#bfcbf6"/>
    <path id="Linie_3413" data-name="Linie 3413" d="M.5,363.744h-1V0h1Z" transform="translate(-21388.23 345.434)" fill="#bfcbf6"/>
    <path id="Linie_3417" data-name="Linie 3417" d="M.5,25.947h-1V0h1Z" transform="translate(-21935.5 302)" fill="#0d39d0"/>
    <rect id="Rechteck_6266" data-name="Rechteck 6266" width="234.481" height="55.934" rx="3" transform="translate(-21883.24 507.066)" fill="#0032d9"/>
    <path id="Rechteck_3808_-_Kontur" data-name="Rechteck 3808 - Kontur" d="M3,1A2,2,0,0,0,1,3V52.934a2,2,0,0,0,2,2H231.481a2,2,0,0,0,2-2V3a2,2,0,0,0-2-2H3M3,0H231.481a3,3,0,0,1,3,3V52.934a3,3,0,0,1-3,3H3a3,3,0,0,1-3-3V3A3,3,0,0,1,3,0Z" transform="translate(-21883.24 507.066)" fill="#0032d9"/>
    <path id="Rechteck_6269" data-name="Rechteck 6269" d="M0,0H286.166V45.942a3,3,0,0,1-3,3H3a3,3,0,0,1-3-3Z" transform="translate(-21752.926 608.058)" fill="#fff"/>
    <path id="Rechteck_6267" data-name="Rechteck 6267" d="M3,0H231.48a3,3,0,0,1,3,3V6.992H0V3A3,3,0,0,1,3,0Z" transform="translate(-21883.24 507.066)" fill="#0032d9"/>
    <path id="Rechteck_3808_-_Kontur-2" data-name="Rechteck 3808 - Kontur" d="M3,1A2,2,0,0,0,1,3V52.934a2,2,0,0,0,2,2H283.481a2,2,0,0,0,2-2V3a2,2,0,0,0-2-2H3M3,0H283.481a3,3,0,0,1,3,3V52.934a3,3,0,0,1-3,3H3a3,3,0,0,1-3-3V3A3,3,0,0,1,3,0Z" transform="translate(-21753.24 601.066)" fill="#0032d9"/>
    <path id="Rechteck_6270" data-name="Rechteck 6270" d="M3,0H283.48a3,3,0,0,1,3,3V6.992H0V3A3,3,0,0,1,3,0Z" transform="translate(-21753.24 601.066)" fill="#0032d9"/>
    <path id="Pfad_17500" data-name="Pfad 17500" d="M17.4-20.814a2.467,2.467,0,0,0-.555-.81,2.532,2.532,0,0,0-1.766-.714,2.51,2.51,0,0,0-.88.158v-7.243a2.333,2.333,0,0,0-.669-1.638,2.279,2.279,0,0,0-1.63-.689,2.256,2.256,0,0,0-1.623.69,2.342,2.342,0,0,0-.661,1.637V-15.7L7.257-18.776a2.1,2.1,0,0,0-1.285-.93,2.2,2.2,0,0,0-1.622.225A2.166,2.166,0,0,0,3.332-18.2a2.086,2.086,0,0,0,.218,1.653s2.993,4.68,4.214,6.528c.368.56.806,1.155,1.236,1.745.874,1.188,1.849,2.339,1.849,3l.8.8h8.474l.8-.8A6.71,6.71,0,0,1,21.94-7.826a10.924,10.924,0,0,0,1.583-4.724l-.006-3.5v-1.661a2.058,2.058,0,0,0-.608-1.463,2.069,2.069,0,0,0-1.464-.6,2.072,2.072,0,0,0-.708.124,2.467,2.467,0,0,0-.5-.692,2.52,2.52,0,0,0-1.764-.714A2.465,2.465,0,0,0,17.4-20.814Z" transform="translate(-21728.129 586.871)" fill="#fff" fill-rule="evenodd"/>
    <path id="Pfad_17022_-_Kontur" data-name="Pfad 17022 - Kontur" d="M11.9-32.25a2.765,2.765,0,0,1,1.986.838,2.822,2.822,0,0,1,.812,1.988v6.609a3.058,3.058,0,0,1,.38-.024,3.018,3.018,0,0,1,2.114.856,2.978,2.978,0,0,1,.443.544,3,3,0,0,1,.84-.118,3.009,3.009,0,0,1,2.113.855,2.977,2.977,0,0,1,.392.469,2.587,2.587,0,0,1,.467-.042,2.558,2.558,0,0,1,1.817.75,2.548,2.548,0,0,1,.755,1.817v1.661l.006,3.5A11.2,11.2,0,0,1,22.384-7.6l-.169.322a5.429,5.429,0,0,0-.783,1.994v.207l-1.1,1.1H11.448l-1.1-1.1v-.207A6.764,6.764,0,0,0,9.071-7.35c-.154-.2-.314-.416-.47-.628-.43-.584-.875-1.189-1.254-1.762-1.21-1.83-4.189-6.487-4.218-6.534l-.01-.016a2.592,2.592,0,0,1-.268-2.044A2.657,2.657,0,0,1,4.1-19.916a2.715,2.715,0,0,1,1.34-.355,2.691,2.691,0,0,1,.651.08,2.6,2.6,0,0,1,1.575,1.129l1.445,1.884V-29.424a2.832,2.832,0,0,1,.8-1.986,2.744,2.744,0,0,1,1.989-.84Zm1.8,10.79v-7.963a1.828,1.828,0,0,0-.526-1.288A1.772,1.772,0,0,0,11.9-31.25a1.752,1.752,0,0,0-1.265.538,1.837,1.837,0,0,0-.52,1.288V-14.23l-3.28-4.282a1.6,1.6,0,0,0-.982-.709,1.692,1.692,0,0,0-.409-.05,1.713,1.713,0,0,0-.845.224,1.663,1.663,0,0,0-.783.988A1.579,1.579,0,0,0,3.977-16.8c.144.225,3.024,4.726,4.2,6.513.365.552.8,1.146,1.225,1.721.152.207.31.416.463.618A7.173,7.173,0,0,1,11.328-5.5l.53.53h8.06l.521-.521a6.844,6.844,0,0,1,.886-2.241l.167-.318a10.443,10.443,0,0,0,1.527-4.493l-.006-3.5v-1.662a1.554,1.554,0,0,0-.461-1.109,1.565,1.565,0,0,0-1.111-.459,1.571,1.571,0,0,0-.537.094l-.424.154-.2-.406a1.961,1.961,0,0,0-.4-.552,2.015,2.015,0,0,0-1.415-.572,1.958,1.958,0,0,0-.859.193l-.474.229-.2-.485a1.956,1.956,0,0,0-.443-.646,2.024,2.024,0,0,0-1.418-.573,2.009,2.009,0,0,0-.7.126Z" transform="translate(-21728.129 586.871)" fill="#333"/>
    <g transform="matrix(1, 0, 0, 1, -21974, 270)" filter="url(#Rechteck_6268)">
      <rect id="Rechteck_6268-2" data-name="Rechteck 6268" width="254" height="70" transform="translate(81 152.04)"/>
    </g>
    <g transform="matrix(1, 0, 0, 1, -21974, 270)" filter="url(#Pfad_17501)">
      <path id="Pfad_17501-2" data-name="Pfad 17501" d="M8.029,0l8.029,8.029H0Z" transform="translate(216.03 230.07) rotate(180)"/>
    </g>
    <rect id="Rechteck_6264" data-name="Rechteck 6264" width="214.54" height="46.821" transform="translate(-21627.539 307.75)" fill="#fff"/>
    <path id="Rechteck_5949_-_Kontur" data-name="Rechteck 5949 - Kontur" d="M-.5-.5H215.04V47.321H-.5ZM214.04.5H.5V46.321H214.04Z" transform="translate(-21627.539 307.75)" fill="#0032d9"/>
    <path id="Pfad_17499" data-name="Pfad 17499" d="M8.715,1.749V.114H3.254V-3.222H8.208V-4.857H3.254V-8.029H8.715V-9.664H1.406V1.749Zm5.216,0V.293H12.753V-10.351H10.971V-.017a1.617,1.617,0,0,0,1.815,1.766Zm5.036.2A3.944,3.944,0,0,0,22.433.228L21.386-.8A2.492,2.492,0,0,1,19.146.473a2.086,2.086,0,0,1-1.635-.6,2.086,2.086,0,0,1-.6-1.635v-.278h5.837v-.67c0-2.354-1.275-4.235-3.777-4.235-2.42,0-3.908,1.733-3.908,4.447s1.489,4.448,3.908,4.448Zm0-7.5a1.913,1.913,0,0,1,1.446.654,1.913,1.913,0,0,1,.454,1.521v.164H16.906v-.114A2.047,2.047,0,0,1,17.44-4.9a2.047,2.047,0,0,1,1.526-.659Zm7.533,7.3V-3.958a1.556,1.556,0,0,1,.558-1.108,1.556,1.556,0,0,1,1.191-.347c1.046,0,1.553.654,1.553,1.978V1.749h1.782V-3.958c0-.981.834-1.455,1.733-1.455,1.079,0,1.57.67,1.57,1.978V1.749h1.782v-5.4c0-2.093-1-3.3-2.681-3.3a2.562,2.562,0,0,0-2.567,1.733h-.049A2.505,2.505,0,0,0,28.858-6.95a2.262,2.262,0,0,0-2.273,1.6H26.5v-1.4H24.722v8.5Zm15.974.2A3.944,3.944,0,0,0,45.944.228L44.9-.8A2.492,2.492,0,0,1,42.658.473a2.086,2.086,0,0,1-1.635-.6,2.086,2.086,0,0,1-.6-1.635v-.278h5.837v-.67c0-2.354-1.275-4.235-3.777-4.235-2.42,0-3.908,1.733-3.908,4.447s1.488,4.448,3.908,4.448Zm0-7.5A1.913,1.913,0,0,1,43.92-4.9a1.913,1.913,0,0,1,.454,1.521v.164H40.418v-.114A2.047,2.047,0,0,1,40.952-4.9a2.047,2.047,0,0,1,1.526-.659Zm7.538,7.309v-5.69c0-1,.916-1.472,1.848-1.472,1.1,0,1.6.67,1.6,1.995V1.749h1.782v-5.4c0-2.093-1.03-3.3-2.763-3.3a2.371,2.371,0,0,0-2.387,1.6H50.01v-1.4H48.234v8.5Zm11.609,0V.293H59.973V-5.3h1.782V-6.754H59.973V-9.075h-1.6v1.488c0,.589-.2.834-.785.834h-.719V-5.3h1.324V-.1a1.689,1.689,0,0,0,1.88,1.848Zm5.919,0h1.782V-3.958c0-.981.916-1.455,1.848-1.455,1.1,0,1.6.67,1.6,1.978V1.749h1.782v-5.4c0-2.093-1.03-3.3-2.763-3.3a2.371,2.371,0,0,0-2.387,1.6H69.32v-5H67.543ZM77.926-8.274c.736,0,1.046-.392,1.046-.932v-.278c0-.54-.311-.932-1.046-.932s-1.063.392-1.063.932v.278C76.863-8.667,77.19-8.274,77.926-8.274Zm-.9,10.023h1.782v-8.5H77.027Zm6.115,0v-5.69c0-1,.916-1.472,1.848-1.472,1.1,0,1.6.67,1.6,1.995V1.749h1.782v-5.4c0-2.093-1.03-3.3-2.763-3.3a2.371,2.371,0,0,0-2.387,1.6h-.082v-1.4h-1.78v8.5Zm13.8,0V.293H92.2L96.827-5.38V-6.754H90.3V-5.3h4.415L90.156.31V1.749Zm7.014,0h1.782v-8.5h-1.782v5.69c0,1-.9,1.472-1.815,1.472-1.1,0-1.635-.687-1.635-1.978V-6.754H98.723v5.412c0,2.093,1.03,3.286,2.78,3.286a2.337,2.337,0,0,0,2.387-1.6h.065Zm4.774,0h1.782V-5.3h1.782V-6.754h-1.782V-8.9h1.782v-1.455h-1.406a1.965,1.965,0,0,0-1.608.577,1.965,1.965,0,0,0-.549,1.618v1.406h-1.292V-5.3h1.292Zm6.916-9.974c.736,0,1.014-.36,1.014-.867v-.294c0-.507-.278-.867-1.014-.867s-1.014.36-1.014.867v.294c0,.507.279.867,1.015.867Zm3.27,0c.736,0,1.014-.36,1.014-.867v-.294c0-.507-.278-.867-1.014-.867s-1.014.36-1.014.867v.294c0,.507.279.867,1.015.867ZM119,1.749h1.782v-8.5H119v5.69c0,1-.9,1.472-1.815,1.472-1.1,0-1.635-.687-1.635-1.978V-6.754h-1.782v5.412c0,2.093,1.03,3.286,2.78,3.286a2.337,2.337,0,0,0,2.387-1.6H119Zm11.789.8c0-1.472-.883-2.354-2.976-2.354H125.72c-.752,0-1.194-.18-1.194-.638,0-.425.392-.7.818-.85a4.511,4.511,0,0,0,1.112.131c2.158,0,3.4-1.161,3.4-2.878a2.663,2.663,0,0,0-1.194-2.3v-.343H130.4V-8.127h-1.308c-.752,0-1.112.458-1.112,1.21v.229a4.1,4.1,0,0,0-1.537-.262c-2.158,0-3.385,1.177-3.385,2.91a2.655,2.655,0,0,0,1.553,2.518v.065c-.818.2-1.5.621-1.5,1.5a1.3,1.3,0,0,0,.965,1.308v.18a1.593,1.593,0,0,0-1.455,1.635c0,1.292,1.079,2.044,3.859,2.044,3.053.005,4.311-.894,4.311-2.66Zm-1.668.2c0,.785-.687,1.177-2.076,1.177H125.93c-1.324,0-1.831-.474-1.831-1.161a1.1,1.1,0,0,1,.589-.981h2.878c1.16,0,1.553.373,1.553.962Zm-2.665-5.2c-1.046,0-1.651-.474-1.651-1.439v-.327c0-.965.6-1.439,1.651-1.439s1.651.474,1.651,1.439v.327c0,.962-.607,1.437-1.653,1.437Zm8.895,4.4A3.944,3.944,0,0,0,138.815.228L137.768-.8a2.492,2.492,0,0,1-2.24,1.275,2.086,2.086,0,0,1-1.635-.6,2.086,2.086,0,0,1-.6-1.635v-.278h5.837v-.67c0-2.354-1.275-4.235-3.777-4.235-2.42,0-3.908,1.733-3.908,4.447s1.488,4.446,3.908,4.446Zm0-7.5A1.913,1.913,0,0,1,136.8-4.9a1.913,1.913,0,0,1,.454,1.521v.164h-3.957v-.114a2.047,2.047,0,0,1,.532-1.573,2.047,2.047,0,0,1,1.522-.661Zm7.538,7.309v-5.69c0-1,.916-1.472,1.848-1.472,1.1,0,1.6.67,1.6,1.995V1.749h1.782v-5.4c0-2.093-1.03-3.3-2.763-3.3a2.371,2.371,0,0,0-2.387,1.6h-.082v-1.4H141.1v8.5ZM0,2.917H121.443V4.084H0Zm131.954,0h17.357V4.084H131.954Z" transform="translate(-21586.764 334.589)" fill="#0032d9"/>
    <path id="Linie_382" data-name="Linie 382" d="M.126,11.545a.876.876,0,0,1-.876-.876V.126A.876.876,0,1,1,1,.126V10.669a.876.876,0,0,1-.874.876Z" transform="translate(-21600.904 325.52)" fill="#0032d9"/>
    <path id="Linie_383" data-name="Linie 383" d="M10.669,1H.126a.876.876,0,1,1,0-1.752H10.669a.876.876,0,1,1,0,1.752Z" transform="translate(-21606.176 330.791)" fill="#0032d9"/>
    <rect id="Rechteck_6261" data-name="Rechteck 6261" width="648" height="440" transform="translate(-21974 270)" fill="none"/>
    <rect id="Rechteck_6262" data-name="Rechteck 6262" width="648" height="440" transform="translate(-21974 270)" fill="none"/>
    <path id="Pfad_17639" data-name="Pfad 17639" d="M3.33-7.236v1.314H4.806c1.764,0,2.7.846,2.7,2.322v.144c0,1.476-.936,2.322-2.7,2.322A3.125,3.125,0,0,1,1.89-2.79L.756-1.926A4.623,4.623,0,0,0,4.824.216C7.38.216,9.09-1.278,9.09-3.438A3.117,3.117,0,0,0,6.444-6.606v-.072A2.956,2.956,0,0,0,8.856-9.612c0-2.034-1.692-3.168-3.816-3.168A4.155,4.155,0,0,0,1.3-10.728l1.116.864A2.737,2.737,0,0,1,5-11.43c1.332,0,2.25.666,2.25,1.98v.126c0,1.206-.864,2.088-2.556,2.088ZM20.412,0V-1.332h-3.24V-12.564H14.814L11.484-9.45l.882.954,3.168-2.952h.126V-1.332H12.15V0ZM23.58.216a.972.972,0,0,0,.8-.258.972.972,0,0,0,.3-.786v-.234a.972.972,0,0,0-.3-.786.972.972,0,0,0-.8-.258.972.972,0,0,0-.8.258.972.972,0,0,0-.3.786v.234a.972.972,0,0,0,.3.786.972.972,0,0,0,.8.258Zm7.614,0c3.006,0,4.32-2.394,4.32-6.5s-1.314-6.5-4.32-6.5-4.32,2.394-4.32,6.5S28.188.216,31.194.216Zm0-1.314c-1.962,0-2.736-1.728-2.736-4.158V-7.308c0-2.43.774-4.158,2.736-4.158S33.93-9.738,33.93-7.308v2.052c0,2.43-.774,4.156-2.736,4.156ZM46.206,0V-1.332h-3.24V-12.564H40.608L37.278-9.45l.882.954,3.168-2.952h.126V-1.332h-3.51V0Zm3.168.216a.972.972,0,0,0,.8-.258.972.972,0,0,0,.3-.786v-.234a.972.972,0,0,0-.3-.786.972.972,0,0,0-.8-.258.972.972,0,0,0-.8.258.972.972,0,0,0-.3.786v.234a.972.972,0,0,0,.3.786.972.972,0,0,0,.8.258Zm12.15-5V-6.156H52.236v1.368ZM5.4,23.216c3.006,0,4.32-2.394,4.32-6.5s-1.314-6.5-4.32-6.5-4.32,2.394-4.32,6.5S2.394,23.216,5.4,23.216Zm0-1.314c-1.962,0-2.736-1.728-2.736-4.158V15.692c0-2.43.774-4.158,2.736-4.158s2.736,1.728,2.736,4.158v2.052c0,2.43-.774,4.156-2.736,4.156Zm10.584,1.314a3.944,3.944,0,0,0,4.176-4.158,3.588,3.588,0,0,0-3.708-3.87,3.281,3.281,0,0,0-3.024,1.8l-.09-.036c.684-2.916,2.178-4.554,4.86-6.516H16.254a9.934,9.934,0,0,0-4.482,7.956c0,2.988,1.6,4.824,4.212,4.824ZM15.966,21.9a2.4,2.4,0,0,1-2.628-2.646V19.11a2.4,2.4,0,0,1,2.628-2.646,2.4,2.4,0,0,1,2.628,2.646v.144A2.4,2.4,0,0,1,15.966,21.9Zm7.614,1.314a.972.972,0,0,0,1.1-1.044v-.234a.972.972,0,0,0-1.1-1.044.972.972,0,0,0-1.1,1.044v.234a.972.972,0,0,0,1.1,1.046Zm7.614,0c3.006,0,4.32-2.394,4.32-6.5s-1.314-6.5-4.32-6.5-4.32,2.394-4.32,6.5,1.314,6.5,4.32,6.5Zm0-1.314c-1.962,0-2.736-1.728-2.736-4.158v-2.05c0-2.43.774-4.158,2.736-4.158s2.736,1.728,2.736,4.158v2.052C33.93,20.174,33.156,21.9,31.194,21.9Zm14.76-.234H39.348l3.384-3.042c1.6-1.44,2.754-2.808,2.754-4.752a3.5,3.5,0,0,0-3.852-3.654A3.967,3.967,0,0,0,37.6,13.172l1.35.522a2.556,2.556,0,0,1,2.61-2.124,2.134,2.134,0,0,1,2.322,2.34v.216a5.4,5.4,0,0,1-2.07,3.546l-4.1,3.78V23h8.244Zm3.42,1.548a.972.972,0,0,0,1.1-1.044v-.234a1.1,1.1,0,0,0-2.2,0v.234a.972.972,0,0,0,1.1,1.046Z" transform="translate(-21926 363)" fill="#595959"/>
    <path id="Pfad_17638" data-name="Pfad 17638" d="M5.4.216c3.006,0,4.32-2.394,4.32-6.5s-1.314-6.5-4.32-6.5-4.32,2.394-4.32,6.5S2.394.216,5.4.216ZM5.4-1.1c-1.962,0-2.736-1.728-2.736-4.158v-2.05c0-2.43.774-4.158,2.736-4.158S8.136-9.738,8.136-7.308v2.052C8.136-2.826,7.362-1.1,5.4-1.1ZM15.336,0l4.716-11.232v-1.332H11.808v3.636h1.35v-2.34h5.364L13.716,0ZM23.58.216a.972.972,0,0,0,.8-.258.972.972,0,0,0,.3-.786v-.234a.972.972,0,0,0-.3-.786.972.972,0,0,0-.8-.258.972.972,0,0,0-.8.258.972.972,0,0,0-.3.786v.234a.972.972,0,0,0,.3.786.972.972,0,0,0,.8.258Zm7.614,0c3.006,0,4.32-2.394,4.32-6.5s-1.314-6.5-4.32-6.5-4.32,2.394-4.32,6.5S28.188.216,31.194.216Zm0-1.314c-1.962,0-2.736-1.728-2.736-4.158V-7.308c0-2.43.774-4.158,2.736-4.158S33.93-9.738,33.93-7.308v2.052c0,2.43-.774,4.156-2.736,4.156Zm14.76-.234H39.348l3.384-3.042c1.6-1.44,2.754-2.808,2.754-4.752a3.5,3.5,0,0,0-1.089-2.71,3.505,3.505,0,0,0-2.763-.944A3.967,3.967,0,0,0,37.6-9.828l1.35.522a2.556,2.556,0,0,1,2.61-2.124,2.134,2.134,0,0,1,1.714.622,2.134,2.134,0,0,1,.608,1.718v.216a5.4,5.4,0,0,1-2.07,3.546l-4.1,3.78V0h8.244ZM49.374.216a.972.972,0,0,0,.8-.258.972.972,0,0,0,.3-.786v-.234a.972.972,0,0,0-.3-.786.972.972,0,0,0-.8-.258.972.972,0,0,0-.8.258.972.972,0,0,0-.3.786v.234a.972.972,0,0,0,.3.786.972.972,0,0,0,.8.258Zm12.15-5V-6.156H52.236v1.368ZM9.846,23V21.668H6.606V10.436H4.248L.918,13.55l.882.95,3.168-2.952h.126v10.12H1.584V23Zm4.05-7.236v1.314h1.476c1.764,0,2.7.846,2.7,2.322v.144c0,1.476-.936,2.322-2.7,2.322a3.125,3.125,0,0,1-2.916-1.656l-1.134.864a4.623,4.623,0,0,0,4.068,2.142c2.556,0,4.266-1.494,4.266-3.654a3.117,3.117,0,0,0-2.646-3.168v-.072a2.956,2.956,0,0,0,2.412-2.934c0-2.034-1.692-3.168-3.816-3.168a4.155,4.155,0,0,0-3.744,2.052l1.116.864A2.737,2.737,0,0,1,15.57,11.57c1.332,0,2.25.666,2.25,1.98v.126c0,1.206-.864,2.088-2.556,2.088Zm9.684,7.452a.972.972,0,0,0,1.1-1.044v-.234a.972.972,0,0,0-1.1-1.044.972.972,0,0,0-1.1,1.044v.234a.972.972,0,0,0,1.1,1.044Zm7.614,0c3.006,0,4.32-2.394,4.32-6.5s-1.314-6.5-4.32-6.5-4.32,2.394-4.32,6.5S28.188,23.216,31.194,23.216Zm0-1.314c-1.962,0-2.736-1.728-2.736-4.158V15.692c0-2.43.774-4.158,2.736-4.158s2.736,1.728,2.736,4.158v2.052c0,2.43-.774,4.156-2.736,4.156Zm14.76-.234H39.348l3.384-3.042c1.6-1.44,2.754-2.808,2.754-4.752a3.5,3.5,0,0,0-3.852-3.654A3.967,3.967,0,0,0,37.6,13.172l1.35.522a2.556,2.556,0,0,1,2.61-2.124,2.134,2.134,0,0,1,2.322,2.34v.216a5.4,5.4,0,0,1-2.07,3.546l-4.1,3.78V23h8.244Zm3.42,1.548a.972.972,0,0,0,1.1-1.044v-.234a1.1,1.1,0,0,0-2.2,0v.234a.972.972,0,0,0,1.1,1.044Z" transform="translate(-21743 363)" fill="#595959"/>
    <path id="Pfad_17640" data-name="Pfad 17640" d="M3.98,0V-6.08H9.72v-2H3.98v-3.88h6.46v-2H1.72V0ZM16.56.24a4.825,4.825,0,0,0,4.24-2.1L19.52-3.12a3.048,3.048,0,0,1-2.74,1.56,2.551,2.551,0,0,1-2-.74,2.551,2.551,0,0,1-.74-2v-.34h7.14v-.82c0-2.88-1.56-5.18-4.62-5.18-2.96,0-4.78,2.12-4.78,5.44S13.6.24,16.56.24Zm0-9.18c1.44,0,2.32,1.06,2.32,2.66v.2H14.04v-.14A2.5,2.5,0,0,1,14.7-8.139a2.5,2.5,0,0,1,1.864-.8ZM23.68,0h2.18V-1.72h.1A2.97,2.97,0,0,0,28.88.24c2.62,0,4.14-2.02,4.14-5.44s-1.52-5.44-4.14-5.44a2.944,2.944,0,0,0-2.92,1.96h-.1V-14.8H23.68Zm4.54-1.64c-1.32,0-2.36-.72-2.36-1.78V-6.98c0-1.06,1.04-1.78,2.36-1.78a2.439,2.439,0,0,1,1.848.768A2.439,2.439,0,0,1,30.72-6.1v1.8a2.439,2.439,0,0,1-.652,1.892,2.439,2.439,0,0,1-1.848.768ZM37.78,0V-6.64c0-1.08.96-1.66,2.68-1.66h.86v-2.1h-.58a2.75,2.75,0,0,0-2.86,2h-.1v-2H35.6V0Zm5.3.24A1.3,1.3,0,0,0,44.128-.1,1.3,1.3,0,0,0,44.54-1.12v-.3a1.3,1.3,0,0,0-.412-1.021A1.3,1.3,0,0,0,43.08-2.78a1.3,1.3,0,0,0-1.048.339A1.3,1.3,0,0,0,41.62-1.42v.3A1.3,1.3,0,0,0,42.032-.1,1.3,1.3,0,0,0,43.08.24Zm18.6-2.16H54.64l3.28-2.82c1.84-1.58,3.34-3.06,3.34-5.32,0-2.42-1.64-4.14-4.48-4.14A4.692,4.692,0,0,0,52-10.8l1.98.76a2.605,2.605,0,0,1,2.62-2.2,2.07,2.07,0,0,1,1.631.571,2.07,2.07,0,0,1,.629,1.609v.26c0,1.28-.8,2.4-2.2,3.66L52.2-2.16V0h9.48ZM68.94.24C72.42.24,74-2.42,74-6.98s-1.58-7.22-5.06-7.22-5.06,2.66-5.06,7.22S65.46.24,68.94.24Zm0-1.92c-1.94,0-2.66-1.64-2.66-4.08V-8.2c0-2.44.72-4.08,2.66-4.08S71.6-10.64,71.6-8.2v2.44C71.6-3.32,70.88-1.68,68.94-1.68Zm16.9-.24H78.8l3.28-2.82c1.84-1.58,3.34-3.06,3.34-5.32,0-2.42-1.64-4.14-4.48-4.14a4.692,4.692,0,0,0-4.78,3.4l1.98.76a2.6,2.6,0,0,1,2.62-2.2,2.07,2.07,0,0,1,1.631.571,2.07,2.07,0,0,1,.629,1.609v.26c0,1.28-.8,2.4-2.2,3.66L76.36-2.16V0h9.48Zm5.08-6.3V-6.3H92.4c1.76,0,2.76.78,2.76,2.2v.14c0,1.44-.94,2.3-2.64,2.3a3.343,3.343,0,0,1-3.12-1.9l-1.66,1.3A5.312,5.312,0,0,0,92.52.24C95.5.24,97.5-1.4,97.5-3.84A3.378,3.378,0,0,0,94.58-7.3v-.1a3.207,3.207,0,0,0,2.68-3.2c0-2.26-1.9-3.6-4.54-3.6a5,5,0,0,0-4.44,2.3l1.5,1.3a3.2,3.2,0,0,1,2.88-1.7,1.952,1.952,0,0,1,1.568.477,1.952,1.952,0,0,1,.652,1.5v.14c0,1.14-.82,1.96-2.54,1.96Z" transform="translate(-21925 322)"/>
    <path id="Pfad_17637" data-name="Pfad 17637" d="M6,.24c3.34,0,4.8-2.66,4.8-7.22S9.34-14.2,6-14.2,1.2-11.54,1.2-6.98,2.66.24,6,.24ZM6-1.22c-2.18,0-3.04-1.92-3.04-4.62V-8.12c0-2.7.86-4.62,3.04-4.62s3.04,1.92,3.04,4.62v2.28C9.04-3.14,8.18-1.22,6-1.22Zm16.26-.26H14.92l3.76-3.38c1.78-1.6,3.06-3.12,3.06-5.28,0-2.38-1.56-4.06-4.28-4.06a4.407,4.407,0,0,0-4.48,3.28l1.5.58a2.84,2.84,0,0,1,2.9-2.36,2.371,2.371,0,0,1,1.9.691A2.371,2.371,0,0,1,19.96-10.1v.24c0,1.34-1,2.74-2.3,3.94L13.1-1.72V0h9.16ZM25.92.24a1.08,1.08,0,0,0,.888-.288A1.08,1.08,0,0,0,27.14-.92v-.26a1.08,1.08,0,0,0-.332-.872,1.08,1.08,0,0,0-.888-.288,1.08,1.08,0,0,0-.888.288,1.08,1.08,0,0,0-.332.872v.26a1.08,1.08,0,0,0,.332.872A1.08,1.08,0,0,0,25.92.24Zm8.32,0c3.34,0,4.8-2.66,4.8-7.22s-1.46-7.22-4.8-7.22-4.8,2.66-4.8,7.22S30.9.24,34.24.24Zm0-1.46c-2.18,0-3.04-1.92-3.04-4.62V-8.12c0-2.7.86-4.62,3.04-4.62s3.04,1.92,3.04,4.62v2.28c0,2.7-.86,4.62-3.04,4.62ZM50.5-1.48H43.16l3.76-3.38c1.78-1.6,3.06-3.12,3.06-5.28,0-2.38-1.56-4.06-4.28-4.06a4.407,4.407,0,0,0-4.48,3.28l1.5.58a2.84,2.84,0,0,1,2.9-2.36,2.371,2.371,0,0,1,1.9.691A2.371,2.371,0,0,1,48.2-10.1v.24c0,1.34-1,2.74-2.3,3.94l-4.56,4.2V0H50.5ZM54.16.24a1.08,1.08,0,0,0,.888-.288A1.08,1.08,0,0,0,55.38-.92v-.26a1.08,1.08,0,0,0-.332-.872,1.08,1.08,0,0,0-.888-.288,1.08,1.08,0,0,0-.888.288,1.08,1.08,0,0,0-.332.872v.26a1.08,1.08,0,0,0,.332.872A1.08,1.08,0,0,0,54.16.24ZM67.14-1.48H59.8l3.76-3.38c1.78-1.6,3.06-3.12,3.06-5.28,0-2.38-1.56-4.06-4.28-4.06a4.407,4.407,0,0,0-4.48,3.28l1.5.58a2.84,2.84,0,0,1,2.9-2.36,2.371,2.371,0,0,1,1.9.691A2.371,2.371,0,0,1,64.84-10.1v.24c0,1.34-1,2.74-2.3,3.94l-4.56,4.2V0h9.16ZM74.08.24c3.34,0,4.8-2.66,4.8-7.22s-1.46-7.22-4.8-7.22-4.8,2.66-4.8,7.22S70.74.24,74.08.24Zm0-1.46c-2.18,0-3.04-1.92-3.04-4.62V-8.12c0-2.7.86-4.62,3.04-4.62s3.04,1.92,3.04,4.62v2.28C77.12-3.14,76.26-1.22,74.08-1.22Zm16.26-.26H83l3.76-3.38c1.78-1.6,3.06-3.12,3.06-5.28,0-2.38-1.56-4.06-4.28-4.06a4.407,4.407,0,0,0-4.48,3.28l1.5.58a2.84,2.84,0,0,1,2.9-2.36,2.371,2.371,0,0,1,1.9.691A2.371,2.371,0,0,1,88.04-10.1v.24c0,1.34-1,2.74-2.3,3.94l-4.56,4.2V0h9.16Zm4.64-6.56v1.46h1.64c1.96,0,3,.94,3,2.58v.16c0,1.64-1.04,2.58-3,2.58A3.472,3.472,0,0,1,93.38-3.1l-1.26.96A5.137,5.137,0,0,0,96.64.24c2.84,0,4.74-1.66,4.74-4.06a3.463,3.463,0,0,0-2.94-3.52v-.08a3.285,3.285,0,0,0,2.68-3.26c0-2.26-1.88-3.52-4.24-3.52a4.617,4.617,0,0,0-4.16,2.28l1.24.96a3.041,3.041,0,0,1,2.88-1.74c1.48,0,2.5.74,2.5,2.2v.14c0,1.34-.96,2.32-2.84,2.32Zm23.26,2.72V-6.84H107.92v1.52ZM133.82,0V-1.48h-3.6V-13.96H127.6l-3.7,3.46.98,1.06,3.52-3.28h.14V-1.48h-3.9V0Zm6.66.24c3.34,0,4.8-2.66,4.8-7.22s-1.46-7.22-4.8-7.22-4.8,2.66-4.8,7.22,1.46,7.22,4.8,7.22Zm0-1.46c-2.18,0-3.04-1.92-3.04-4.62V-8.12c0-2.7.86-4.62,3.04-4.62s3.04,1.92,3.04,4.62v2.28c0,2.7-.86,4.62-3.04,4.62ZM148.8.24a1.08,1.08,0,0,0,.888-.288,1.08,1.08,0,0,0,.332-.872v-.26a1.08,1.08,0,0,0-.332-.872,1.08,1.08,0,0,0-.888-.288,1.08,1.08,0,0,0-.888.288,1.08,1.08,0,0,0-.332.872v.26a1.08,1.08,0,0,0,.332.872A1.08,1.08,0,0,0,148.8.24Zm8.32,0c3.34,0,4.8-2.66,4.8-7.22s-1.46-7.22-4.8-7.22-4.8,2.66-4.8,7.22S153.78.24,157.12.24Zm0-1.46c-2.18,0-3.04-1.92-3.04-4.62V-8.12c0-2.7.86-4.62,3.04-4.62s3.04,1.92,3.04,4.62v2.28C160.16-3.14,159.3-1.22,157.12-1.22Zm16.26-.26h-7.34l3.76-3.38c1.78-1.6,3.06-3.12,3.06-5.28,0-2.38-1.56-4.06-4.28-4.06a4.407,4.407,0,0,0-4.48,3.28l1.5.58a2.84,2.84,0,0,1,2.9-2.36,2.371,2.371,0,0,1,1.9.691,2.371,2.371,0,0,1,.676,1.909v.24c0,1.34-1,2.74-2.3,3.94l-4.56,4.2V0h9.16ZM177.04.24a1.08,1.08,0,0,0,.888-.288,1.08,1.08,0,0,0,.332-.872v-.26a1.08,1.08,0,0,0-.332-.872,1.08,1.08,0,0,0-.888-.288,1.08,1.08,0,0,0-.888.288,1.08,1.08,0,0,0-.332.872v.26a1.08,1.08,0,0,0,.332.872,1.08,1.08,0,0,0,.888.288Zm12.98-1.72h-7.34l3.76-3.38c1.78-1.6,3.06-3.12,3.06-5.28,0-2.38-1.56-4.06-4.28-4.06a4.407,4.407,0,0,0-4.48,3.28l1.5.58a2.84,2.84,0,0,1,2.9-2.36,2.371,2.371,0,0,1,1.9.691,2.371,2.371,0,0,1,.676,1.909v.24c0,1.34-1,2.74-2.3,3.94l-4.56,4.2V0h9.16ZM196.96.24c3.34,0,4.8-2.66,4.8-7.22s-1.46-7.22-4.8-7.22-4.8,2.66-4.8,7.22S193.62.24,196.96.24Zm0-1.46c-2.18,0-3.04-1.92-3.04-4.62V-8.12c0-2.7.86-4.62,3.04-4.62S200-10.82,200-8.12v2.28C200-3.14,199.14-1.22,196.96-1.22Zm16.26-.26h-7.34l3.76-3.38c1.78-1.6,3.06-3.12,3.06-5.28,0-2.38-1.56-4.06-4.28-4.06a4.407,4.407,0,0,0-4.48,3.28l1.5.58a2.84,2.84,0,0,1,2.9-2.36,2.371,2.371,0,0,1,1.9.691,2.371,2.371,0,0,1,.676,1.909v.24c0,1.34-1,2.74-2.3,3.94l-4.56,4.2V0h9.16Zm4.64-6.56v1.46h1.64c1.96,0,3,.94,3,2.58v.16c0,1.64-1.04,2.58-3,2.58a3.472,3.472,0,0,1-3.24-1.84L215-2.14A5.137,5.137,0,0,0,219.52.24c2.84,0,4.74-1.66,4.74-4.06a3.463,3.463,0,0,0-2.94-3.52v-.08A3.285,3.285,0,0,0,224-10.68c0-2.26-1.88-3.52-4.24-3.52a4.617,4.617,0,0,0-4.16,2.28l1.24.96a3.041,3.041,0,0,1,2.88-1.74c1.48,0,2.5.74,2.5,2.2v.14c0,1.34-.96,2.32-2.84,2.32ZM10.6,25h1.68V11.04H10.6V17.2H3.54V11.04H1.86V25H3.54V18.68H10.6Zm13.24,0V23.6H22.66V17.92c0-2.18-1.48-3.48-3.96-3.48a3.923,3.923,0,0,0-3.66,2.02l.96.9a2.881,2.881,0,0,1,2.62-1.54c1.64,0,2.44.8,2.44,2.26V19.1H19.02c-3,0-4.4,1.08-4.4,3.02,0,1.92,1.28,3.12,3.46,3.12a2.915,2.915,0,0,0,2.98-1.92h.1A1.667,1.667,0,0,0,22.94,25Zm-5.5-1.12c-1.24,0-2.04-.58-2.04-1.6v-.42c0-1,.82-1.56,2.64-1.56h2.12V22C21.06,23.06,19.92,23.88,18.34,23.88ZM32.08,25h1.6V14.68h-1.6v7.14c0,1.36-1.24,1.98-2.5,1.98-1.54,0-2.36-.94-2.36-2.78V14.68h-1.6V21.3c0,2.5,1.36,3.94,3.48,3.94A2.868,2.868,0,0,0,32,23.32h.08Zm7.7.24c2.36,0,3.82-1.22,3.82-3.22,0-1.56-.88-2.56-3.16-2.9l-.8-.12c-1.28-.2-1.98-.6-1.98-1.6,0-.98.7-1.6,2.02-1.6a3.184,3.184,0,0,1,2.66,1.26l1.06-.96a4.3,4.3,0,0,0-3.6-1.66c-2.1,0-3.68,1-3.68,3.04,0,1.92,1.42,2.7,3.32,2.98l.82.12c1.36.2,1.8.82,1.8,1.62,0,1.06-.8,1.68-2.16,1.68a3.746,3.746,0,0,1-3.06-1.58l-1.14.92a4.8,4.8,0,0,0,4.08,2.02ZM54.42,25V23.6H53.24V17.92c0-2.18-1.48-3.48-3.96-3.48a3.923,3.923,0,0,0-3.66,2.02l.96.9a2.881,2.881,0,0,1,2.62-1.54c1.64,0,2.44.8,2.44,2.26V19.1H49.6c-3,0-4.4,1.08-4.4,3.02,0,1.92,1.28,3.12,3.46,3.12a2.915,2.915,0,0,0,2.98-1.92h.1A1.667,1.667,0,0,0,53.52,25Zm-5.5-1.12c-1.24,0-2.04-.58-2.04-1.6v-.42c0-1,.82-1.56,2.64-1.56h2.12V22C51.64,23.06,50.5,23.88,48.92,23.88ZM56.3,25h1.6V23.32h.08A3.111,3.111,0,0,0,61,25.24c2.58,0,4.2-2.1,4.2-5.4s-1.62-5.4-4.2-5.4a3.014,3.014,0,0,0-3.02,1.92H57.9V10.2H56.3Zm4.26-1.2c-1.46,0-2.66-.76-2.66-2.1V17.86c0-1.14,1.2-1.98,2.66-1.98a2.816,2.816,0,0,1,2.92,3.08v1.76a2.816,2.816,0,0,1-2.92,3.08ZM70.6,25.24c2.36,0,3.82-1.22,3.82-3.22,0-1.56-.88-2.56-3.16-2.9l-.8-.12c-1.28-.2-1.98-.6-1.98-1.6,0-.98.7-1.6,2.02-1.6a3.184,3.184,0,0,1,2.66,1.26l1.06-.96a4.3,4.3,0,0,0-3.6-1.66c-2.1,0-3.68,1-3.68,3.04,0,1.92,1.42,2.7,3.32,2.98l.82.12c1.36.2,1.8.82,1.8,1.62,0,1.06-.8,1.68-2.16,1.68a3.746,3.746,0,0,1-3.06-1.58l-1.14.92a4.8,4.8,0,0,0,4.08,2.02ZM80.98,25V23.6h-2.1V16.08h2.26v-1.4H78.88V11.82H77.44v1.92c0,.7-.22.94-.9.94h-.96v1.4h1.7V23.3a1.576,1.576,0,0,0,1.7,1.7Zm3.14-12.74c.68,0,.98-.36.98-.9V11.1c0-.54-.3-.9-.98-.9s-.98.36-.98.9v.26C83.14,11.9,83.44,12.26,84.12,12.26ZM83.32,25h1.6V14.68h-1.6Zm6.2,0V17.84c0-1.32,1.2-1.96,2.46-1.96,1.52,0,2.22.94,2.22,2.78V25h1.6V17.84c0-1.32,1.16-1.96,2.42-1.96,1.56,0,2.26.96,2.26,2.78V25h1.6V18.38c0-2.5-1.26-3.94-3.36-3.94a3.1,3.1,0,0,0-3.14,2.1h-.04a3.176,3.176,0,0,0-3.16-2.1,2.777,2.777,0,0,0-2.78,1.92h-.08V14.68h-1.6V25Zm17.06,0V17.84c0-1.32,1.2-1.96,2.46-1.96,1.52,0,2.22.94,2.22,2.78V25h1.6V17.84c0-1.32,1.16-1.96,2.42-1.96,1.56,0,2.26.96,2.26,2.78V25h1.6V18.38c0-2.5-1.26-3.94-3.36-3.94a3.1,3.1,0,0,0-3.14,2.1h-.04a3.176,3.176,0,0,0-3.16-2.1,2.777,2.777,0,0,0-2.78,1.92h-.08V14.68h-1.6V25Zm21.82,0H130V14.68h-1.6v7.14c0,1.36-1.24,1.98-2.5,1.98-1.54,0-2.36-.94-2.36-2.78V14.68h-1.6V21.3c0,2.5,1.36,3.94,3.48,3.94a2.868,2.868,0,0,0,2.9-1.92h.08Zm6.2,0V17.84c0-1.32,1.24-1.96,2.52-1.96,1.54,0,2.34.94,2.34,2.78V25h1.6V18.38c0-2.5-1.34-3.94-3.46-3.94a2.926,2.926,0,0,0-2.92,1.92h-.08V14.68H133V25Zm18.06,1.14c0-1.7-1.1-2.74-3.66-2.74h-2.2c-.94,0-1.58-.16-1.58-.78,0-.64.68-.98,1.36-1.16a5.3,5.3,0,0,0,1,.1c2.36,0,3.9-1.46,3.9-3.56a3.43,3.43,0,0,0-1.18-2.66v-.66h1.96v-1.4h-1.54c-.86,0-1.2.58-1.2,1.38v.18a4.633,4.633,0,0,0-1.96-.4c-2.34,0-3.88,1.46-3.88,3.56a3.355,3.355,0,0,0,1.94,3.16v.08c-1.04.26-1.78.76-1.78,1.8a1.5,1.5,0,0,0,.92,1.44v.22a1.935,1.935,0,0,0-1.64,2c0,1.62,1.32,2.54,4.54,2.54,3.32,0,5-.98,5-3.1Zm-1.5.12c0,1.12-1.04,1.68-2.82,1.68h-1.48c-1.62,0-2.24-.74-2.24-1.64a1.44,1.44,0,0,1,.96-1.4h3.44c1.6,0,2.14.54,2.14,1.36Zm-3.58-5.98c-1.36,0-2.22-.64-2.22-2v-.56c0-1.36.86-2,2.22-2s2.22.64,2.22,2v.56c0,1.36-.86,2-2.22,2Z" transform="translate(-21879 450)" fill="#fff"/>
    <g id="Gruppe_maskieren_145" data-name="Gruppe maskieren 145" clip-path="url(#clip-path)">
      <path id="Pfad_17642" data-name="Pfad 17642" d="M7.2.288c4.008,0,5.76-3.192,5.76-8.664S11.208-17.04,7.2-17.04,1.44-13.848,1.44-8.376,3.192.288,7.2.288Zm0-1.752c-2.616,0-3.648-2.3-3.648-5.544V-9.744c0-3.24,1.032-5.544,3.648-5.544s3.648,2.3,3.648,5.544v2.736C10.848-3.768,9.816-1.464,7.2-1.464Zm19.416-.312H17.808L22.32-5.832c2.136-1.92,3.672-3.744,3.672-6.336,0-2.856-1.872-4.872-5.136-4.872A5.289,5.289,0,0,0,15.48-13.1l1.8.7a3.408,3.408,0,0,1,3.48-2.832,2.845,2.845,0,0,1,2.288.827,2.845,2.845,0,0,1,.812,2.293v.288c0,1.608-1.2,3.288-2.76,4.728l-5.472,5.04V0H26.616Zm4.3,2.064a1.3,1.3,0,0,0,1.059-.347,1.3,1.3,0,0,0,.4-1.041v-.312a1.3,1.3,0,0,0-.4-1.045A1.3,1.3,0,0,0,30.912-2.8a1.3,1.3,0,0,0-1.064.347,1.3,1.3,0,0,0-.4,1.045V-1.1a1.3,1.3,0,0,0,.4,1.042,1.3,1.3,0,0,0,1.062.346Zm9.888,0c4.008,0,5.76-3.192,5.76-8.664S44.808-17.04,40.8-17.04s-5.76,3.192-5.76,8.664S36.792.288,40.8.288Zm0-1.752c-2.616,0-3.648-2.3-3.648-5.544V-9.744c0-3.24,1.032-5.544,3.648-5.544s3.648,2.3,3.648,5.544v2.736c0,3.24-1.036,5.544-3.652,5.544ZM60.22-1.776H51.408L55.92-5.832c2.136-1.92,3.672-3.744,3.672-6.336,0-2.856-1.872-4.872-5.136-4.872A5.289,5.289,0,0,0,49.08-13.1l1.8.7a3.408,3.408,0,0,1,3.48-2.832,2.845,2.845,0,0,1,2.288.827,2.845,2.845,0,0,1,.812,2.293v.288c0,1.608-1.2,3.288-2.76,4.728l-5.472,5.04V0H60.216ZM64.52.288a1.3,1.3,0,0,0,1.057-.349,1.3,1.3,0,0,0,.4-1.039v-.312a1.3,1.3,0,0,0-.4-1.045A1.3,1.3,0,0,0,64.512-2.8a1.3,1.3,0,0,0-1.064.347,1.3,1.3,0,0,0-.4,1.045V-1.1a1.3,1.3,0,0,0,.4,1.042,1.3,1.3,0,0,0,1.062.346ZM80-1.776H71.184L75.7-5.832c2.136-1.92,3.672-3.744,3.672-6.336,0-2.856-1.872-4.872-5.136-4.872a5.289,5.289,0,0,0-5.38,3.94l1.8.7a3.408,3.408,0,0,1,3.48-2.832,2.845,2.845,0,0,1,2.288.827,2.845,2.845,0,0,1,.812,2.293v.288c0,1.608-1.2,3.288-2.76,4.728L69-2.064V0H79.992ZM88.224.288c4.008,0,5.76-3.192,5.76-8.664s-1.752-8.664-5.76-8.664-5.76,3.192-5.76,8.664S84.216.288,88.224.288Zm0-1.752c-2.616,0-3.648-2.3-3.648-5.544V-9.744c0-3.24,1.032-5.544,3.648-5.544s3.648,2.3,3.648,5.544v2.736C91.872-3.768,90.84-1.464,88.224-1.464Zm19.416-.312H98.832l4.512-4.056c2.136-1.92,3.672-3.744,3.672-6.336,0-2.856-1.872-4.872-5.136-4.872A5.289,5.289,0,0,0,96.5-13.1l1.8.7a3.408,3.408,0,0,1,3.48-2.832,2.845,2.845,0,0,1,2.288.827,2.845,2.845,0,0,1,.812,2.293v.288c0,1.608-1.2,3.288-2.76,4.728l-5.472,5.04V0H107.64Zm5.472-7.872V-7.9h1.968c2.352,0,3.6,1.128,3.6,3.1v.192c0,1.968-1.248,3.1-3.6,3.1a4.167,4.167,0,0,1-3.888-2.208L109.68-2.568A6.164,6.164,0,0,0,115.1.288c3.408,0,5.688-1.992,5.688-4.872a4.156,4.156,0,0,0-3.528-4.224v-.1a3.942,3.942,0,0,0,3.216-3.912c0-2.712-2.256-4.224-5.088-4.224A5.54,5.54,0,0,0,110.4-14.3l1.488,1.152a3.649,3.649,0,0,1,3.456-2.088c1.776,0,3,.888,3,2.64v.168c0,1.608-1.152,2.784-3.408,2.784Zm27.72,3.264V-8.208H128.448v1.824ZM159.336,0V-1.776h-4.32V-16.752h-3.144l-4.44,4.152,1.176,1.272,4.224-3.936H153V-1.776h-4.68V0Zm7.9.288C171.244.288,173-2.9,173-8.376s-1.752-8.664-5.76-8.664-5.76,3.192-5.76,8.664S163.224.288,167.232.288Zm0-1.752c-2.616,0-3.648-2.3-3.648-5.544V-9.744c0-3.24,1.032-5.544,3.648-5.544s3.648,2.3,3.648,5.544v2.736c0,3.24-1.036,5.544-3.652,5.544ZM177.12.288a1.3,1.3,0,0,0,1.062-.346,1.3,1.3,0,0,0,.4-1.042v-.312a1.3,1.3,0,0,0-.4-1.045A1.3,1.3,0,0,0,177.12-2.8a1.3,1.3,0,0,0-1.064.347,1.3,1.3,0,0,0-.4,1.045V-1.1a1.3,1.3,0,0,0,.4,1.042,1.3,1.3,0,0,0,1.062.346Zm9.888,0c4.008,0,5.76-3.192,5.76-8.664s-1.752-8.664-5.76-8.664-5.76,3.192-5.76,8.664S183,.288,187.008.288Zm0-1.752c-2.616,0-3.648-2.3-3.648-5.544V-9.744c0-3.24,1.032-5.544,3.648-5.544s3.648,2.3,3.648,5.544v2.736C190.656-3.768,189.624-1.464,187.008-1.464Zm19.416-.312h-8.808l4.512-4.056c2.136-1.92,3.672-3.744,3.672-6.336,0-2.856-1.872-4.872-5.136-4.872a5.289,5.289,0,0,0-5.376,3.936l1.8.7a3.408,3.408,0,0,1,3.48-2.832,2.845,2.845,0,0,1,2.288.827,2.845,2.845,0,0,1,.812,2.293v.288c0,1.608-1.2,3.288-2.76,4.728l-5.472,5.04V0h10.992Zm4.3,2.064a1.3,1.3,0,0,0,1.059-.347,1.3,1.3,0,0,0,.4-1.041v-.312a1.3,1.3,0,0,0-.4-1.045A1.3,1.3,0,0,0,210.72-2.8a1.3,1.3,0,0,0-1.064.347,1.3,1.3,0,0,0-.4,1.045V-1.1a1.3,1.3,0,0,0,.4,1.042,1.3,1.3,0,0,0,1.062.346ZM226.2-1.776h-8.808L221.9-5.832c2.136-1.92,3.672-3.744,3.672-6.336,0-2.856-1.872-4.872-5.136-4.872A5.289,5.289,0,0,0,215.06-13.1l1.8.7a3.408,3.408,0,0,1,3.48-2.832,2.845,2.845,0,0,1,2.288.827,2.845,2.845,0,0,1,.812,2.293v.288c0,1.608-1.2,3.288-2.76,4.728l-5.472,5.04V0H226.2ZM234.432.288c4.008,0,5.76-3.192,5.76-8.664s-1.752-8.664-5.76-8.664-5.76,3.192-5.76,8.664S230.424.288,234.432.288Zm0-1.752c-2.616,0-3.648-2.3-3.648-5.544V-9.744c0-3.24,1.032-5.544,3.648-5.544s3.648,2.3,3.648,5.544v2.736C238.08-3.768,237.048-1.464,234.432-1.464Zm19.416-.312H245.04l4.512-4.056c2.136-1.92,3.672-3.744,3.672-6.336,0-2.856-1.872-4.872-5.136-4.872a5.289,5.289,0,0,0-5.376,3.936l1.8.7a3.408,3.408,0,0,1,3.48-2.832,2.845,2.845,0,0,1,2.288.827,2.845,2.845,0,0,1,.812,2.293v.288c0,1.608-1.2,3.288-2.76,4.728L242.86-2.06V0h10.992Zm5.472-7.872V-7.9h1.968c2.352,0,3.6,1.128,3.6,3.1v.192c0,1.968-1.248,3.1-3.6,3.1A4.167,4.167,0,0,1,257.4-3.72l-1.512,1.152A6.164,6.164,0,0,0,261.312.288C264.72.288,267-1.7,267-4.584a4.156,4.156,0,0,0-3.528-4.224v-.1a3.942,3.942,0,0,0,3.216-3.912c0-2.712-2.256-4.224-5.088-4.224a5.54,5.54,0,0,0-4.992,2.736l1.488,1.152a3.649,3.649,0,0,1,3.456-2.088c1.776,0,3,.888,3,2.64v.168c0,1.608-1.152,2.784-3.408,2.784Z" transform="translate(-21866 546)" fill="#fff"/>
    </g>
    <g id="Gruppe_17488" data-name="Gruppe 17488">
      <path id="Pfad_17641" data-name="Pfad 17641" d="M7.2.288c4.008,0,5.76-3.192,5.76-8.664S11.208-17.04,7.2-17.04,1.44-13.848,1.44-8.376,3.192.288,7.2.288Zm0-1.752c-2.616,0-3.648-2.3-3.648-5.544V-9.744c0-3.24,1.032-5.544,3.648-5.544s3.648,2.3,3.648,5.544v2.736C10.848-3.768,9.816-1.464,7.2-1.464ZM20.256,0l6.288-14.976v-1.776H15.552V-11.9h1.8v-3.12H24.5L18.1,0Zm10.8.288a1.3,1.3,0,0,0,1.062-.346,1.3,1.3,0,0,0,.4-1.042v-.312a1.3,1.3,0,0,0-.4-1.045A1.3,1.3,0,0,0,31.056-2.8a1.3,1.3,0,0,0-1.064.347,1.3,1.3,0,0,0-.4,1.045V-1.1a1.3,1.3,0,0,0,.4,1.042,1.3,1.3,0,0,0,1.062.346Zm9.96,0c4.008,0,5.76-3.192,5.76-8.664s-1.752-8.664-5.76-8.664-5.76,3.192-5.76,8.664S37.008.288,41.016.288Zm0-1.752c-2.616,0-3.648-2.3-3.648-5.544V-9.744c0-3.24,1.032-5.544,3.648-5.544s3.648,2.3,3.648,5.544v2.736C44.664-3.768,43.632-1.464,41.016-1.464ZM60.5-1.776H51.7l4.512-4.056c2.136-1.92,3.672-3.744,3.672-6.336,0-2.856-1.872-4.872-5.136-4.872a5.289,5.289,0,0,0-5.38,3.94l1.8.7a3.408,3.408,0,0,1,3.48-2.832,2.845,2.845,0,0,1,2.288.827,2.845,2.845,0,0,1,.812,2.293v.288c0,1.608-1.2,3.288-2.76,4.728l-5.472,5.04V0H60.5ZM64.872.288a1.3,1.3,0,0,0,1.062-.346,1.3,1.3,0,0,0,.4-1.042v-.312a1.3,1.3,0,0,0-.4-1.045A1.3,1.3,0,0,0,64.872-2.8a1.3,1.3,0,0,0-1.064.347,1.3,1.3,0,0,0-.4,1.045V-1.1a1.3,1.3,0,0,0,.4,1.042,1.3,1.3,0,0,0,1.062.346ZM80.424-1.776H71.616l4.512-4.056c2.136-1.92,3.672-3.744,3.672-6.336,0-2.856-1.872-4.872-5.136-4.872a5.289,5.289,0,0,0-5.376,3.94l1.8.7a3.408,3.408,0,0,1,3.48-2.832,2.845,2.845,0,0,1,2.288.827,2.845,2.845,0,0,1,.812,2.293v.288c0,1.608-1.2,3.288-2.76,4.728l-5.472,5.04V0H80.424Zm8.3,2.064c4.008,0,5.76-3.192,5.76-8.664s-1.752-8.664-5.76-8.664-5.76,3.192-5.76,8.664S84.72.288,88.728.288Zm0-1.752c-2.616,0-3.648-2.3-3.648-5.544V-9.744c0-3.24,1.032-5.544,3.648-5.544s3.648,2.3,3.648,5.544v2.736c0,3.24-1.028,5.544-3.644,5.544Zm19.488-.312h-8.8l4.512-4.056c2.136-1.92,3.672-3.744,3.672-6.336,0-2.856-1.872-4.872-5.136-4.872A5.289,5.289,0,0,0,97.08-13.1l1.8.7a3.408,3.408,0,0,1,3.48-2.832,2.845,2.845,0,0,1,2.288.827,2.845,2.845,0,0,1,.812,2.293v.288c0,1.608-1.2,3.288-2.76,4.728l-5.472,5.04V0H108.22Zm5.544-7.872V-7.9h1.968c2.352,0,3.6,1.128,3.6,3.1v.192c0,1.968-1.248,3.1-3.6,3.1A4.167,4.167,0,0,1,111.84-3.72l-1.512,1.152A6.164,6.164,0,0,0,115.752.288c3.408,0,5.688-1.992,5.688-4.872a4.156,4.156,0,0,0-3.528-4.224v-.1a3.942,3.942,0,0,0,3.216-3.912c0-2.712-2.256-4.224-5.088-4.224a5.54,5.54,0,0,0-4.992,2.736l1.488,1.152a3.649,3.649,0,0,1,3.456-2.088c1.776,0,3,.888,3,2.64v.168c0,1.608-1.152,2.784-3.408,2.784ZM141.62-6.384V-8.208H129.24v1.824ZM160.272,0V-1.776h-4.32V-16.752h-3.144l-4.44,4.152,1.176,1.272,4.224-3.936h.168V-1.776h-4.68V0ZM167.4,0l6.288-14.976v-1.776H162.7V-11.9h1.8v-3.12h7.152L165.24,0Zm10.8.288a1.3,1.3,0,0,0,1.062-.346,1.3,1.3,0,0,0,.4-1.042v-.312a1.3,1.3,0,0,0-.4-1.048,1.3,1.3,0,0,0-1.066-.348,1.3,1.3,0,0,0-1.064.347,1.3,1.3,0,0,0-.4,1.045V-1.1a1.3,1.3,0,0,0,.4,1.042A1.3,1.3,0,0,0,178.2.288Zm9.96,0c4.008,0,5.76-3.192,5.76-8.664s-1.752-8.664-5.76-8.664-5.76,3.192-5.76,8.664S184.152.288,188.16.288Zm0-1.752c-2.616,0-3.648-2.3-3.648-5.544V-9.744c0-3.24,1.032-5.544,3.648-5.544s3.648,2.3,3.648,5.544v2.736C191.808-3.768,190.776-1.464,188.16-1.464Zm19.488-.312H198.84l4.512-4.056c2.136-1.92,3.672-3.744,3.672-6.336,0-2.856-1.872-4.872-5.136-4.872a5.289,5.289,0,0,0-5.376,3.936l1.8.7a3.408,3.408,0,0,1,3.48-2.832,2.845,2.845,0,0,1,2.288.827,2.845,2.845,0,0,1,.812,2.293v.288c0,1.608-1.2,3.288-2.76,4.728L196.66-2.06V0h10.992ZM212.016.288a1.3,1.3,0,0,0,1.062-.346,1.3,1.3,0,0,0,.4-1.042v-.312a1.3,1.3,0,0,0-.4-1.045,1.3,1.3,0,0,0-1.064-.347,1.3,1.3,0,0,0-1.064.347,1.3,1.3,0,0,0-.4,1.045V-1.1a1.3,1.3,0,0,0,.4,1.042,1.3,1.3,0,0,0,1.062.346Zm15.552-2.064H218.76l4.512-4.056c2.136-1.92,3.672-3.744,3.672-6.336,0-2.856-1.872-4.872-5.136-4.872a5.289,5.289,0,0,0-5.376,3.936l1.8.7a3.408,3.408,0,0,1,3.48-2.832,2.845,2.845,0,0,1,2.288.827,2.845,2.845,0,0,1,.812,2.293v.288c0,1.608-1.2,3.288-2.76,4.728L216.58-2.06V0h10.992Zm8.3,2.064c4.008,0,5.76-3.192,5.76-8.664s-1.752-8.664-5.76-8.664-5.76,3.192-5.76,8.664S231.864.288,235.872.288Zm0-1.752c-2.616,0-3.648-2.3-3.648-5.544V-9.744c0-3.24,1.032-5.544,3.648-5.544s3.648,2.3,3.648,5.544v2.736c0,3.24-1.028,5.544-3.644,5.544Zm19.488-.312h-8.808l4.512-4.056c2.136-1.92,3.672-3.744,3.672-6.336,0-2.856-1.872-4.872-5.136-4.872A5.289,5.289,0,0,0,244.22-13.1l1.8.7a3.408,3.408,0,0,1,3.48-2.832,2.845,2.845,0,0,1,2.288.827,2.845,2.845,0,0,1,.812,2.293v.288c0,1.608-1.2,3.288-2.76,4.728l-5.472,5.04V0H255.36ZM260.9-9.648V-7.9h1.968c2.352,0,3.6,1.128,3.6,3.1v.192c0,1.968-1.248,3.1-3.6,3.1a4.167,4.167,0,0,1-3.888-2.208l-1.512,1.152A6.164,6.164,0,0,0,262.9.288c3.408,0,5.688-1.992,5.688-4.872a4.156,4.156,0,0,0-3.528-4.224v-.1a3.942,3.942,0,0,0,3.216-3.912c0-2.712-2.256-4.224-5.088-4.224a5.54,5.54,0,0,0-4.992,2.736l1.488,1.152a3.649,3.649,0,0,1,3.456-2.088c1.776,0,3,.888,3,2.64v.168c0,1.608-1.152,2.784-3.408,2.784Z" transform="translate(-21736 640)" fill="#0032d9"/>
    </g>
  </g>
</svg>
