[
 {
   "bezeichnung": "Einarbeiten in die Vorgabe",
   "einfacherZeitaufwand": 2,
   "mittlererZeitaufwand": 35,
   "hoherZeitaufwand": 413
 },
 {
   "bezeichnung": "Beraten, Vorgespräche führen",
   "einfacherZeitaufwand": 4,
   "mittlererZeitaufwand": 30,
   "hoherZeitaufwand": 573
 },
 {
   "bezeichnung": "Formelle Prüfung, Daten sichten",
   "einfacherZeitaufwand": 5,
   "mittlererZeitaufwand": 30,
   "hoherZeitaufwand": 90
 },
 {
   "bezeichnung": "Eingang bestätigen oder Einholen fehlender Daten",
   "einfacherZeitaufwand": 5,
   "mittlererZeitaufwand": 10,
   "hoherZeitaufwand": 20
 },
 {
   "bezeichnung": "Inhaltliche Prüfung, Daten erfassen",
   "einfacherZeitaufwand": 8,
   "mittlererZeitaufwand": 60,
   "hoherZeitaufwand": 792
 },
 {
   "bezeichnung": "Berechnungen durchführen",
   "einfacherZeitaufwand": 9,
   "mittlererZeitaufwand": 120,
   "hoherZeitaufwand": null
 },
 {
   "bezeichnung": "Ergebnisse/Berechnungen überprüfen und ggf. korrigieren",
   "einfacherZeitaufwand": 4,
   "mittlererZeitaufwand": 60,
   "hoherZeitaufwand": 3.03
 },
 {
   "bezeichnung": "Interne Sitzungen",
   "einfacherZeitaufwand": 2,
   "mittlererZeitaufwand": 60,
   "hoherZeitaufwand": 2.12
 },
 {
   "bezeichnung": "Externe Sitzungen",
   "einfacherZeitaufwand": 5,
   "mittlererZeitaufwand": 60,
   "hoherZeitaufwand": 2.46
 },
 {
   "bezeichnung": "Daten übermitteln oder veröffentlichen",
   "einfacherZeitaufwand": 1,
   "mittlererZeitaufwand": 10,
   "hoherZeitaufwand": 60
 },
 {
   "bezeichnung": "Abschließende Informationen aufbereiten, Bescheid erstellen",
   "einfacherZeitaufwand": 5,
   "mittlererZeitaufwand": 60,
   "hoherZeitaufwand": 480
 },
 {
   "bezeichnung": "Zahlungen anweisen, annehmen oder überwachen",
   "einfacherZeitaufwand": 1,
   "mittlererZeitaufwand": 5,
   "hoherZeitaufwand": 18
 },
 {
   "bezeichnung": "Korrektur bzw. weitere Informationen bei Rückfragen vorlegen ",
   "einfacherZeitaufwand": 30,
   "mittlererZeitaufwand": 60,
   "hoherZeitaufwand": 120
 },
 {
   "bezeichnung": "Kopieren, archivieren, verteilen ",
   "einfacherZeitaufwand": 2,
   "mittlererZeitaufwand": 10,
   "hoherZeitaufwand": 20
 },
 {
   "bezeichnung": "Fortbildungen und Schulungen ",
   "einfacherZeitaufwand": 1,
   "mittlererZeitaufwand": 3,
   "hoherZeitaufwand": 480
 },
 {
   "bezeichnung": "Überwachungs- und Aufsichtsmaßnahmen ",
   "einfacherZeitaufwand": 8,
   "mittlererZeitaufwand": 207,
   "hoherZeitaufwand": 56.22
 },
 {
   "bezeichnung": "Beschaffen von Waren und Sachleistungen",
   "einfacherZeitaufwand": null,
   "mittlererZeitaufwand": null,
   "hoherZeitaufwand": null
 },
 {
   "bezeichnung": "Beschaffen von Dienstleistungen",
   "einfacherZeitaufwand": null,
   "mittlererZeitaufwand": null,
   "hoherZeitaufwand": null
 },
 {
   "bezeichnung": "Anpassen von internen Prozessen",
   "einfacherZeitaufwand": null,
   "mittlererZeitaufwand": null,
   "hoherZeitaufwand": null
 },
 {
   "bezeichnung": "Lagerhaltung",
   "einfacherZeitaufwand": null,
   "mittlererZeitaufwand": null,
   "hoherZeitaufwand": null
 },
 {
   "bezeichnung": "Wege- und Wartezeiten",
   "einfacherZeitaufwand": null,
   "mittlererZeitaufwand": null,
   "hoherZeitaufwand": null
 }
]