<svg xmlns="http://www.w3.org/2000/svg" viewBox="0 0 16 16">
  <defs>
    <style>
      .cls-1{fill:#fff}
    </style>
  </defs>
  <path fill="#fff" d="m9.41 8 6.3-6.29A1 1 0 1 0 14.29.29L8 6.59 1.71.29A1 1 0 0 0 .29 1.71L6.59 8l-6.3 6.29a1 1 0 0 0 0 1.42 1 1 0 0 0 1.42 0L8 9.41l6.29 6.3a1 1 0 0 0 1.42 0 1 1 0 0 0 0-1.42Z"/>
</svg>
