[
  {
    "xml-model": "href=\"..\/..\/..\/02_schema\/legalDocML.de\/legalDocML.de_schematron.sch\" schematypens=\"http:\/\/purl.oclc.org\/dsdl\/schematron\"",
    "children": [
      {
        "children": [
          {
            "children": [
              {
                "children": [
                  {
                    "children": [
                      {
                        "children": [
                          {
                            "children": [
                              {
                                "text": ""
                              }
                            ],
                            "type": "lea:textWrapper"
                          }
                        ],
                        "type": "akn:FRBRthis",
                        "value": "attributsemantik-noch-undefiniert"
                      },
                      {
                        "children": [
                          {
                            "children": [
                              {
                                "text": ""
                              }
                            ],
                            "type": "lea:textWrapper"
                          }
                        ],
                        "type": "akn:FRBRuri",
                        "value": "attributsemantik-noch-undefiniert"
                      },
                      {
                        "date": "1900-01-01",
                        "children": [
                          {
                            "children": [
                              {
                                "text": ""
                              }
                            ],
                            "type": "lea:textWrapper"
                          }
                        ],
                        "name": "attributsemantik-noch-undefiniert",
                        "type": "akn:FRBRdate"
                      },
                      {
                        "children": [
                          {
                            "children": [
                              {
                                "text": ""
                              }
                            ],
                            "type": "lea:textWrapper"
                          }
                        ],
                        "href": "attributsemantik-noch-undefiniert",
                        "type": "akn:FRBRauthor"
                      },
                      {
                        "children": [
                          {
                            "children": [
                              {
                                "text": ""
                              }
                            ],
                            "type": "lea:textWrapper"
                          }
                        ],
                        "type": "akn:FRBRcountry",
                        "value": "attributsemantik-noch-undefiniert"
                      },
                      {
                        "children": [
                          {
                            "children": [
                              {
                                "text": ""
                              }
                            ],
                            "type": "lea:textWrapper"
                          }
                        ],
                        "type": "akn:FRBRnumber",
                        "value": "attributsemantik-noch-undefiniert"
                      }
                    ],
                    "type": "akn:FRBRWork"
                  },
                  {
                    "children": [
                      {
                        "children": [
                          {
                            "children": [
                              {
                                "text": ""
                              }
                            ],
                            "type": "lea:textWrapper"
                          }
                        ],
                        "type": "akn:FRBRthis",
                        "value": "attributsemantik-noch-undefiniert"
                      },
                      {
                        "children": [
                          {
                            "children": [
                              {
                                "text": ""
                              }
                            ],
                            "type": "lea:textWrapper"
                          }
                        ],
                        "type": "akn:FRBRuri",
                        "value": "attributsemantik-noch-undefiniert"
                      },
                      {
                        "date": "1900-01-01",
                        "children": [
                          {
                            "children": [
                              {
                                "text": ""
                              }
                            ],
                            "type": "lea:textWrapper"
                          }
                        ],
                        "name": "attributsemantik-noch-undefiniert",
                        "type": "akn:FRBRdate"
                      },
                      {
                        "children": [
                          {
                            "children": [
                              {
                                "text": ""
                              }
                            ],
                            "type": "lea:textWrapper"
                          }
                        ],
                        "href": "attributsemantik-noch-undefiniert",
                        "type": "akn:FRBRauthor"
                      },
                      {
                        "children": [
                          {
                            "children": [
                              {
                                "text": ""
                              }
                            ],
                            "type": "lea:textWrapper"
                          }
                        ],
                        "type": "akn:FRBRversionNumber",
                        "value": "attributsemantik-noch-undefiniert"
                      },
                      {
                        "children": [
                          {
                            "children": [
                              {
                                "text": ""
                              }
                            ],
                            "type": "lea:textWrapper"
                          }
                        ],
                        "language": "DE",
                        "type": "akn:FRBRlanguage"
                      }
                    ],
                    "type": "akn:FRBRExpression"
                  },
                  {
                    "children": [
                      {
                        "children": [
                          {
                            "children": [
                              {
                                "text": ""
                              }
                            ],
                            "type": "lea:textWrapper"
                          }
                        ],
                        "type": "akn:FRBRthis",
                        "value": "attributsemantik-noch-undefiniert"
                      },
                      {
                        "children": [
                          {
                            "children": [
                              {
                                "text": ""
                              }
                            ],
                            "type": "lea:textWrapper"
                          }
                        ],
                        "type": "akn:FRBRuri",
                        "value": "attributsemantik-noch-undefiniert"
                      },
                      {
                        "date": "1900-01-01",
                        "children": [
                          {
                            "children": [
                              {
                                "text": ""
                              }
                            ],
                            "type": "lea:textWrapper"
                          }
                        ],
                        "name": "attributsemantik-noch-undefiniert",
                        "type": "akn:FRBRdate"
                      },
                      {
                        "children": [
                          {
                            "children": [
                              {
                                "text": ""
                              }
                            ],
                            "type": "lea:textWrapper"
                          }
                        ],
                        "href": "attributsemantik-noch-undefiniert",
                        "type": "akn:FRBRauthor"
                      }
                    ],
                    "type": "akn:FRBRManifestation"
                  }
                ],
                "source": "attributsemantik-noch-undefiniert",
                "type": "akn:identification"
              },
              {
                "children": [
                  {
                    "children": [
                      {
                        "children": [
                          {
                            "children": [
                              {
                                "text": "gesetz"
                              }
                            ],
                            "type": "lea:textWrapper"
                          }
                        ],
                        "type": "meta:typ"
                      },
                      {
                        "children": [
                          {
                            "children": [
                              {
                                "text": "stammform"
                              }
                            ],
                            "type": "lea:textWrapper"
                          }
                        ],
                        "type": "meta:form"
                      },
                      {
                        "children": [
                          {
                            "children": [
                              {
                                "text": "entwurfsfassung"
                              }
                            ],
                            "type": "lea:textWrapper"
                          }
                        ],
                        "type": "meta:fassung"
                      },
                      {
                        "children": [
                          {
                            "children": [
                              {
                                "text": "begruendung"
                              }
                            ],
                            "type": "lea:textWrapper"
                          }
                        ],
                        "type": "meta:art"
                      },
                      {
                        "children": [
                          {
                            "children": [
                              {
                                "text": "bundesregierung"
                              }
                            ],
                            "type": "lea:textWrapper"
                          }
                        ],
                        "type": "meta:initiant"
                      },
                      {
                        "children": [
                          {
                            "children": [
                              {
                                "text": "bundesregierung"
                              }
                            ],
                            "type": "lea:textWrapper"
                          }
                        ],
                        "type": "meta:bearbeitendeInstitution"
                      }
                    ],
                    "type": "meta:legalDocML.de_metadaten",
                    "xmlns:meta": "http:\/\/Metadaten.LegalDocML.de"
                  }
                ],
                "source": "attributsemantik-noch-undefiniert",
                "type": "akn:proprietary"
              }
            ],
            "type": "akn:meta"
          },
          {
            "children": [
              {
                "children": [
                  {
                    "children": [
                      {
                        "children": [
                          {
                            "text": "Begründung"
                          }
                        ],
                        "type": "lea:textWrapper"
                      }
                    ],
                    "type": "akn:p"
                  }
                ],
                "type": "akn:longTitle"
              }
            ],
            "type": "akn:preface"
          },
          {
            "children": [
              {
                "refersTo": "begruendung-allgemeiner-teil",
                "children": [
                  {
                    "children": [
                      {
                        "children": [
                          {
                            "text": "A."
                          }
                        ],
                        "type": "lea:textWrapper"
                      }
                    ],
                    "type": "akn:num"
                  },
                  {
                    "children": [
                      {
                        "children": [
                          {
                            "text": "Allgemeiner Teil"
                          }
                        ],
                        "type": "lea:textWrapper"
                      }
                    ],
                    "type": "akn:heading"
                  },
                  {
                    "refersTo": "begruendungsabschnitt-zielsetzung-und-notwendigkeit",
                    "children": [
                      {
                        "children": [
                          {
                            "children": [
                              {
                                "text": "I."
                              }
                            ],
                            "type": "lea:textWrapper"
                          }
                        ],
                        "type": "akn:num"
                      },
                      {
                        "children": [
                          {
                            "children": [
                              {
                                "text": "Zielsetzung und Notwendigkeit der Regelungen"
                              }
                            ],
                            "type": "lea:textWrapper"
                          }
                        ],
                        "type": "akn:heading"
                      },
                      {
                        "children": [
                          {
                            "children": [
                              {
                                "children": [
                                  {
                                    "text": "[Platzhalter]"
                                  }
                                ],
                                "type": "lea:textWrapper"
                              }
                            ],
                            "type": "akn:p"
                          }
                        ],
                        "type": "akn:content"
                      }
                    ],
                    "name": "attributsemantik-noch-undefiniert",
                    "type": "akn:hcontainer"
                  },
                  {
                    "refersTo": "begruendungsabschnitt-wesentlicher-inhalt",
                    "children": [
                      {
                        "children": [
                          {
                            "children": [
                              {
                                "text": "II."
                              }
                            ],
                            "type": "lea:textWrapper"
                          }
                        ],
                        "type": "akn:num"
                      },
                      {
                        "children": [
                          {
                            "children": [
                              {
                                "text": "Wesentlicher Inhalt des Entwurfs"
                              }
                            ],
                            "type": "lea:textWrapper"
                          }
                        ],
                        "type": "akn:heading"
                      },
                      {
                        "children": [
                          {
                            "children": [
                              {
                                "children": [
                                  {
                                    "text": "[Platzhalter]"
                                  }
                                ],
                                "type": "lea:textWrapper"
                              }
                            ],
                            "type": "akn:p"
                          }
                        ],
                        "type": "akn:content"
                      }
                    ],
                    "name": "attributsemantik-noch-undefiniert",
                    "type": "akn:hcontainer"
                  },
                  {
                    "refersTo": "begruendungsabschnitt-alternativen",
                    "children": [
                      {
                        "children": [
                          {
                            "children": [
                              {
                                "text": "III."
                              }
                            ],
                            "type": "lea:textWrapper"
                          }
                        ],
                        "type": "akn:num"
                      },
                      {
                        "children": [
                          {
                            "children": [
                              {
                                "text": "Alternativen"
                              }
                            ],
                            "type": "lea:textWrapper"
                          }
                        ],
                        "type": "akn:heading"
                      },
                      {
                        "children": [
                          {
                            "children": [
                              {
                                "children": [
                                  {
                                    "text": "[Platzhalter]"
                                  }
                                ],
                                "type": "lea:textWrapper"
                              }
                            ],
                            "type": "akn:p"
                          }
                        ],
                        "type": "akn:content"
                      }
                    ],
                    "name": "attributsemantik-noch-undefiniert",
                    "type": "akn:hcontainer"
                  },
                  {
                    "refersTo": "begruendungsabschnitt-regelungskompetenz",
                    "children": [
                      {
                        "children": [
                          {
                            "children": [
                              {
                                "text": "IV."
                              }
                            ],
                            "type": "lea:textWrapper"
                          }
                        ],
                        "type": "akn:num"
                      },
                      {
                        "children": [
                          {
                            "children": [
                              {
                                "text": "Gesetzgebungskompetenz"
                              }
                            ],
                            "type": "lea:textWrapper"
                          }
                        ],
                        "type": "akn:heading"
                      },
                      {
                        "children": [
                          {
                            "children": [
                              {
                                "children": [
                                  {
                                    "text": "[Platzhalter]"
                                  }
                                ],
                                "type": "lea:textWrapper"
                              }
                            ],
                            "type": "akn:p"
                          }
                        ],
                        "type": "akn:content"
                      }
                    ],
                    "name": "attributsemantik-noch-undefiniert",
                    "type": "akn:hcontainer"
                  },
                  {
                    "refersTo": "begruendungsabschnitt-vereinbarkeit",
                    "children": [
                      {
                        "children": [
                          {
                            "children": [
                              {
                                "text": "V."
                              }
                            ],
                            "type": "lea:textWrapper"
                          }
                        ],
                        "type": "akn:num"
                      },
                      {
                        "children": [
                          {
                            "children": [
                              {
                                "text": "Vereinbarkeit mit dem Recht der Europäischen Union und völkerrechtlichen Verträgen"
                              }
                            ],
                            "type": "lea:textWrapper"
                          }
                        ],
                        "type": "akn:heading"
                      },
                      {
                        "children": [
                          {
                            "children": [
                              {
                                "children": [
                                  {
                                    "text": "[Platzhalter]"
                                  }
                                ],
                                "type": "lea:textWrapper"
                              }
                            ],
                            "type": "akn:p"
                          }
                        ],
                        "type": "akn:content"
                      }
                    ],
                    "name": "attributsemantik-noch-undefiniert",
                    "type": "akn:hcontainer"
                  },
                  {
                    "refersTo": "begruendungsabschnitt-regelungsfolgen",
                    "children": [
                      {
                        "children": [
                          {
                            "children": [
                              {
                                "text": "VI."
                              }
                            ],
                            "type": "lea:textWrapper"
                          }
                        ],
                        "type": "akn:num"
                      },
                      {
                        "children": [
                          {
                            "children": [
                              {
                                "text": "Gesetzesfolgen"
                              }
                            ],
                            "type": "lea:textWrapper"
                          }
                        ],
                        "type": "akn:heading"
                      },
                      {
                        "children": [
                          {
                            "refersTo": "regelungsfolgen-abschnitt-rechts-und-verwaltungsvereinfachung",
                            "children": [
                              {
                                "children": [
                                  {
                                    "children": [
                                      {
                                        "text": "1."
                                      }
                                    ],
                                    "type": "lea:textWrapper"
                                  }
                                ],
                                "type": "akn:num"
                              },
                              {
                                "children": [
                                  {
                                    "children": [
                                      {
                                        "text": "Rechts- und Verwaltungsvereinfachung"
                                      }
                                    ],
                                    "type": "lea:textWrapper"
                                  }
                                ],
                                "type": "akn:heading"
                              },
                              {
                                "children": [
                                  {
                                    "children": [
                                      {
                                        "text": "[Platzhalter]"
                                      }
                                    ],
                                    "type": "lea:textWrapper"
                                  }
                                ],
                                "type": "akn:p"
                              }
                            ],
                            "type": "akn:tblock"
                          },
                          {
                            "refersTo": "regelungsfolgen-abschnitt-nachhaltigkeitsaspekte",
                            "children": [
                              {
                                "children": [
                                  {
                                    "children": [
                                      {
                                        "text": "2."
                                      }
                                    ],
                                    "type": "lea:textWrapper"
                                  }
                                ],
                                "type": "akn:num"
                              },
                              {
                                "children": [
                                  {
                                    "children": [
                                      {
                                        "text": "Nachhaltigkeitsaspekte"
                                      }
                                    ],
                                    "type": "lea:textWrapper"
                                  }
                                ],
                                "type": "akn:heading"
                              },
                              {
                                "children": [
                                  {
                                    "children": [
                                      {
                                        "text": "[Platzhalter]"
                                      }
                                    ],
                                    "type": "lea:textWrapper"
                                  }
                                ],
                                "type": "akn:p"
                              }
                            ],
                            "type": "akn:tblock"
                          },
                          {
                            "refersTo": "regelungsfolgen-abschnitt-haushaltsausgaben-ohne-erfuellungsaufwand",
                            "children": [
                              {
                                "children": [
                                  {
                                    "children": [
                                      {
                                        "text": "3."
                                      }
                                    ],
                                    "type": "lea:textWrapper"
                                  }
                                ],
                                "type": "akn:num"
                              },
                              {
                                "children": [
                                  {
                                    "children": [
                                      {
                                        "text": "Haushaltsausgaben ohne Erfüllungsaufwand"
                                      }
                                    ],
                                    "type": "lea:textWrapper"
                                  }
                                ],
                                "type": "akn:heading"
                              },
                              {
                                "children": [
                                  {
                                    "children": [
                                      {
                                        "text": "[Platzhalter]"
                                      }
                                    ],
                                    "type": "lea:textWrapper"
                                  }
                                ],
                                "type": "akn:p"
                              }
                            ],
                            "type": "akn:tblock"
                          },
                          {
                            "refersTo": "regelungsfolgen-abschnitt-erfuellungsaufwand",
                            "children": [
                              {
                                "children": [
                                  {
                                    "children": [
                                      {
                                        "text": "4."
                                      }
                                    ],
                                    "type": "lea:textWrapper"
                                  }
                                ],
                                "type": "akn:num"
                              },
                              {
                                "children": [
                                  {
                                    "children": [
                                      {
                                        "text": "Erfüllungsaufwand"
                                      }
                                    ],
                                    "type": "lea:textWrapper"
                                  }
                                ],
                                "type": "akn:heading"
                              },
                              {
                                "children": [
                                  {
                                    "children": [
                                      {
                                        "text": "[Platzhalter]"
                                      }
                                    ],
                                    "type": "lea:textWrapper"
                                  }
                                ],
                                "type": "akn:p"
                              }
                            ],
                            "type": "akn:tblock"
                          },
                          {
                            "refersTo": "regelungsfolgen-abschnitt-weitere-kosten",
                            "children": [
                              {
                                "children": [
                                  {
                                    "children": [
                                      {
                                        "text": "5."
                                      }
                                    ],
                                    "type": "lea:textWrapper"
                                  }
                                ],
                                "type": "akn:num"
                              },
                              {
                                "children": [
                                  {
                                    "children": [
                                      {
                                        "text": "Weitere Kosten"
                                      }
                                    ],
                                    "type": "lea:textWrapper"
                                  }
                                ],
                                "type": "akn:heading"
                              },
                              {
                                "children": [
                                  {
                                    "children": [
                                      {
                                        "text": "[Platzhalter]"
                                      }
                                    ],
                                    "type": "lea:textWrapper"
                                  }
                                ],
                                "type": "akn:p"
                              }
                            ],
                            "type": "akn:tblock"
                          },
                          {
                            "refersTo": "regelungsfolgen-abschnitt-gleichstellungspolitische-relevanzpruefung",
                            "children": [
                              {
                                "children": [
                                  {
                                    "children": [
                                      {
                                        "text": "6."
                                      }
                                    ],
                                    "type": "lea:textWrapper"
                                  }
                                ],
                                "type": "akn:num"
                              },
                              {
                                "children": [
                                  {
                                    "children": [
                                      {
                                        "text": "Gleichstellungspolitische Relevanzprüfung"
                                      }
                                    ],
                                    "type": "lea:textWrapper"
                                  }
                                ],
                                "type": "akn:heading"
                              },
                              {
                                "children": [
                                  {
                                    "children": [
                                      {
                                        "text": "[Platzhalter]"
                                      }
                                    ],
                                    "type": "lea:textWrapper"
                                  }
                                ],
                                "type": "akn:p"
                              }
                            ],
                            "type": "akn:tblock"
                          }
                        ],
                        "type": "akn:content"
                      }
                    ],
                    "name": "attributsemantik-noch-undefiniert",
                    "type": "akn:hcontainer"
                  },
                  {
                    "refersTo": "begruendungsabschnitt-befristung-evaluierung",
                    "children": [
                      {
                        "children": [
                          {
                            "children": [
                              {
                                "text": "VII."
                              }
                            ],
                            "type": "lea:textWrapper"
                          }
                        ],
                        "type": "akn:num"
                      },
                      {
                        "children": [
                          {
                            "children": [
                              {
                                "text": "Befristung; Evaluierung"
                              }
                            ],
                            "type": "lea:textWrapper"
                          }
                        ],
                        "type": "akn:heading"
                      },
                      {
                        "children": [
                          {
                            "children": [
                              {
                                "children": [
                                  {
                                    "text": "[Platzhalter]"
                                  }
                                ],
                                "type": "lea:textWrapper"
                              }
                            ],
                            "type": "akn:p"
                          }
                        ],
                        "type": "akn:content"
                      }
                    ],
                    "name": "attributsemantik-noch-undefiniert",
                    "type": "akn:hcontainer"
                  }
                ],
                "name": "attributsemantik-noch-undefiniert",
                "type": "akn:hcontainer"
              },
              {
                "refersTo": "begruendung-besonderer-teil",
                "children": [
                  {
                    "children": [
                      {
                        "children": [
                          {
                            "text": "B."
                          }
                        ],
                        "type": "lea:textWrapper"
                      }
                    ],
                    "type": "akn:num"
                  },
                  {
                    "children": [
                      {
                        "children": [
                          {
                            "text": "Besonderer Teil"
                          }
                        ],
                        "type": "lea:textWrapper"
                      }
                    ],
                    "type": "akn:heading"
                  },
                  {
                    "refersTo": "begruendungsabschnitt-regelungstext",
                    "children": [
                      {
                        "children": [
                          {
                            "children": [
                              {
                                "text": "Zu "
                              }
                            ],
                            "type": "lea:textWrapper"
                          },
                          {
                            "children": [
                              {
                                "children": [
                                  {
                                    "text": "§ [Platzhalter]"
                                  }
                                ],
                                "type": "lea:textWrapper"
                              }
                            ],
                            "href": "",
                            "type": "akn:ref"
                          }
                        ],
                        "type": "akn:heading"
                      },
                      {
                        "children": [
                          {
                            "children": [
                              {
                                "children": [
                                  {
                                    "text": "[Platzhalter]"
                                  }
                                ],
                                "type": "lea:textWrapper"
                              }
                            ],
                            "type": "akn:p"
                          }
                        ],
                        "type": "akn:content"
                      }
                    ],
                    "name": "attributsemantik-noch-undefiniert",
                    "type": "akn:hcontainer"
                  }
                ],
                "name": "attributsemantik-noch-undefiniert",
                "type": "akn:hcontainer"
              }
            ],
            "type": "akn:mainBody"
          }
        ],
        "name": "begruendung",
        "type": "akn:doc"
      }
    ],
    "xml-stylesheet": "href=\"stylesheets\/css\/main.min.css\"",
    "xsi:schemaLocation": "http:\/\/docs.oasis-open.org\/legaldocml\/ns\/akn\/3.0 schema\/legalDocML.de\/legalDocML.de-begruendung.xsd                                     http:\/\/Metadaten.LegalDocML.de schema\/metadaten\/legalDocML.de-metadatenSchema.xsd",
    "xmlns:xsi": "http:\/\/www.w3.org\/2001\/XMLSchema-instance",
    "type": "akn:akomaNtoso",
    "xmlns:akn": "http:\/\/docs.oasis-open.org\/legaldocml\/ns\/akn\/3.0"
  }
]