{  
    "SIEM": {  
        "user":     "<Service-Account für Elastic API>",
        "password": "<Passwort für Service-Account>",
        "url":      "https://<Elasticsearch-FQDN>:9200/_count?expand_wildcards=all&q=",
		"filter": {
			"abgw_schadprogramm":		"<Relevante Count-Abfrage>+AND+@timestamp:[now-30d+TO+now]",
			"inst_schadprogramm":		"<Relevante Count-Abfrage>+AND+@timestamp:[now-30d+TO+now]",	
			"systemeinbruch":			"<Relevante Count-Abfrage>+AND+@timestamp:[now-30d+TO+now]",	
			"systemnutzung":			"<Relevante Count-Abfrage>+AND+@timestamp:[now-30d+TO+now]",		
			"datenabfluss":				"<Relevante Count-Abfrage>+AND+@timestamp:[now-30d+TO+now]",	
			"manipulation":				"<Relevante Count-Abfrage>+AND+@timestamp:[now-30d+TO+now]",
			"ddos":						"<Relevante Count-Abfrage>+AND+@timestamp:[now-30d+TO+now]",
			"it-system":				"<Relevante Count-Abfrage>+AND+@timestamp:[now-30d+TO+now]",
			"datentraeger":				"<Relevante Count-Abfrage>+AND+@timestamp:[now-30d+TO+now]",
			"entsorgung":				"<Relevante Count-Abfrage>+AND+@timestamp:[now-30d+TO+now]",
			"offenlegung":				"<Relevante Count-Abfrage>+AND+@timestamp:[now-30d+TO+now]",
			"sicherheitsluecke":		"<Relevante Count-Abfrage>+AND+@timestamp:[now-30d+TO+now]",
			"ausfall":					"<Relevante Count-Abfrage>+AND+@timestamp:[now-30d+TO+now]",
			"fehlfunktion":				"<Relevante Count-Abfrage>+AND+@timestamp:[now-30d+TO+now]",
			"uerberlast":				"<Relevante Count-Abfrage>+AND+@timestamp:[now-30d+TO+now]",
			"widerrrechtliche_aktion":	"<Relevante Count-Abfrage>+AND+@timestamp:[now-30d+TO+now]",
			"interne_ursachen":			"<Relevante Count-Abfrage>+AND+@timestamp:[now-30d+TO+now]",	
			"naturgewalten":			"<Relevante Count-Abfrage>+AND+@timestamp:[now-30d+TO+now]",	
			"beschaedigung":			"<Relevante Count-Abfrage>+AND+@timestamp:[now-30d+TO+now]",
			"erkenntnisse":				"<Relevante Count-Abfrage>+AND+@timestamp:[now-30d+TO+now]"
				}
			},
	"BSI": {
		"user":						"<Account des MIP-Portals>",
		"password":					"<Passwort für Portal-Account>",
		"authentification-url": 	"https://mip2.bsi.bund.de/authentifizierung/api/token/",
		"submit-url":           	"https://mip2.bsi.bund.de/api/submissionprocess/submit_report/",
		"type_of_report":					"first",
		"previous_submission_id":			"-",
		"first_submission_id":				"-",
		"form_id":							69,
		"institution":						"<ID der Institution aus dem Meldeportal>",
		"values": {
			"einstufung":						"Offen",
			"organisation":						"Chancenministerium",
			"vorname_meldender":				"Maximiliane",
			"name_meldender":					"Musterfrau",
			"erreichbarkeit_email":				"maximiliane.musterfrau@example.com",
			"erreichbarkeit_telefon":			"+49 123 456 789",
			"rueckfragen_email":				"rueckfragen@example.com,
			"rueckfragen_telefon":				"+49 123 456 000",
			"meldender_gleich_betroffener":		"Ja",
			"betroffene_behoerde":				"",
			"weiterleitung":					"weiterleitung@example.com",
			"art_der_meldung":					"Regul\u00E4re Meldung",
			"berichtszeitraum":					"Wird in Skript aktualisiert",
			"abgw_schadprogramm_details":		"<Fakultative Detailangaben>",
			"inst_schadprogramm_details":		"<Fakultative Detailangaben>",
			"systemeinbruch_details":			"<Fakultative Detailangaben>",
			"systemnutzung_details":			"<Fakultative Detailangaben>",
			"datenabfluss_details":				"<Fakultative Detailangaben>",
			"manipulation_details":				"<Fakultative Detailangaben>",
			"ddos_details":						"<Fakultative Detailangaben>",
			"it-system_details":				"<Fakultative Detailangaben>",
			"datentraeger_details":				"<Fakultative Detailangaben>",
			"entsorgung_details":				"<Fakultative Detailangaben>",
			"offenlegung_details":				"<Fakultative Detailangaben>",
			"sicherheitsluecke_details":		"<Fakultative Detailangaben>",
			"ausfall_details":					"<Fakultative Detailangaben>",
			"fehlfunktion_details":				"<Fakultative Detailangaben>",
			"uerberlast_details":				"<Fakultative Detailangaben>",
			"widerrrechtliche_aktion_details":	"<Fakultative Detailangaben>",
			"interne_ursachen_details":			"<Fakultative Detailangaben>",
			"naturgewalten_details":			"<Fakultative Detailangaben>",
			"beschaedigung_details":			"<Fakultative Detailangaben>",
			"erkenntnisse_details":				"<Fakultative Detailangaben>",
			"sonstiges":						"<Fakultative Detailangaben>"
		}

			}  
}
